You are viewing a plain text version of this content. The canonical link for it is here.
Posted to dev@kafka.apache.org by Apache Jenkins Server <je...@builds.apache.org> on 2019/07/05 21:50:10 UTC
Build failed in Jenkins: kafka-trunk-jdk11 #678
See <https://builds.apache.org/job/kafka-trunk-jdk11/678/display/redirect?page=changes>
Changes:
[github] MINOR: Remove zkclient dependency (#7036)
------------------------------------------
[...truncated 6.47 MB...]
org.apache.kafka.streams.scala.WordCountTest > testShouldCountWords STARTED
org.apache.kafka.streams.scala.WordCountTest > testShouldCountWords PASSED
org.apache.kafka.streams.scala.kstream.ProducedTest > Create a Produced should create a Produced with Serdes STARTED
org.apache.kafka.streams.scala.kstream.ProducedTest > Create a Produced should create a Produced with Serdes PASSED
org.apache.kafka.streams.scala.kstream.ProducedTest > Create a Produced with timestampExtractor and resetPolicy should create a Consumed with Serdes, timestampExtractor and resetPolicy STARTED
org.apache.kafka.streams.scala.kstream.ProducedTest > Create a Produced with timestampExtractor and resetPolicy should create a Consumed with Serdes, timestampExtractor and resetPolicy PASSED
org.apache.kafka.streams.scala.kstream.GroupedTest > Create a Grouped should create a Grouped with Serdes STARTED
org.apache.kafka.streams.scala.kstream.GroupedTest > Create a Grouped should create a Grouped with Serdes PASSED
org.apache.kafka.streams.scala.kstream.GroupedTest > Create a Grouped with repartition topic name should create a Grouped with Serdes, and repartition topic name STARTED
org.apache.kafka.streams.scala.kstream.GroupedTest > Create a Grouped with repartition topic name should create a Grouped with Serdes, and repartition topic name PASSED
org.apache.kafka.streams.scala.kstream.JoinedTest > Create a Joined should create a Joined with Serdes STARTED
org.apache.kafka.streams.scala.kstream.JoinedTest > Create a Joined should create a Joined with Serdes PASSED
org.apache.kafka.streams.scala.kstream.JoinedTest > Create a Joined should create a Joined with Serdes and repartition topic name STARTED
org.apache.kafka.streams.scala.kstream.JoinedTest > Create a Joined should create a Joined with Serdes and repartition topic name PASSED
org.apache.kafka.streams.scala.kstream.SuppressedTest > Suppressed.untilWindowCloses should produce the correct suppression STARTED
org.apache.kafka.streams.scala.kstream.SuppressedTest > Suppressed.untilWindowCloses should produce the correct suppression PASSED
org.apache.kafka.streams.scala.kstream.SuppressedTest > Suppressed.untilTimeLimit should produce the correct suppression STARTED
org.apache.kafka.streams.scala.kstream.SuppressedTest > Suppressed.untilTimeLimit should produce the correct suppression PASSED
org.apache.kafka.streams.scala.kstream.SuppressedTest > BufferConfig.maxRecords should produce the correct buffer config STARTED
org.apache.kafka.streams.scala.kstream.SuppressedTest > BufferConfig.maxRecords should produce the correct buffer config PASSED
org.apache.kafka.streams.scala.kstream.SuppressedTest > BufferConfig.maxBytes should produce the correct buffer config STARTED
org.apache.kafka.streams.scala.kstream.SuppressedTest > BufferConfig.maxBytes should produce the correct buffer config PASSED
org.apache.kafka.streams.scala.kstream.SuppressedTest > BufferConfig.unbounded should produce the correct buffer config STARTED
org.apache.kafka.streams.scala.kstream.SuppressedTest > BufferConfig.unbounded should produce the correct buffer config PASSED
org.apache.kafka.streams.scala.kstream.SuppressedTest > BufferConfig should support very long chains of factory methods STARTED
org.apache.kafka.streams.scala.kstream.SuppressedTest > BufferConfig should support very long chains of factory methods PASSED
org.apache.kafka.streams.scala.kstream.MaterializedTest > Create a Materialized should create a Materialized with Serdes STARTED
org.apache.kafka.streams.scala.kstream.MaterializedTest > Create a Materialized should create a Materialized with Serdes PASSED
org.apache.kafka.streams.scala.kstream.MaterializedTest > Create a Materialize with a store name should create a Materialized with Serdes and a store name STARTED
org.apache.kafka.streams.scala.kstream.MaterializedTest > Create a Materialize with a store name should create a Materialized with Serdes and a store name PASSED
org.apache.kafka.streams.scala.kstream.MaterializedTest > Create a Materialize with a window store supplier should create a Materialized with Serdes and a store supplier STARTED
org.apache.kafka.streams.scala.kstream.MaterializedTest > Create a Materialize with a window store supplier should create a Materialized with Serdes and a store supplier PASSED
org.apache.kafka.streams.scala.kstream.MaterializedTest > Create a Materialize with a key value store supplier should create a Materialized with Serdes and a store supplier STARTED
org.apache.kafka.streams.scala.kstream.MaterializedTest > Create a Materialize with a key value store supplier should create a Materialized with Serdes and a store supplier PASSED
org.apache.kafka.streams.scala.kstream.MaterializedTest > Create a Materialize with a session store supplier should create a Materialized with Serdes and a store supplier STARTED
org.apache.kafka.streams.scala.kstream.MaterializedTest > Create a Materialize with a session store supplier should create a Materialized with Serdes and a store supplier PASSED
org.apache.kafka.streams.scala.kstream.KTableTest > filter a KTable should filter records satisfying the predicate STARTED
org.apache.kafka.streams.scala.kstream.KTableTest > filter a KTable should filter records satisfying the predicate PASSED
org.apache.kafka.streams.scala.kstream.KTableTest > filterNot a KTable should filter records not satisfying the predicate STARTED
org.apache.kafka.streams.scala.kstream.KTableTest > filterNot a KTable should filter records not satisfying the predicate PASSED
org.apache.kafka.streams.scala.kstream.KTableTest > join 2 KTables should join correctly records STARTED
org.apache.kafka.streams.scala.kstream.KTableTest > join 2 KTables should join correctly records PASSED
org.apache.kafka.streams.scala.kstream.KTableTest > join 2 KTables with a Materialized should join correctly records and state store STARTED
org.apache.kafka.streams.scala.kstream.KTableTest > join 2 KTables with a Materialized should join correctly records and state store PASSED
org.apache.kafka.streams.scala.kstream.KTableTest > windowed KTable#suppress should correctly suppress results using Suppressed.untilTimeLimit STARTED
org.apache.kafka.streams.scala.kstream.KTableTest > windowed KTable#suppress should correctly suppress results using Suppressed.untilTimeLimit PASSED
org.apache.kafka.streams.scala.kstream.KTableTest > windowed KTable#suppress should correctly suppress results using Suppressed.untilWindowCloses STARTED
org.apache.kafka.streams.scala.kstream.KTableTest > windowed KTable#suppress should correctly suppress results using Suppressed.untilWindowCloses PASSED
org.apache.kafka.streams.scala.kstream.KTableTest > session windowed KTable#suppress should correctly suppress results using Suppressed.untilWindowCloses STARTED
org.apache.kafka.streams.scala.kstream.KTableTest > session windowed KTable#suppress should correctly suppress results using Suppressed.untilWindowCloses PASSED
org.apache.kafka.streams.scala.kstream.KTableTest > non-windowed KTable#suppress should correctly suppress results using Suppressed.untilTimeLimit STARTED
org.apache.kafka.streams.scala.kstream.KTableTest > non-windowed KTable#suppress should correctly suppress results using Suppressed.untilTimeLimit PASSED
org.apache.kafka.streams.scala.kstream.KStreamTest > filter a KStream should filter records satisfying the predicate STARTED
org.apache.kafka.streams.scala.kstream.KStreamTest > filter a KStream should filter records satisfying the predicate PASSED
org.apache.kafka.streams.scala.kstream.KStreamTest > filterNot a KStream should filter records not satisfying the predicate STARTED
org.apache.kafka.streams.scala.kstream.KStreamTest > filterNot a KStream should filter records not satisfying the predicate PASSED
org.apache.kafka.streams.scala.kstream.KStreamTest > foreach a KStream should run foreach actions on records STARTED
org.apache.kafka.streams.scala.kstream.KStreamTest > foreach a KStream should run foreach actions on records PASSED
org.apache.kafka.streams.scala.kstream.KStreamTest > peek a KStream should run peek actions on records STARTED
org.apache.kafka.streams.scala.kstream.KStreamTest > peek a KStream should run peek actions on records PASSED
org.apache.kafka.streams.scala.kstream.KStreamTest > selectKey a KStream should select a new key STARTED
org.apache.kafka.streams.scala.kstream.KStreamTest > selectKey a KStream should select a new key PASSED
org.apache.kafka.streams.scala.kstream.KStreamTest > join 2 KStreams should join correctly records STARTED
org.apache.kafka.streams.scala.kstream.KStreamTest > join 2 KStreams should join correctly records PASSED
org.apache.kafka.streams.scala.kstream.ConsumedTest > Create a Consumed should create a Consumed with Serdes STARTED
org.apache.kafka.streams.scala.kstream.ConsumedTest > Create a Consumed should create a Consumed with Serdes PASSED
org.apache.kafka.streams.scala.kstream.ConsumedTest > Create a Consumed with timestampExtractor and resetPolicy should create a Consumed with Serdes, timestampExtractor and resetPolicy STARTED
org.apache.kafka.streams.scala.kstream.ConsumedTest > Create a Consumed with timestampExtractor and resetPolicy should create a Consumed with Serdes, timestampExtractor and resetPolicy PASSED
org.apache.kafka.streams.scala.kstream.ConsumedTest > Create a Consumed with timestampExtractor should create a Consumed with Serdes and timestampExtractor STARTED
org.apache.kafka.streams.scala.kstream.ConsumedTest > Create a Consumed with timestampExtractor should create a Consumed with Serdes and timestampExtractor PASSED
org.apache.kafka.streams.scala.kstream.ConsumedTest > Create a Consumed with resetPolicy should create a Consumed with Serdes and resetPolicy STARTED
org.apache.kafka.streams.scala.kstream.ConsumedTest > Create a Consumed with resetPolicy should create a Consumed with Serdes and resetPolicy PASSED
org.apache.kafka.streams.scala.TopologyTest > shouldBuildIdenticalTopologyInJavaNScalaJoin STARTED
org.apache.kafka.streams.scala.TopologyTest > shouldBuildIdenticalTopologyInJavaNScalaJoin PASSED
org.apache.kafka.streams.scala.TopologyTest > shouldBuildIdenticalTopologyInJavaNScalaSimple STARTED
org.apache.kafka.streams.scala.TopologyTest > shouldBuildIdenticalTopologyInJavaNScalaSimple PASSED
org.apache.kafka.streams.scala.TopologyTest > shouldBuildIdenticalTopologyInJavaNScalaAggregate STARTED
org.apache.kafka.streams.scala.TopologyTest > shouldBuildIdenticalTopologyInJavaNScalaAggregate PASSED
org.apache.kafka.streams.scala.TopologyTest > shouldBuildIdenticalTopologyInJavaNScalaProperties STARTED
org.apache.kafka.streams.scala.TopologyTest > shouldBuildIdenticalTopologyInJavaNScalaProperties PASSED
org.apache.kafka.streams.scala.TopologyTest > shouldBuildIdenticalTopologyInJavaNScalaTransform STARTED
org.apache.kafka.streams.scala.TopologyTest > shouldBuildIdenticalTopologyInJavaNScalaTransform PASSED
org.apache.kafka.streams.scala.StreamToTableJoinScalaIntegrationTestImplicitSerdes > testShouldCountClicksPerRegionWithNamedRepartitionTopic STARTED
org.apache.kafka.streams.scala.StreamToTableJoinScalaIntegrationTestImplicitSerdes > testShouldCountClicksPerRegionWithNamedRepartitionTopic PASSED
org.apache.kafka.streams.scala.StreamToTableJoinScalaIntegrationTestImplicitSerdes > testShouldCountClicksPerRegionJava STARTED
org.apache.kafka.streams.scala.StreamToTableJoinScalaIntegrationTestImplicitSerdes > testShouldCountClicksPerRegionJava PASSED
org.apache.kafka.streams.scala.StreamToTableJoinScalaIntegrationTestImplicitSerdes > testShouldCountClicksPerRegion STARTED
org.apache.kafka.streams.scala.StreamToTableJoinScalaIntegrationTestImplicitSerdes > testShouldCountClicksPerRegion PASSED
> Task :streams:examples:test
org.apache.kafka.streams.examples.wordcount.WordCountProcessorTest > test STARTED
org.apache.kafka.streams.examples.wordcount.WordCountProcessorTest > test PASSED
> Task :log4j-appender:test
org.apache.kafka.log4jappender.KafkaLog4jAppenderTest > testLog4jAppendsWithSyncSendWithoutIgnoringExceptionsShouldNotThrowException STARTED
org.apache.kafka.log4jappender.KafkaLog4jAppenderTest > testLog4jAppendsWithSyncSendWithoutIgnoringExceptionsShouldNotThrowException PASSED
org.apache.kafka.log4jappender.KafkaLog4jAppenderTest > testLog4jAppendsWithRealProducerConfigWithSyncSendAndNotIgnoringExceptionsShouldThrowException STARTED
org.apache.kafka.log4jappender.KafkaLog4jAppenderTest > testLog4jAppendsWithRealProducerConfigWithSyncSendAndNotIgnoringExceptionsShouldThrowException PASSED
org.apache.kafka.log4jappender.KafkaLog4jAppenderTest > testLog4jAppends STARTED
org.apache.kafka.log4jappender.KafkaLog4jAppenderTest > testLog4jAppends PASSED
org.apache.kafka.log4jappender.KafkaLog4jAppenderTest > testSetSaslMechanism STARTED
org.apache.kafka.log4jappender.KafkaLog4jAppenderTest > testSetSaslMechanism PASSED
org.apache.kafka.log4jappender.KafkaLog4jAppenderTest > testJaasConfigNotSet STARTED
org.apache.kafka.log4jappender.KafkaLog4jAppenderTest > testJaasConfigNotSet PASSED
org.apache.kafka.log4jappender.KafkaLog4jAppenderTest > testKafkaLog4jConfigs STARTED
org.apache.kafka.log4jappender.KafkaLog4jAppenderTest > testKafkaLog4jConfigs PASSED
org.apache.kafka.log4jappender.KafkaLog4jAppenderTest > testLog4jAppendsWithSyncSendAndSimulateProducerFailShouldThrowException STARTED
org.apache.kafka.log4jappender.KafkaLog4jAppenderTest > testLog4jAppendsWithSyncSendAndSimulateProducerFailShouldThrowException PASSED
org.apache.kafka.log4jappender.KafkaLog4jAppenderTest > testLog4jAppendsWithRealProducerConfigWithSyncSendShouldNotThrowException STARTED
org.apache.kafka.log4jappender.KafkaLog4jAppenderTest > testLog4jAppendsWithRealProducerConfigWithSyncSendShouldNotThrowException PASSED
org.apache.kafka.log4jappender.KafkaLog4jAppenderTest > testSaslMechanismNotSet STARTED
org.apache.kafka.log4jappender.KafkaLog4jAppenderTest > testSaslMechanismNotSet PASSED
org.apache.kafka.log4jappender.KafkaLog4jAppenderTest > testSetJaasConfig STARTED
org.apache.kafka.log4jappender.KafkaLog4jAppenderTest > testSetJaasConfig PASSED
FAILURE: Build failed with an exception.
* What went wrong:
Execution failed for task ':connect:runtime:test'.
> There were failing tests. See the report at: file://<https://builds.apache.org/job/kafka-trunk-jdk11/ws/connect/runtime/build/reports/tests/test/index.html>
* Try:
Run with --stacktrace option to get the stack trace. Run with --info or --debug option to get more log output. Run with --scan to get full insights.
* Get more help at https://help.gradle.org
Deprecated Gradle features were used in this build, making it incompatible with Gradle 6.0.
Use '--warning-mode all' to show the individual deprecation warnings.
See https://docs.gradle.org/5.4.1/userguide/command_line_interface.html#sec:command_line_warnings
BUILD FAILED in 2h 48m 38s
178 actionable tasks: 175 executed, 3 up-to-date
Build step 'Execute shell' marked build as failure
Recording test results
ERROR: No tool found matching GRADLE_4_10_2_HOME
Setting GRADLE_4_10_3_HOME=/home/jenkins/tools/gradle/4.10.3
ERROR: No tool found matching GRADLE_4_10_2_HOME
Setting GRADLE_4_10_3_HOME=/home/jenkins/tools/gradle/4.10.3
Not sending mail to unregistered user noreply@github.com
Jenkins build is back to normal : kafka-trunk-jdk11 #682
Posted by Apache Jenkins Server <je...@builds.apache.org>.
See <https://builds.apache.org/job/kafka-trunk-jdk11/682/display/redirect?page=changes>
Build failed in Jenkins: kafka-trunk-jdk11 #681
Posted by Apache Jenkins Server <je...@builds.apache.org>.
See <https://builds.apache.org/job/kafka-trunk-jdk11/681/display/redirect?page=changes>
Changes:
[manikumar.reddy] MINOR: Fixes AK config typos (#7046)
------------------------------------------
[...truncated 2.55 MB...]
org.apache.kafka.connect.transforms.TimestampConverterTest > testSchemalessUnixToTimestamp PASSED
org.apache.kafka.connect.transforms.TimestampConverterTest > testWithSchemaTimestampToString STARTED
org.apache.kafka.connect.transforms.TimestampConverterTest > testWithSchemaTimestampToString PASSED
org.apache.kafka.connect.transforms.TimestampConverterTest > testConfigInvalidFormat STARTED
org.apache.kafka.connect.transforms.TimestampConverterTest > testConfigInvalidFormat PASSED
org.apache.kafka.connect.transforms.HoistFieldTest > withSchema STARTED
org.apache.kafka.connect.transforms.HoistFieldTest > withSchema PASSED
org.apache.kafka.connect.transforms.HoistFieldTest > schemaless STARTED
org.apache.kafka.connect.transforms.HoistFieldTest > schemaless PASSED
org.apache.kafka.connect.transforms.CastTest > castWholeDateRecordValueWithSchemaString STARTED
org.apache.kafka.connect.transforms.CastTest > castWholeDateRecordValueWithSchemaString PASSED
org.apache.kafka.connect.transforms.CastTest > castWholeRecordValueSchemalessBooleanTrue STARTED
org.apache.kafka.connect.transforms.CastTest > castWholeRecordValueSchemalessBooleanTrue PASSED
org.apache.kafka.connect.transforms.CastTest > testConfigInvalidTargetType STARTED
org.apache.kafka.connect.transforms.CastTest > testConfigInvalidTargetType PASSED
org.apache.kafka.connect.transforms.CastTest > testConfigMixWholeAndFieldTransformation STARTED
org.apache.kafka.connect.transforms.CastTest > testConfigMixWholeAndFieldTransformation PASSED
org.apache.kafka.connect.transforms.CastTest > castWholeRecordValueSchemalessFloat32 STARTED
org.apache.kafka.connect.transforms.CastTest > castWholeRecordValueSchemalessFloat32 PASSED
org.apache.kafka.connect.transforms.CastTest > castWholeRecordValueSchemalessFloat64 STARTED
org.apache.kafka.connect.transforms.CastTest > castWholeRecordValueSchemalessFloat64 PASSED
org.apache.kafka.connect.transforms.CastTest > castWholeRecordValueSchemalessUnsupportedType STARTED
org.apache.kafka.connect.transforms.CastTest > castWholeRecordValueSchemalessUnsupportedType PASSED
org.apache.kafka.connect.transforms.CastTest > castWholeRecordKeySchemaless STARTED
org.apache.kafka.connect.transforms.CastTest > castWholeRecordKeySchemaless PASSED
org.apache.kafka.connect.transforms.CastTest > castWholeRecordValueWithSchemaFloat32 STARTED
org.apache.kafka.connect.transforms.CastTest > castWholeRecordValueWithSchemaFloat32 PASSED
org.apache.kafka.connect.transforms.CastTest > castWholeRecordValueWithSchemaFloat64 STARTED
org.apache.kafka.connect.transforms.CastTest > castWholeRecordValueWithSchemaFloat64 PASSED
org.apache.kafka.connect.transforms.CastTest > castWholeRecordValueWithSchemaString STARTED
org.apache.kafka.connect.transforms.CastTest > castWholeRecordValueWithSchemaString PASSED
org.apache.kafka.connect.transforms.CastTest > testConfigEmpty STARTED
org.apache.kafka.connect.transforms.CastTest > testConfigEmpty PASSED
org.apache.kafka.connect.transforms.CastTest > castWholeRecordValueSchemalessInt16 STARTED
org.apache.kafka.connect.transforms.CastTest > castWholeRecordValueSchemalessInt16 PASSED
org.apache.kafka.connect.transforms.CastTest > castWholeRecordValueSchemalessInt32 STARTED
org.apache.kafka.connect.transforms.CastTest > castWholeRecordValueSchemalessInt32 PASSED
org.apache.kafka.connect.transforms.CastTest > castWholeRecordValueSchemalessInt64 STARTED
org.apache.kafka.connect.transforms.CastTest > castWholeRecordValueSchemalessInt64 PASSED
org.apache.kafka.connect.transforms.CastTest > castFieldsSchemaless STARTED
org.apache.kafka.connect.transforms.CastTest > castFieldsSchemaless PASSED
org.apache.kafka.connect.transforms.CastTest > testUnsupportedTargetType STARTED
org.apache.kafka.connect.transforms.CastTest > testUnsupportedTargetType PASSED
org.apache.kafka.connect.transforms.CastTest > castWholeRecordValueWithSchemaInt16 STARTED
org.apache.kafka.connect.transforms.CastTest > castWholeRecordValueWithSchemaInt16 PASSED
org.apache.kafka.connect.transforms.CastTest > castWholeRecordValueWithSchemaInt32 STARTED
org.apache.kafka.connect.transforms.CastTest > castWholeRecordValueWithSchemaInt32 PASSED
org.apache.kafka.connect.transforms.CastTest > castWholeRecordValueWithSchemaInt64 STARTED
org.apache.kafka.connect.transforms.CastTest > castWholeRecordValueWithSchemaInt64 PASSED
org.apache.kafka.connect.transforms.CastTest > castWholeBigDecimalRecordValueWithSchemaString STARTED
org.apache.kafka.connect.transforms.CastTest > castWholeBigDecimalRecordValueWithSchemaString PASSED
org.apache.kafka.connect.transforms.CastTest > castWholeRecordValueWithSchemaBooleanFalse STARTED
org.apache.kafka.connect.transforms.CastTest > castWholeRecordValueWithSchemaBooleanFalse PASSED
org.apache.kafka.connect.transforms.CastTest > testConfigInvalidMap STARTED
org.apache.kafka.connect.transforms.CastTest > testConfigInvalidMap PASSED
org.apache.kafka.connect.transforms.CastTest > castWholeRecordValueWithSchemaBooleanTrue STARTED
org.apache.kafka.connect.transforms.CastTest > castWholeRecordValueWithSchemaBooleanTrue PASSED
org.apache.kafka.connect.transforms.CastTest > castWholeRecordDefaultValue STARTED
org.apache.kafka.connect.transforms.CastTest > castWholeRecordDefaultValue PASSED
org.apache.kafka.connect.transforms.CastTest > castWholeRecordValueWithSchemaInt8 STARTED
org.apache.kafka.connect.transforms.CastTest > castWholeRecordValueWithSchemaInt8 PASSED
org.apache.kafka.connect.transforms.CastTest > castWholeRecordKeyWithSchema STARTED
org.apache.kafka.connect.transforms.CastTest > castWholeRecordKeyWithSchema PASSED
org.apache.kafka.connect.transforms.CastTest > castWholeRecordValueSchemalessInt8 STARTED
org.apache.kafka.connect.transforms.CastTest > castWholeRecordValueSchemalessInt8 PASSED
org.apache.kafka.connect.transforms.CastTest > castWholeRecordValueSchemalessBooleanFalse STARTED
org.apache.kafka.connect.transforms.CastTest > castWholeRecordValueSchemalessBooleanFalse PASSED
org.apache.kafka.connect.transforms.CastTest > testConfigInvalidSchemaType STARTED
org.apache.kafka.connect.transforms.CastTest > testConfigInvalidSchemaType PASSED
org.apache.kafka.connect.transforms.CastTest > castWholeRecordValueSchemalessString STARTED
org.apache.kafka.connect.transforms.CastTest > castWholeRecordValueSchemalessString PASSED
org.apache.kafka.connect.transforms.CastTest > castFieldsWithSchema STARTED
org.apache.kafka.connect.transforms.CastTest > castFieldsWithSchema PASSED
org.apache.kafka.connect.transforms.ReplaceFieldTest > withSchema STARTED
org.apache.kafka.connect.transforms.ReplaceFieldTest > withSchema PASSED
org.apache.kafka.connect.transforms.ReplaceFieldTest > schemaless STARTED
org.apache.kafka.connect.transforms.ReplaceFieldTest > schemaless PASSED
> Task :connect:file:test
org.apache.kafka.connect.file.FileStreamSourceConnectorTest > testBlankTopic STARTED
org.apache.kafka.connect.file.FileStreamSourceConnectorTest > testBlankTopic PASSED
org.apache.kafka.connect.file.FileStreamSourceConnectorTest > testSourceTasks STARTED
org.apache.kafka.connect.file.FileStreamSourceConnectorTest > testSourceTasks PASSED
org.apache.kafka.connect.file.FileStreamSourceConnectorTest > testMissingTopic STARTED
org.apache.kafka.connect.file.FileStreamSourceConnectorTest > testMissingTopic PASSED
org.apache.kafka.connect.file.FileStreamSourceConnectorTest > testSourceTasksStdin STARTED
org.apache.kafka.connect.file.FileStreamSourceConnectorTest > testSourceTasksStdin PASSED
org.apache.kafka.connect.file.FileStreamSourceConnectorTest > testTaskClass STARTED
org.apache.kafka.connect.file.FileStreamSourceConnectorTest > testTaskClass PASSED
org.apache.kafka.connect.file.FileStreamSourceConnectorTest > testInvalidBatchSize STARTED
org.apache.kafka.connect.file.FileStreamSourceConnectorTest > testInvalidBatchSize PASSED
org.apache.kafka.connect.file.FileStreamSourceConnectorTest > testConnectorConfigValidation STARTED
org.apache.kafka.connect.file.FileStreamSourceConnectorTest > testConnectorConfigValidation PASSED
org.apache.kafka.connect.file.FileStreamSourceConnectorTest > testMultipleSourcesInvalid STARTED
org.apache.kafka.connect.file.FileStreamSourceConnectorTest > testMultipleSourcesInvalid PASSED
org.apache.kafka.connect.file.FileStreamSourceTaskTest > testNormalLifecycle STARTED
org.apache.kafka.connect.file.FileStreamSourceTaskTest > testNormalLifecycle PASSED
org.apache.kafka.connect.file.FileStreamSourceTaskTest > testBatchSize STARTED
org.apache.kafka.connect.file.FileStreamSourceTaskTest > testBatchSize PASSED
org.apache.kafka.connect.file.FileStreamSourceTaskTest > testMissingFile STARTED
org.apache.kafka.connect.file.FileStreamSourceTaskTest > testMissingFile PASSED
org.apache.kafka.connect.file.FileStreamSinkConnectorTest > testSinkTasks STARTED
org.apache.kafka.connect.file.FileStreamSinkConnectorTest > testSinkTasks PASSED
org.apache.kafka.connect.file.FileStreamSinkConnectorTest > testTaskClass STARTED
org.apache.kafka.connect.file.FileStreamSinkConnectorTest > testTaskClass PASSED
org.apache.kafka.connect.file.FileStreamSinkConnectorTest > testConnectorConfigValidation STARTED
org.apache.kafka.connect.file.FileStreamSinkConnectorTest > testConnectorConfigValidation PASSED
org.apache.kafka.connect.file.FileStreamSinkConnectorTest > testSinkTasksStdout STARTED
org.apache.kafka.connect.file.FileStreamSinkConnectorTest > testSinkTasksStdout PASSED
org.apache.kafka.connect.file.FileStreamSinkTaskTest > testPutFlush STARTED
org.apache.kafka.connect.file.FileStreamSinkTaskTest > testPutFlush PASSED
org.apache.kafka.connect.file.FileStreamSinkTaskTest > testStart STARTED
org.apache.kafka.connect.file.FileStreamSinkTaskTest > testStart PASSED
FAILURE: Build failed with an exception.
* What went wrong:
Execution failed for task ':core:test'.
> There were failing tests. See the report at: file://<https://builds.apache.org/job/kafka-trunk-jdk11/ws/core/build/reports/tests/test/index.html>
* Try:
Run with --stacktrace option to get the stack trace. Run with --info or --debug option to get more log output. Run with --scan to get full insights.
* Get more help at https://help.gradle.org
Deprecated Gradle features were used in this build, making it incompatible with Gradle 6.0.
Use '--warning-mode all' to show the individual deprecation warnings.
See https://docs.gradle.org/5.4.1/userguide/command_line_interface.html#sec:command_line_warnings
BUILD FAILED in 3h 11m 49s
178 actionable tasks: 152 executed, 26 up-to-date
Build step 'Execute shell' marked build as failure
Recording test results
ERROR: No tool found matching GRADLE_4_10_2_HOME
Setting GRADLE_4_10_3_HOME=/home/jenkins/tools/gradle/4.10.3
ERROR: No tool found matching GRADLE_4_10_2_HOME
Setting GRADLE_4_10_3_HOME=/home/jenkins/tools/gradle/4.10.3
Not sending mail to unregistered user noreply@github.com
Not sending mail to unregistered user manikumar.reddy@gmail.com
Build failed in Jenkins: kafka-trunk-jdk11 #680
Posted by Apache Jenkins Server <je...@builds.apache.org>.
See <https://builds.apache.org/job/kafka-trunk-jdk11/680/display/redirect?page=changes>
Changes:
[jason] KAFKA-8591; WorkerConfigTransformer NPE on connector configuration
------------------------------------------
[...truncated 6.46 MB...]
kafka.security.auth.ZkAuthorizationTest > testConsumerOffsetPathAcls STARTED
kafka.security.auth.ZkAuthorizationTest > testConsumerOffsetPathAcls PASSED
kafka.security.auth.ZkAuthorizationTest > testZkMigration STARTED
kafka.security.auth.ZkAuthorizationTest > testZkMigration PASSED
kafka.security.auth.ZkAuthorizationTest > testChroot STARTED
kafka.security.auth.ZkAuthorizationTest > testChroot PASSED
kafka.security.auth.ZkAuthorizationTest > testDelete STARTED
kafka.security.auth.ZkAuthorizationTest > testDelete PASSED
kafka.security.auth.ZkAuthorizationTest > testDeleteRecursive STARTED
kafka.security.auth.ZkAuthorizationTest > testDeleteRecursive PASSED
kafka.security.auth.ResourceTypeTest > testJavaConversions STARTED
kafka.security.auth.ResourceTypeTest > testJavaConversions PASSED
kafka.security.auth.ResourceTypeTest > testFromString STARTED
kafka.security.auth.ResourceTypeTest > testFromString PASSED
kafka.security.auth.SimpleAclAuthorizerTest > testAuthorizeWithPrefixedResource STARTED
kafka.security.auth.SimpleAclAuthorizerTest > testAuthorizeWithPrefixedResource PASSED
kafka.security.auth.SimpleAclAuthorizerTest > testAllowAllAccess STARTED
kafka.security.auth.SimpleAclAuthorizerTest > testAllowAllAccess PASSED
kafka.security.auth.SimpleAclAuthorizerTest > testLocalConcurrentModificationOfResourceAcls STARTED
kafka.security.auth.SimpleAclAuthorizerTest > testLocalConcurrentModificationOfResourceAcls PASSED
kafka.security.auth.SimpleAclAuthorizerTest > testDeleteAllAclOnWildcardResource STARTED
kafka.security.auth.SimpleAclAuthorizerTest > testDeleteAllAclOnWildcardResource PASSED
kafka.security.auth.SimpleAclAuthorizerTest > testHighConcurrencyDeletionOfResourceAcls STARTED
kafka.security.auth.SimpleAclAuthorizerTest > testHighConcurrencyDeletionOfResourceAcls PASSED
kafka.security.auth.SimpleAclAuthorizerTest > testNoAclFound STARTED
kafka.security.auth.SimpleAclAuthorizerTest > testNoAclFound PASSED
kafka.security.auth.SimpleAclAuthorizerTest > testAclInheritance STARTED
kafka.security.auth.SimpleAclAuthorizerTest > testAclInheritance PASSED
kafka.security.auth.SimpleAclAuthorizerTest > testDistributedConcurrentModificationOfResourceAcls STARTED
kafka.security.auth.SimpleAclAuthorizerTest > testDistributedConcurrentModificationOfResourceAcls PASSED
kafka.security.auth.SimpleAclAuthorizerTest > testAddAclsOnWildcardResource STARTED
kafka.security.auth.SimpleAclAuthorizerTest > testAddAclsOnWildcardResource PASSED
kafka.security.auth.SimpleAclAuthorizerTest > testWritesExtendedAclChangeEventWhenInterBrokerProtocolAtLeastKafkaV2 STARTED
kafka.security.auth.SimpleAclAuthorizerTest > testWritesExtendedAclChangeEventWhenInterBrokerProtocolAtLeastKafkaV2 PASSED
kafka.security.auth.SimpleAclAuthorizerTest > testAclManagementAPIs STARTED
kafka.security.auth.SimpleAclAuthorizerTest > testAclManagementAPIs PASSED
kafka.security.auth.SimpleAclAuthorizerTest > testWildCardAcls STARTED
kafka.security.auth.SimpleAclAuthorizerTest > testWildCardAcls PASSED
kafka.security.auth.SimpleAclAuthorizerTest > testWritesLiteralAclChangeEventWhenInterBrokerProtocolIsKafkaV2 STARTED
kafka.security.auth.SimpleAclAuthorizerTest > testWritesLiteralAclChangeEventWhenInterBrokerProtocolIsKafkaV2 PASSED
kafka.security.auth.SimpleAclAuthorizerTest > testTopicAcl STARTED
kafka.security.auth.SimpleAclAuthorizerTest > testTopicAcl PASSED
kafka.security.auth.SimpleAclAuthorizerTest > testSuperUserHasAccess STARTED
kafka.security.auth.SimpleAclAuthorizerTest > testSuperUserHasAccess PASSED
kafka.security.auth.SimpleAclAuthorizerTest > testDeleteAclOnPrefixedResource STARTED
kafka.security.auth.SimpleAclAuthorizerTest > testDeleteAclOnPrefixedResource PASSED
kafka.security.auth.SimpleAclAuthorizerTest > testDenyTakesPrecedence STARTED
kafka.security.auth.SimpleAclAuthorizerTest > testDenyTakesPrecedence PASSED
kafka.security.auth.SimpleAclAuthorizerTest > testSingleCharacterResourceAcls STARTED
kafka.security.auth.SimpleAclAuthorizerTest > testSingleCharacterResourceAcls PASSED
kafka.security.auth.SimpleAclAuthorizerTest > testNoAclFoundOverride STARTED
kafka.security.auth.SimpleAclAuthorizerTest > testNoAclFoundOverride PASSED
kafka.security.auth.SimpleAclAuthorizerTest > testEmptyAclThrowsException STARTED
kafka.security.auth.SimpleAclAuthorizerTest > testEmptyAclThrowsException PASSED
kafka.security.auth.SimpleAclAuthorizerTest > testSuperUserWithCustomPrincipalHasAccess STARTED
kafka.security.auth.SimpleAclAuthorizerTest > testSuperUserWithCustomPrincipalHasAccess PASSED
kafka.security.auth.SimpleAclAuthorizerTest > testAllowAccessWithCustomPrincipal STARTED
kafka.security.auth.SimpleAclAuthorizerTest > testAllowAccessWithCustomPrincipal PASSED
kafka.security.auth.SimpleAclAuthorizerTest > testDeleteAclOnWildcardResource STARTED
kafka.security.auth.SimpleAclAuthorizerTest > testDeleteAclOnWildcardResource PASSED
kafka.security.auth.SimpleAclAuthorizerTest > testChangeListenerTiming STARTED
kafka.security.auth.SimpleAclAuthorizerTest > testChangeListenerTiming PASSED
kafka.security.auth.SimpleAclAuthorizerTest > testWritesLiteralWritesLiteralAclChangeEventWhenInterBrokerProtocolLessThanKafkaV2eralAclChangesForOlderProtocolVersions STARTED
kafka.security.auth.SimpleAclAuthorizerTest > testWritesLiteralWritesLiteralAclChangeEventWhenInterBrokerProtocolLessThanKafkaV2eralAclChangesForOlderProtocolVersions PASSED
kafka.security.auth.SimpleAclAuthorizerTest > testThrowsOnAddPrefixedAclIfInterBrokerProtocolVersionTooLow STARTED
kafka.security.auth.SimpleAclAuthorizerTest > testThrowsOnAddPrefixedAclIfInterBrokerProtocolVersionTooLow PASSED
kafka.security.auth.SimpleAclAuthorizerTest > testAccessAllowedIfAllowAclExistsOnPrefixedResource STARTED
kafka.security.auth.SimpleAclAuthorizerTest > testAccessAllowedIfAllowAclExistsOnPrefixedResource PASSED
kafka.security.auth.SimpleAclAuthorizerTest > testHighConcurrencyModificationOfResourceAcls STARTED
kafka.security.auth.SimpleAclAuthorizerTest > testHighConcurrencyModificationOfResourceAcls PASSED
kafka.security.auth.SimpleAclAuthorizerTest > testAuthorizeWithEmptyResourceName STARTED
kafka.security.auth.SimpleAclAuthorizerTest > testAuthorizeWithEmptyResourceName PASSED
kafka.security.auth.SimpleAclAuthorizerTest > testDeleteAllAclOnPrefixedResource STARTED
kafka.security.auth.SimpleAclAuthorizerTest > testDeleteAllAclOnPrefixedResource PASSED
kafka.security.auth.SimpleAclAuthorizerTest > testAddAclsOnLiteralResource STARTED
kafka.security.auth.SimpleAclAuthorizerTest > testAddAclsOnLiteralResource PASSED
kafka.security.auth.SimpleAclAuthorizerTest > testAuthorizeThrowsOnNoneLiteralResource STARTED
kafka.security.auth.SimpleAclAuthorizerTest > testAuthorizeThrowsOnNoneLiteralResource PASSED
kafka.security.auth.SimpleAclAuthorizerTest > testGetAclsPrincipal STARTED
kafka.security.auth.SimpleAclAuthorizerTest > testGetAclsPrincipal PASSED
kafka.security.auth.SimpleAclAuthorizerTest > testAddAclsOnPrefiexedResource STARTED
kafka.security.auth.SimpleAclAuthorizerTest > testAddAclsOnPrefiexedResource PASSED
kafka.security.auth.SimpleAclAuthorizerTest > testWritesExtendedAclChangeEventIfInterBrokerProtocolNotSet STARTED
kafka.security.auth.SimpleAclAuthorizerTest > testWritesExtendedAclChangeEventIfInterBrokerProtocolNotSet PASSED
kafka.security.auth.SimpleAclAuthorizerTest > testAccessAllowedIfAllowAclExistsOnWildcardResource STARTED
kafka.security.auth.SimpleAclAuthorizerTest > testAccessAllowedIfAllowAclExistsOnWildcardResource PASSED
kafka.security.auth.SimpleAclAuthorizerTest > testLoadCache STARTED
kafka.security.auth.SimpleAclAuthorizerTest > testLoadCache PASSED
kafka.security.auth.AclTest > testAclJsonConversion STARTED
kafka.security.auth.AclTest > testAclJsonConversion PASSED
kafka.security.auth.PermissionTypeTest > testJavaConversions STARTED
kafka.security.auth.PermissionTypeTest > testJavaConversions PASSED
kafka.security.auth.PermissionTypeTest > testFromString STARTED
kafka.security.auth.PermissionTypeTest > testFromString PASSED
kafka.security.auth.ResourceTest > shouldParseOldTwoPartString STARTED
kafka.security.auth.ResourceTest > shouldParseOldTwoPartString PASSED
kafka.security.auth.ResourceTest > shouldParseOldTwoPartWithEmbeddedSeparators STARTED
kafka.security.auth.ResourceTest > shouldParseOldTwoPartWithEmbeddedSeparators PASSED
kafka.security.auth.ResourceTest > shouldThrowOnTwoPartStringWithUnknownResourceType STARTED
kafka.security.auth.ResourceTest > shouldThrowOnTwoPartStringWithUnknownResourceType PASSED
kafka.security.auth.ResourceTest > shouldThrowOnBadResourceTypeSeparator STARTED
kafka.security.auth.ResourceTest > shouldThrowOnBadResourceTypeSeparator PASSED
kafka.security.auth.ResourceTest > shouldParseThreePartString STARTED
kafka.security.auth.ResourceTest > shouldParseThreePartString PASSED
kafka.security.auth.ResourceTest > shouldRoundTripViaString STARTED
kafka.security.auth.ResourceTest > shouldRoundTripViaString PASSED
kafka.security.auth.ResourceTest > shouldParseThreePartWithEmbeddedSeparators STARTED
kafka.security.auth.ResourceTest > shouldParseThreePartWithEmbeddedSeparators PASSED
kafka.security.auth.OperationTest > testJavaConversions STARTED
kafka.security.auth.OperationTest > testJavaConversions PASSED
unit.kafka.utils.ThrottlerTest > testThrottleDesiredRate STARTED
unit.kafka.utils.ThrottlerTest > testThrottleDesiredRate PASSED
FAILURE: Build failed with an exception.
* What went wrong:
Execution failed for task ':connect:runtime:test'.
> There were failing tests. See the report at: file://<https://builds.apache.org/job/kafka-trunk-jdk11/ws/connect/runtime/build/reports/tests/test/index.html>
* Try:
Run with --stacktrace option to get the stack trace. Run with --info or --debug option to get more log output. Run with --scan to get full insights.
* Get more help at https://help.gradle.org
Deprecated Gradle features were used in this build, making it incompatible with Gradle 6.0.
Use '--warning-mode all' to show the individual deprecation warnings.
See https://docs.gradle.org/5.4.1/userguide/command_line_interface.html#sec:command_line_warnings
BUILD FAILED in 2h 55m 35s
178 actionable tasks: 175 executed, 3 up-to-date
Build step 'Execute shell' marked build as failure
Recording test results
ERROR: No tool found matching GRADLE_4_10_2_HOME
Setting GRADLE_4_10_3_HOME=/home/jenkins/tools/gradle/4.10.3
ERROR: No tool found matching GRADLE_4_10_2_HOME
Setting GRADLE_4_10_3_HOME=/home/jenkins/tools/gradle/4.10.3
Not sending mail to unregistered user noreply@github.com
Build failed in Jenkins: kafka-trunk-jdk11 #679
Posted by Apache Jenkins Server <je...@builds.apache.org>.
See <https://builds.apache.org/job/kafka-trunk-jdk11/679/display/redirect?page=changes>
Changes:
[bbejeck] MINOR: improve RocksDBConfigSetter docs (#7009)
[jason] MINOR: A few cleanups and compiler warning fixes (#6986)
------------------------------------------
[...truncated 2.56 MB...]
org.apache.kafka.trogdor.coordinator.CoordinatorTest > testCreateTask STARTED
org.apache.kafka.trogdor.coordinator.CoordinatorTest > testCreateTask PASSED
org.apache.kafka.trogdor.coordinator.CoordinatorTest > testTasksRequest STARTED
org.apache.kafka.trogdor.coordinator.CoordinatorTest > testTasksRequest PASSED
org.apache.kafka.trogdor.coordinator.CoordinatorTest > testCoordinatorStatus STARTED
org.apache.kafka.trogdor.coordinator.CoordinatorTest > testCoordinatorStatus PASSED
org.apache.kafka.trogdor.coordinator.CoordinatorTest > testCoordinatorUptime STARTED
org.apache.kafka.trogdor.coordinator.CoordinatorTest > testCoordinatorUptime PASSED
org.apache.kafka.trogdor.task.TaskSpecTest > testTaskSpecSerialization STARTED
org.apache.kafka.trogdor.task.TaskSpecTest > testTaskSpecSerialization PASSED
org.apache.kafka.trogdor.workload.TimeIntervalTransactionsGeneratorTest > testCommitsTransactionAfterIntervalPasses STARTED
org.apache.kafka.trogdor.workload.TimeIntervalTransactionsGeneratorTest > testCommitsTransactionAfterIntervalPasses PASSED
org.apache.kafka.trogdor.workload.ExternalCommandWorkerTest > testProcessWithFailedExit STARTED
org.apache.kafka.trogdor.workload.ExternalCommandWorkerTest > testProcessWithFailedExit PASSED
org.apache.kafka.trogdor.workload.ExternalCommandWorkerTest > testProcessNotFound STARTED
org.apache.kafka.trogdor.workload.ExternalCommandWorkerTest > testProcessNotFound PASSED
org.apache.kafka.trogdor.workload.ExternalCommandWorkerTest > testProcessForceKillTimeout STARTED
org.apache.kafka.trogdor.workload.ExternalCommandWorkerTest > testProcessForceKillTimeout PASSED
org.apache.kafka.trogdor.workload.ExternalCommandWorkerTest > testProcessStop STARTED
org.apache.kafka.trogdor.workload.ExternalCommandWorkerTest > testProcessStop PASSED
org.apache.kafka.trogdor.workload.ExternalCommandWorkerTest > testProcessWithNormalExit STARTED
org.apache.kafka.trogdor.workload.ExternalCommandWorkerTest > testProcessWithNormalExit PASSED
org.apache.kafka.trogdor.workload.PayloadGeneratorTest > testConstantPayloadGenerator STARTED
org.apache.kafka.trogdor.workload.PayloadGeneratorTest > testConstantPayloadGenerator PASSED
org.apache.kafka.trogdor.workload.PayloadGeneratorTest > testSequentialPayloadGenerator STARTED
org.apache.kafka.trogdor.workload.PayloadGeneratorTest > testSequentialPayloadGenerator PASSED
org.apache.kafka.trogdor.workload.PayloadGeneratorTest > testNullPayloadGenerator STARTED
org.apache.kafka.trogdor.workload.PayloadGeneratorTest > testNullPayloadGenerator PASSED
org.apache.kafka.trogdor.workload.PayloadGeneratorTest > testUniformRandomPayloadGenerator STARTED
org.apache.kafka.trogdor.workload.PayloadGeneratorTest > testUniformRandomPayloadGenerator PASSED
org.apache.kafka.trogdor.workload.PayloadGeneratorTest > testPayloadIterator STARTED
org.apache.kafka.trogdor.workload.PayloadGeneratorTest > testPayloadIterator PASSED
org.apache.kafka.trogdor.workload.PayloadGeneratorTest > testUniformRandomPayloadGeneratorPaddingBytes STARTED
org.apache.kafka.trogdor.workload.PayloadGeneratorTest > testUniformRandomPayloadGeneratorPaddingBytes PASSED
org.apache.kafka.trogdor.workload.ThrottleTest > testThrottle STARTED
org.apache.kafka.trogdor.workload.ThrottleTest > testThrottle PASSED
org.apache.kafka.trogdor.workload.ConsumeBenchSpecTest > testMaterializeTopicsWithSomePartitions STARTED
org.apache.kafka.trogdor.workload.ConsumeBenchSpecTest > testMaterializeTopicsWithSomePartitions PASSED
org.apache.kafka.trogdor.workload.ConsumeBenchSpecTest > testMaterializeTopicsWithNoPartitions STARTED
org.apache.kafka.trogdor.workload.ConsumeBenchSpecTest > testMaterializeTopicsWithNoPartitions PASSED
org.apache.kafka.trogdor.workload.ConsumeBenchSpecTest > testInvalidTopicNameRaisesExceptionInMaterialize STARTED
org.apache.kafka.trogdor.workload.ConsumeBenchSpecTest > testInvalidTopicNameRaisesExceptionInMaterialize PASSED
org.apache.kafka.trogdor.workload.HistogramTest > testHistogramPercentiles STARTED
org.apache.kafka.trogdor.workload.HistogramTest > testHistogramPercentiles PASSED
org.apache.kafka.trogdor.workload.HistogramTest > testHistogramSamples STARTED
org.apache.kafka.trogdor.workload.HistogramTest > testHistogramSamples PASSED
org.apache.kafka.trogdor.workload.HistogramTest > testHistogramAverage STARTED
org.apache.kafka.trogdor.workload.HistogramTest > testHistogramAverage PASSED
org.apache.kafka.trogdor.workload.TopicsSpecTest > testPartitionNumbers STARTED
org.apache.kafka.trogdor.workload.TopicsSpecTest > testPartitionNumbers PASSED
org.apache.kafka.trogdor.workload.TopicsSpecTest > testMaterialize STARTED
org.apache.kafka.trogdor.workload.TopicsSpecTest > testMaterialize PASSED
org.apache.kafka.trogdor.workload.TopicsSpecTest > testPartitionsSpec STARTED
org.apache.kafka.trogdor.workload.TopicsSpecTest > testPartitionsSpec PASSED
> Task :connect:file:test
org.apache.kafka.connect.file.FileStreamSourceConnectorTest > testBlankTopic STARTED
org.apache.kafka.connect.file.FileStreamSourceConnectorTest > testBlankTopic PASSED
org.apache.kafka.connect.file.FileStreamSourceConnectorTest > testSourceTasks STARTED
org.apache.kafka.connect.file.FileStreamSourceConnectorTest > testSourceTasks PASSED
org.apache.kafka.connect.file.FileStreamSourceConnectorTest > testMissingTopic STARTED
org.apache.kafka.connect.file.FileStreamSourceConnectorTest > testMissingTopic PASSED
org.apache.kafka.connect.file.FileStreamSourceConnectorTest > testSourceTasksStdin STARTED
org.apache.kafka.connect.file.FileStreamSourceConnectorTest > testSourceTasksStdin PASSED
org.apache.kafka.connect.file.FileStreamSourceConnectorTest > testTaskClass STARTED
org.apache.kafka.connect.file.FileStreamSourceConnectorTest > testTaskClass PASSED
org.apache.kafka.connect.file.FileStreamSourceConnectorTest > testInvalidBatchSize STARTED
org.apache.kafka.connect.file.FileStreamSourceConnectorTest > testInvalidBatchSize PASSED
org.apache.kafka.connect.file.FileStreamSourceConnectorTest > testConnectorConfigValidation STARTED
org.apache.kafka.connect.file.FileStreamSourceConnectorTest > testConnectorConfigValidation PASSED
org.apache.kafka.connect.file.FileStreamSourceConnectorTest > testMultipleSourcesInvalid STARTED
org.apache.kafka.connect.file.FileStreamSourceConnectorTest > testMultipleSourcesInvalid PASSED
org.apache.kafka.connect.file.FileStreamSinkTaskTest > testPutFlush STARTED
org.apache.kafka.connect.file.FileStreamSinkTaskTest > testPutFlush PASSED
org.apache.kafka.connect.file.FileStreamSinkTaskTest > testStart STARTED
org.apache.kafka.connect.file.FileStreamSinkTaskTest > testStart PASSED
org.apache.kafka.connect.file.FileStreamSinkConnectorTest > testSinkTasks STARTED
org.apache.kafka.connect.file.FileStreamSinkConnectorTest > testSinkTasks PASSED
org.apache.kafka.connect.file.FileStreamSinkConnectorTest > testTaskClass STARTED
org.apache.kafka.connect.file.FileStreamSinkConnectorTest > testTaskClass PASSED
org.apache.kafka.connect.file.FileStreamSinkConnectorTest > testConnectorConfigValidation STARTED
org.apache.kafka.connect.file.FileStreamSinkConnectorTest > testConnectorConfigValidation PASSED
org.apache.kafka.connect.file.FileStreamSinkConnectorTest > testSinkTasksStdout STARTED
org.apache.kafka.connect.file.FileStreamSinkConnectorTest > testSinkTasksStdout PASSED
org.apache.kafka.connect.file.FileStreamSourceTaskTest > testNormalLifecycle STARTED
org.apache.kafka.connect.file.FileStreamSourceTaskTest > testNormalLifecycle PASSED
org.apache.kafka.connect.file.FileStreamSourceTaskTest > testBatchSize STARTED
org.apache.kafka.connect.file.FileStreamSourceTaskTest > testBatchSize PASSED
org.apache.kafka.connect.file.FileStreamSourceTaskTest > testMissingFile STARTED
org.apache.kafka.connect.file.FileStreamSourceTaskTest > testMissingFile PASSED
> Task :connect:basic-auth-extension:test
org.apache.kafka.connect.rest.basic.auth.extension.JaasBasicAuthFilterTest > testNoFileOption STARTED
WARNING: An illegal reflective access operation has occurred
WARNING: Illegal reflective access by org.powermock.reflect.internal.WhiteboxImpl (file:/home/jenkins/.gradle/caches/modules-2/files-2.1/org.powermock/powermock-reflect/2.0.2/79df0e5792fba38278b90f9e22617f5684313017/powermock-reflect-2.0.2.jar) to method java.lang.Object.clone()
WARNING: Please consider reporting this to the maintainers of org.powermock.reflect.internal.WhiteboxImpl
WARNING: Use --illegal-access=warn to enable warnings of further illegal reflective access operations
WARNING: All illegal access operations will be denied in a future release
org.apache.kafka.connect.rest.basic.auth.extension.JaasBasicAuthFilterTest > testNoFileOption PASSED
org.apache.kafka.connect.rest.basic.auth.extension.JaasBasicAuthFilterTest > testPostWithoutAppropriateCredential STARTED
org.apache.kafka.connect.rest.basic.auth.extension.JaasBasicAuthFilterTest > testPostWithoutAppropriateCredential PASSED
org.apache.kafka.connect.rest.basic.auth.extension.JaasBasicAuthFilterTest > testPostNotChangingConnectorTask STARTED
org.apache.kafka.connect.rest.basic.auth.extension.JaasBasicAuthFilterTest > testPostNotChangingConnectorTask PASSED
org.apache.kafka.connect.rest.basic.auth.extension.JaasBasicAuthFilterTest > testSuccess STARTED
org.apache.kafka.connect.rest.basic.auth.extension.JaasBasicAuthFilterTest > testSuccess PASSED
org.apache.kafka.connect.rest.basic.auth.extension.JaasBasicAuthFilterTest > testBadCredential STARTED
org.apache.kafka.connect.rest.basic.auth.extension.JaasBasicAuthFilterTest > testBadCredential PASSED
org.apache.kafka.connect.rest.basic.auth.extension.JaasBasicAuthFilterTest > testBadPassword STARTED
org.apache.kafka.connect.rest.basic.auth.extension.JaasBasicAuthFilterTest > testBadPassword PASSED
org.apache.kafka.connect.rest.basic.auth.extension.JaasBasicAuthFilterTest > testUnknownBearer STARTED
org.apache.kafka.connect.rest.basic.auth.extension.JaasBasicAuthFilterTest > testUnknownBearer PASSED
org.apache.kafka.connect.rest.basic.auth.extension.JaasBasicAuthFilterTest > testUnknownLoginModule STARTED
org.apache.kafka.connect.rest.basic.auth.extension.JaasBasicAuthFilterTest > testUnknownLoginModule PASSED
org.apache.kafka.connect.rest.basic.auth.extension.JaasBasicAuthFilterTest > testUnknownCredentialsFile STARTED
org.apache.kafka.connect.rest.basic.auth.extension.JaasBasicAuthFilterTest > testUnknownCredentialsFile PASSED
org.apache.kafka.connect.rest.basic.auth.extension.JaasBasicAuthFilterTest > testEmptyCredentialsFile STARTED
org.apache.kafka.connect.rest.basic.auth.extension.JaasBasicAuthFilterTest > testEmptyCredentialsFile PASSED
FAILURE: Build failed with an exception.
* What went wrong:
Execution failed for task ':core:test'.
> There were failing tests. See the report at: file://<https://builds.apache.org/job/kafka-trunk-jdk11/ws/core/build/reports/tests/test/index.html>
* Try:
Run with --stacktrace option to get the stack trace. Run with --info or --debug option to get more log output. Run with --scan to get full insights.
* Get more help at https://help.gradle.org
Deprecated Gradle features were used in this build, making it incompatible with Gradle 6.0.
Use '--warning-mode all' to show the individual deprecation warnings.
See https://docs.gradle.org/5.4.1/userguide/command_line_interface.html#sec:command_line_warnings
BUILD FAILED in 3h 8m 44s
178 actionable tasks: 152 executed, 26 up-to-date
Build step 'Execute shell' marked build as failure
Recording test results
ERROR: No tool found matching GRADLE_4_10_2_HOME
Setting GRADLE_4_10_3_HOME=/home/jenkins/tools/gradle/4.10.3
ERROR: No tool found matching GRADLE_4_10_2_HOME
Setting GRADLE_4_10_3_HOME=/home/jenkins/tools/gradle/4.10.3
Not sending mail to unregistered user noreply@github.com