You are viewing a plain text version of this content. The canonical link for it is here.
Posted to builds@beam.apache.org by Apache Jenkins Server <je...@builds.apache.org> on 2023/02/18 10:33:06 UTC
Build failed in Jenkins: beam_PostCommit_Java_ValidatesRunner_Dataflow_Java17 #1640
See <https://ci-beam.apache.org/job/beam_PostCommit_Java_ValidatesRunner_Dataflow_Java17/1640/display/redirect?page=changes>
Changes:
[noreply] Use WindowedValue.withValue on hot paths #21250 (#25519)
[noreply] Stop paying the iterator object creation tax in
[noreply] [prism] add windowing strategy (#25518)
------------------------------------------
[...truncated 21.87 KB...]
> Task :runners:google-cloud-dataflow-java:processResources
> Task :sdks:java:core:processResources
> Task :runners:google-cloud-dataflow-java:processTestResources NO-SOURCE
> Task :sdks:java:core:generateTestAvroProtocol NO-SOURCE
> Task :sdks:java:io:common:jar
> Task :sdks:java:extensions:protobuf:processTestResources
> Task :sdks:java:io:common:processTestResources NO-SOURCE
> Task :sdks:java:io:google-cloud-platform:processTestResources
> Task :sdks:java:core:generateTestAvroJava
> Task :sdks:java:core:generateTestGrammarSource NO-SOURCE
> Task :sdks:java:core:processTestResources
> Task :runners:google-cloud-dataflow-java:worker:windmill:extractIncludeProto
> Task :model:pipeline:extractIncludeProto
> Task :runners:google-cloud-dataflow-java:worker:windmill:extractProto
> Task :model:pipeline:extractProto
> Task :runners:google-cloud-dataflow-java:worker:windmill:generateProto FROM-CACHE
> Task :model:pipeline:generateProto FROM-CACHE
> Task :runners:google-cloud-dataflow-java:worker:windmill:compileJava FROM-CACHE
> Task :runners:google-cloud-dataflow-java:worker:windmill:processResources
> Task :runners:google-cloud-dataflow-java:worker:windmill:classes
> Task :runners:google-cloud-dataflow-java:worker:windmill:shadowJar FROM-CACHE
> Task :model:pipeline:compileJava FROM-CACHE
> Task :model:pipeline:processResources
> Task :model:pipeline:classes
> Task :model:pipeline:jar
> Task :model:pipeline:shadowJar FROM-CACHE
> Task :model:fn-execution:extractIncludeProto
> Task :model:job-management:extractIncludeProto
> Task :model:fn-execution:generateProto FROM-CACHE
> Task :model:job-management:generateProto FROM-CACHE
> Task :model:job-management:compileJava FROM-CACHE
> Task :model:job-management:classes
> Task :model:fn-execution:compileJava FROM-CACHE
> Task :model:fn-execution:classes
> Task :model:fn-execution:shadowJar FROM-CACHE
> Task :model:job-management:shadowJar FROM-CACHE
> Task :sdks:java:core:compileJava FROM-CACHE
> Task :sdks:java:core:classes
> Task :sdks:java:core:shadowJar FROM-CACHE
> Task :runners:local-java:compileJava FROM-CACHE
> Task :runners:local-java:classes UP-TO-DATE
> Task :sdks:java:testing:test-utils:compileJava FROM-CACHE
> Task :sdks:java:testing:test-utils:classes UP-TO-DATE
> Task :runners:local-java:jar
> Task :sdks:java:testing:test-utils:jar
> Task :sdks:java:testing:test-utils:compileTestJava FROM-CACHE
> Task :sdks:java:testing:test-utils:testClasses UP-TO-DATE
> Task :sdks:java:extensions:arrow:compileJava FROM-CACHE
> Task :sdks:java:extensions:arrow:classes UP-TO-DATE
> Task :sdks:java:testing:test-utils:testJar
> Task :sdks:java:extensions:arrow:jar
> Task :sdks:java:io:common:compileTestJava FROM-CACHE
> Task :sdks:java:io:common:testClasses UP-TO-DATE
> Task :sdks:java:io:common:testJar
> Task :sdks:java:fn-execution:compileJava FROM-CACHE
> Task :sdks:java:fn-execution:classes UP-TO-DATE
> Task :sdks:java:fn-execution:jar
> Task :sdks:java:extensions:protobuf:extractIncludeProto
> Task :sdks:java:extensions:protobuf:generateProto NO-SOURCE
> Task :sdks:java:extensions:protobuf:compileJava FROM-CACHE
> Task :sdks:java:extensions:protobuf:classes UP-TO-DATE
> Task :runners:core-construction-java:compileJava FROM-CACHE
> Task :runners:core-construction-java:classes UP-TO-DATE
> Task :sdks:java:extensions:protobuf:jar
> Task :runners:core-construction-java:jar
> Task :sdks:java:core:jar
> Task :sdks:java:extensions:python:compileJava FROM-CACHE
> Task :sdks:java:extensions:python:classes
> Task :sdks:java:extensions:python:jar
> Task :runners:core-java:compileJava FROM-CACHE
> Task :runners:core-java:classes UP-TO-DATE
> Task :runners:core-java:jar
> Task :sdks:java:extensions:google-cloud-platform-core:compileJava FROM-CACHE
> Task :sdks:java:extensions:google-cloud-platform-core:classes UP-TO-DATE
> Task :sdks:java:extensions:google-cloud-platform-core:jar
> Task :sdks:java:harness:compileJava FROM-CACHE
> Task :sdks:java:harness:classes UP-TO-DATE
> Task :sdks:java:harness:jar
> Task :runners:java-fn-execution:compileJava FROM-CACHE
> Task :runners:java-fn-execution:classes UP-TO-DATE
> Task :runners:java-fn-execution:jar
> Task :sdks:java:expansion-service:compileJava FROM-CACHE
> Task :sdks:java:expansion-service:classes UP-TO-DATE
> Task :sdks:java:expansion-service:jar
> Task :runners:direct-java:compileJava FROM-CACHE
> Task :runners:direct-java:classes UP-TO-DATE
> Task :sdks:java:io:kafka:compileJava FROM-CACHE
> Task :sdks:java:io:kafka:classes UP-TO-DATE
> Task :sdks:java:io:kafka:jar
> Task :runners:direct-java:shadowJar FROM-CACHE
> Task :sdks:java:core:compileTestJava FROM-CACHE
> Task :sdks:java:core:testClasses
> Task :sdks:java:io:google-cloud-platform:compileJava FROM-CACHE
> Task :sdks:java:io:google-cloud-platform:classes UP-TO-DATE
> Task :sdks:java:core:shadowTestJar FROM-CACHE
> Task :sdks:java:io:google-cloud-platform:jar
> Task :sdks:java:extensions:google-cloud-platform-core:compileTestJava FROM-CACHE
> Task :sdks:java:extensions:google-cloud-platform-core:testClasses UP-TO-DATE
> Task :sdks:java:extensions:google-cloud-platform-core:testJar
> Task :runners:core-construction-java:compileTestJava FROM-CACHE
> Task :runners:core-construction-java:testClasses UP-TO-DATE
> Task :runners:core-java:compileTestJava FROM-CACHE
> Task :runners:core-java:testClasses UP-TO-DATE
> Task :sdks:java:extensions:python:compileTestJava FROM-CACHE
> Task :sdks:java:extensions:python:testClasses UP-TO-DATE
> Task :runners:google-cloud-dataflow-java:compileJava FROM-CACHE
> Task :runners:google-cloud-dataflow-java:classes
> Task :sdks:java:extensions:python:testJar
> Task :runners:core-java:testJar
> Task :runners:core-construction-java:testJar
> Task :runners:google-cloud-dataflow-java:jar
> Task :runners:direct-java:compileTestJava FROM-CACHE
> Task :runners:direct-java:testClasses UP-TO-DATE
> Task :runners:direct-java:shadowTestJar FROM-CACHE
> Task :runners:google-cloud-dataflow-java:worker:compileJava FROM-CACHE
> Task :runners:google-cloud-dataflow-java:worker:classes
> Task :sdks:java:extensions:protobuf:extractIncludeTestProto
> Task :sdks:java:extensions:protobuf:generateTestProto FROM-CACHE
> Task :sdks:java:extensions:protobuf:compileTestJava FROM-CACHE
> Task :sdks:java:extensions:protobuf:testClasses
> Task :sdks:java:extensions:protobuf:testJar
> Task :runners:google-cloud-dataflow-java:worker:shadowJar FROM-CACHE
> Task :sdks:java:io:google-cloud-platform:compileTestJava FROM-CACHE
> Task :sdks:java:io:google-cloud-platform:testClasses
> Task :sdks:java:io:google-cloud-platform:testJar
> Task :runners:google-cloud-dataflow-java:compileTestJava FROM-CACHE
> Task :runners:google-cloud-dataflow-java:testClasses UP-TO-DATE
> Task :runners:google-cloud-dataflow-java:testJar
Deprecated Gradle features were used in this build, making it incompatible with Gradle 8.0.
You can use '--warning-mode all' to show the individual deprecation warnings and determine if they come from your own scripts or plugins.
See https://docs.gradle.org/7.5.1/userguide/command_line_interface.html#sec:command_line_warnings
BUILD SUCCESSFUL in 34s
132 actionable tasks: 78 executed, 52 from cache, 2 up-to-date
Publishing build scan...
https://gradle.com/s/5y23ejt3fr3fc
Build step 'Invoke Gradle script' changed build result to SUCCESS
[Gradle] - Launching build.
[src] $ <https://ci-beam.apache.org/job/beam_PostCommit_Java_ValidatesRunner_Dataflow_Java17/ws/src/gradlew> -x shadowJar -x shadowTestJar -x compileJava -x compileTestJava -x jar -x testJar -x classes -x testClasses -Dorg.gradle.java.home=/usr/lib/jvm/java-17-openjdk-amd64 --continue --max-workers=12 -Dorg.gradle.jvmargs=-Xms2g -Dorg.gradle.jvmargs=-Xmx6g -Dorg.gradle.vfs.watch=false -Pdocker-pull-licenses :runners:google-cloud-dataflow-java:validatesRunner
To honour the JVM settings for this build a single-use Daemon process will be forked. See https://docs.gradle.org/7.5.1/userguide/gradle_daemon.html#sec:disabling_the_daemon.
Daemon will be stopped at the end of the build
Configuration on demand is an incubating feature.
> Task :buildSrc:compileJava NO-SOURCE
> Task :buildSrc:compileGroovy
> Task :buildSrc:pluginDescriptors UP-TO-DATE
> Task :buildSrc:processResources UP-TO-DATE
> Task :buildSrc:classes
> Task :buildSrc:jar
> Task :buildSrc:assemble
> Task :buildSrc:spotlessGroovy UP-TO-DATE
> Task :buildSrc:spotlessGroovyCheck UP-TO-DATE
> Task :buildSrc:spotlessGroovyGradle UP-TO-DATE
> Task :buildSrc:spotlessGroovyGradleCheck UP-TO-DATE
> Task :buildSrc:spotlessCheck UP-TO-DATE
> Task :buildSrc:pluginUnderTestMetadata
> Task :buildSrc:compileTestJava NO-SOURCE
> Task :buildSrc:compileTestGroovy NO-SOURCE
> Task :buildSrc:processTestResources NO-SOURCE
> Task :buildSrc:testClasses UP-TO-DATE
> Task :buildSrc:test NO-SOURCE
> Task :buildSrc:validatePlugins
> Task :buildSrc:check
> Task :buildSrc:build
> Task :runners:google-cloud-dataflow-java:validatesRunnerLegacyWorkerTest
org.apache.beam.sdk.schemas.AvroSchemaTest > testAvroPipelineGroupBy FAILED
java.lang.IllegalArgumentException at AvroSchemaTest.java:478
org.apache.beam.sdk.transforms.PerKeyOrderingTest > testMultipleStatefulOrderingWithShuffle FAILED
java.lang.IllegalArgumentException at PerKeyOrderingTest.java:254
org.apache.beam.sdk.transforms.ParDoSchemaTest > testReadAndWrite FAILED
java.lang.IllegalArgumentException at ParDoSchemaTest.java:135
org.apache.beam.sdk.transforms.ParDoSchemaTest > testSchemasPassedThrough FAILED
java.lang.IllegalArgumentException at ParDoSchemaTest.java:439
org.apache.beam.sdk.transforms.ParDoSchemaTest > testSchemaFieldSelectionNested FAILED
java.lang.IllegalArgumentException at ParDoSchemaTest.java:629
org.apache.beam.sdk.transforms.ParDoSchemaTest > testSchemaFieldSelectionUnboxing FAILED
java.lang.IllegalArgumentException at ParDoSchemaTest.java:538
org.apache.beam.sdk.transforms.ParDoSchemaTest > testSchemaFieldDescriptorSelectionUnboxing FAILED
java.lang.IllegalArgumentException at ParDoSchemaTest.java:578
org.apache.beam.sdk.transforms.ParDoSchemaTest > testInferredSchemaPipeline FAILED
java.lang.IllegalArgumentException at ParDoSchemaTest.java:417
org.apache.beam.sdk.transforms.ParDoSchemaTest > testFieldAccessSchemaPipeline FAILED
java.lang.IllegalArgumentException at ParDoSchemaTest.java:328
org.apache.beam.sdk.transforms.ParDoSchemaTest > testSimpleSchemaPipeline FAILED
java.lang.IllegalArgumentException at ParDoSchemaTest.java:101
org.apache.beam.sdk.transforms.ParDoSchemaTest > testSchemaConversionPipeline FAILED
java.lang.IllegalArgumentException at ParDoSchemaTest.java:465
org.apache.beam.sdk.transforms.ParDoSchemaTest > testReadAndWriteWithSchemaRegistry FAILED
java.lang.IllegalArgumentException at ParDoSchemaTest.java:291
org.apache.beam.sdk.transforms.ParDoSchemaTest > testReadAndWriteMultiOutput FAILED
java.lang.IllegalArgumentException at ParDoSchemaTest.java:195
org.apache.beam.sdk.transforms.ParDoSchemaTest > testNestedSchema FAILED
java.lang.IllegalArgumentException at ParDoSchemaTest.java:498
org.apache.beam.sdk.transforms.ParDoSchemaTest > testMapStateSchemaInference FAILED
java.lang.IllegalArgumentException at ParDoSchemaTest.java:879
org.apache.beam.sdk.transforms.PerKeyOrderingTest > testMultipleStatefulOrderingWithoutShuffle FAILED
java.lang.IllegalArgumentException at PerKeyOrderingTest.java:297
297 tests completed, 16 failed, 1 skipped
> Task :runners:google-cloud-dataflow-java:validatesRunnerLegacyWorkerTest FAILED
FAILURE: Build failed with an exception.
* What went wrong:
Execution failed for task ':runners:google-cloud-dataflow-java:validatesRunnerLegacyWorkerTest'.
> There were failing tests. See the report at: file://<https://ci-beam.apache.org/job/beam_PostCommit_Java_ValidatesRunner_Dataflow_Java17/ws/src/runners/google-cloud-dataflow-java/build/reports/tests/validatesRunnerLegacyWorkerTest/index.html>
* Try:
> Run with --stacktrace option to get the stack trace.
> Run with --info or --debug option to get more log output.
* Get more help at https://help.gradle.org
Deprecated Gradle features were used in this build, making it incompatible with Gradle 8.0.
You can use '--warning-mode all' to show the individual deprecation warnings and determine if they come from your own scripts or plugins.
See https://docs.gradle.org/7.5.1/userguide/command_line_interface.html#sec:command_line_warnings
BUILD FAILED in 5h 9m
11 actionable tasks: 5 executed, 6 up-to-date
Publishing build scan...
https://gradle.com/s/ihqfjkkbjvjgy
Build step 'Invoke Gradle script' changed build result to FAILURE
Build step 'Invoke Gradle script' marked build as failure
---------------------------------------------------------------------
To unsubscribe, e-mail: builds-unsubscribe@beam.apache.org
For additional commands, e-mail: builds-help@beam.apache.org
Build failed in Jenkins: beam_PostCommit_Java_ValidatesRunner_Dataflow_Java17 #1654
Posted by Apache Jenkins Server <je...@builds.apache.org>.
See <https://ci-beam.apache.org/job/beam_PostCommit_Java_ValidatesRunner_Dataflow_Java17/1654/display/redirect>
Changes:
------------------------------------------
[...truncated 10.15 KB...]
> Task :runners:core-java:createCheckerFrameworkManifest
> Task :runners:local-java:processResources NO-SOURCE
> Task :runners:java-fn-execution:createCheckerFrameworkManifest
> Task :model:pipeline:createCheckerFrameworkManifest
> Task :sdks:java:core:generateAvroJava NO-SOURCE
> Task :runners:core-construction-java:createCheckerFrameworkManifest
> Task :model:fn-execution:createCheckerFrameworkManifest
> Task :runners:core-java:processResources NO-SOURCE
> Task :runners:core-construction-java:processResources NO-SOURCE
> Task :runners:core-java:processTestResources NO-SOURCE
> Task :runners:java-fn-execution:processResources NO-SOURCE
> Task :sdks:java:extensions:arrow:processResources NO-SOURCE
> Task :sdks:java:extensions:google-cloud-platform-core:processTestResources NO-SOURCE
> Task :sdks:java:expansion-service:createCheckerFrameworkManifest
> Task :runners:core-construction-java:processTestResources NO-SOURCE
> Task :sdks:java:harness:createCheckerFrameworkManifest
> Task :sdks:java:extensions:protobuf:createCheckerFrameworkManifest
> Task :model:job-management:extractProto
> Task :sdks:java:expansion-service:processResources NO-SOURCE
> Task :sdks:java:harness:processResources NO-SOURCE
> Task :runners:direct-java:createCheckerFrameworkManifest
> Task :sdks:java:io:google-cloud-platform:createCheckerFrameworkManifest
> Task :sdks:java:io:kafka:createCheckerFrameworkManifest
> Task :runners:direct-java:processResources NO-SOURCE
> Task :sdks:java:extensions:python:createCheckerFrameworkManifest
> Task :model:fn-execution:extractProto
> Task :runners:direct-java:processTestResources NO-SOURCE
> Task :sdks:java:io:kafka:processResources NO-SOURCE
> Task :sdks:java:io:google-cloud-platform:processResources NO-SOURCE
> Task :sdks:java:extensions:protobuf:extractProto
> Task :sdks:java:io:common:createCheckerFrameworkManifest
> Task :sdks:java:testing:test-utils:createCheckerFrameworkManifest
> Task :runners:google-cloud-dataflow-java:worker:windmill:createCheckerFrameworkManifest
> Task :runners:google-cloud-dataflow-java:worker:createCheckerFrameworkManifest
> Task :sdks:java:extensions:protobuf:processResources NO-SOURCE
> Task :sdks:java:testing:test-utils:processResources NO-SOURCE
> Task :sdks:java:testing:test-utils:processTestResources NO-SOURCE
> Task :sdks:java:extensions:python:processResources
> Task :sdks:java:io:common:compileJava NO-SOURCE
> Task :model:job-management:processResources
> Task :sdks:java:extensions:protobuf:extractTestProto
> Task :sdks:java:io:common:processResources NO-SOURCE
> Task :sdks:java:io:common:classes UP-TO-DATE
> Task :sdks:java:extensions:python:processTestResources NO-SOURCE
> Task :runners:google-cloud-dataflow-java:worker:processResources
> Task :sdks:java:core:generateGrammarSource FROM-CACHE
> Task :runners:google-cloud-dataflow-java:processResources
> Task :runners:google-cloud-dataflow-java:processTestResources NO-SOURCE
> Task :sdks:java:core:processResources
> Task :sdks:java:core:generateTestAvroProtocol NO-SOURCE
> Task :sdks:java:extensions:protobuf:processTestResources
> Task :sdks:java:io:common:jar
> Task :sdks:java:io:common:processTestResources NO-SOURCE
> Task :model:fn-execution:processResources
> Task :sdks:java:io:google-cloud-platform:processTestResources
> Task :sdks:java:core:generateTestAvroJava
> Task :sdks:java:core:generateTestGrammarSource NO-SOURCE
> Task :sdks:java:core:processTestResources
> Task :model:pipeline:extractIncludeProto
> Task :model:pipeline:extractProto
> Task :runners:google-cloud-dataflow-java:worker:windmill:extractIncludeProto
> Task :runners:google-cloud-dataflow-java:worker:windmill:extractProto
> Task :model:pipeline:generateProto FROM-CACHE
> Task :runners:google-cloud-dataflow-java:worker:windmill:generateProto FROM-CACHE
> Task :runners:google-cloud-dataflow-java:worker:windmill:compileJava FROM-CACHE
> Task :runners:google-cloud-dataflow-java:worker:windmill:processResources
> Task :runners:google-cloud-dataflow-java:worker:windmill:classes
> Task :runners:google-cloud-dataflow-java:worker:windmill:shadowJar FROM-CACHE
> Task :model:pipeline:compileJava FROM-CACHE
> Task :model:pipeline:processResources
> Task :model:pipeline:classes
> Task :model:pipeline:jar
> Task :model:pipeline:shadowJar FROM-CACHE
> Task :model:job-management:extractIncludeProto
> Task :model:fn-execution:extractIncludeProto
> Task :model:job-management:generateProto FROM-CACHE
> Task :model:fn-execution:generateProto FROM-CACHE
> Task :model:job-management:compileJava FROM-CACHE
> Task :model:job-management:classes
> Task :model:fn-execution:compileJava FROM-CACHE
> Task :model:fn-execution:classes
> Task :model:job-management:shadowJar FROM-CACHE
> Task :model:fn-execution:shadowJar FROM-CACHE
> Task :sdks:java:core:compileJava FROM-CACHE
> Task :sdks:java:core:classes
> Task :sdks:java:core:shadowJar FROM-CACHE
> Task :runners:local-java:compileJava FROM-CACHE
> Task :runners:local-java:classes UP-TO-DATE
> Task :sdks:java:testing:test-utils:compileJava FROM-CACHE
> Task :sdks:java:testing:test-utils:classes UP-TO-DATE
> Task :sdks:java:io:common:compileTestJava FROM-CACHE
> Task :sdks:java:io:common:testClasses UP-TO-DATE
> Task :runners:local-java:jar
> Task :sdks:java:extensions:arrow:compileJava FROM-CACHE
> Task :sdks:java:extensions:arrow:classes UP-TO-DATE
> Task :sdks:java:testing:test-utils:jar
> Task :sdks:java:extensions:arrow:jar
> Task :sdks:java:io:common:testJar
> Task :sdks:java:testing:test-utils:compileTestJava FROM-CACHE
> Task :sdks:java:testing:test-utils:testClasses UP-TO-DATE
> Task :sdks:java:fn-execution:compileJava FROM-CACHE
> Task :sdks:java:fn-execution:classes UP-TO-DATE
> Task :sdks:java:testing:test-utils:testJar
> Task :sdks:java:core:jar
> Task :sdks:java:fn-execution:jar
> Task :runners:core-construction-java:compileJava FROM-CACHE
> Task :runners:core-construction-java:classes UP-TO-DATE
> Task :runners:core-construction-java:jar
> Task :sdks:java:extensions:python:compileJava FROM-CACHE
> Task :sdks:java:extensions:python:classes
> Task :sdks:java:extensions:python:jar
> Task :runners:core-java:compileJava FROM-CACHE
> Task :runners:core-java:classes UP-TO-DATE
> Task :sdks:java:extensions:protobuf:extractIncludeProto
> Task :sdks:java:extensions:protobuf:generateProto NO-SOURCE
> Task :runners:core-java:jar
> Task :sdks:java:extensions:protobuf:compileJava FROM-CACHE
> Task :sdks:java:extensions:protobuf:classes UP-TO-DATE
> Task :sdks:java:extensions:protobuf:jar
> Task :sdks:java:extensions:google-cloud-platform-core:compileJava FROM-CACHE
> Task :sdks:java:extensions:google-cloud-platform-core:classes UP-TO-DATE
> Task :sdks:java:extensions:google-cloud-platform-core:jar
> Task :sdks:java:harness:compileJava FROM-CACHE
> Task :sdks:java:harness:classes UP-TO-DATE
> Task :sdks:java:harness:jar
> Task :runners:java-fn-execution:compileJava FROM-CACHE
> Task :runners:java-fn-execution:classes UP-TO-DATE
> Task :runners:java-fn-execution:jar
> Task :sdks:java:expansion-service:compileJava FROM-CACHE
> Task :sdks:java:expansion-service:classes UP-TO-DATE
> Task :sdks:java:expansion-service:jar
> Task :runners:direct-java:compileJava FROM-CACHE
> Task :sdks:java:core:compileTestJava FROM-CACHE
> Task :runners:direct-java:classes UP-TO-DATE
> Task :sdks:java:core:testClasses
> Task :sdks:java:io:kafka:compileJava FROM-CACHE
> Task :sdks:java:io:kafka:classes UP-TO-DATE
> Task :sdks:java:io:kafka:jar
> Task :sdks:java:core:shadowTestJar FROM-CACHE
> Task :runners:direct-java:shadowJar FROM-CACHE
> Task :sdks:java:extensions:google-cloud-platform-core:compileTestJava FROM-CACHE
> Task :sdks:java:extensions:google-cloud-platform-core:testClasses UP-TO-DATE
> Task :sdks:java:extensions:google-cloud-platform-core:testJar
> Task :sdks:java:io:google-cloud-platform:compileJava FROM-CACHE
> Task :sdks:java:io:google-cloud-platform:classes UP-TO-DATE
> Task :runners:core-java:compileTestJava FROM-CACHE
> Task :runners:core-java:testClasses UP-TO-DATE
> Task :runners:core-java:testJar
> Task :runners:core-construction-java:compileTestJava FROM-CACHE
> Task :runners:core-construction-java:testClasses UP-TO-DATE
> Task :runners:direct-java:compileTestJava FROM-CACHE
> Task :runners:direct-java:testClasses UP-TO-DATE
> Task :sdks:java:extensions:python:compileTestJava FROM-CACHE
> Task :sdks:java:extensions:python:testClasses UP-TO-DATE
> Task :runners:core-construction-java:testJar
> Task :sdks:java:extensions:python:testJar
> Task :sdks:java:io:google-cloud-platform:jar
> Task :runners:direct-java:shadowTestJar FROM-CACHE
> Task :runners:google-cloud-dataflow-java:compileJava FROM-CACHE
> Task :runners:google-cloud-dataflow-java:classes
> Task :runners:google-cloud-dataflow-java:jar
> Task :sdks:java:extensions:protobuf:extractIncludeTestProto
> Task :sdks:java:extensions:protobuf:generateTestProto FROM-CACHE
> Task :sdks:java:extensions:protobuf:compileTestJava FROM-CACHE
> Task :sdks:java:extensions:protobuf:testClasses
> Task :runners:google-cloud-dataflow-java:worker:compileJava FROM-CACHE
> Task :runners:google-cloud-dataflow-java:worker:classes
> Task :sdks:java:extensions:protobuf:testJar
> Task :runners:google-cloud-dataflow-java:worker:shadowJar FROM-CACHE
> Task :sdks:java:io:google-cloud-platform:compileTestJava FROM-CACHE
> Task :sdks:java:io:google-cloud-platform:testClasses
> Task :sdks:java:io:google-cloud-platform:testJar
> Task :runners:google-cloud-dataflow-java:compileTestJava FROM-CACHE
> Task :runners:google-cloud-dataflow-java:testClasses UP-TO-DATE
> Task :runners:google-cloud-dataflow-java:testJar
Deprecated Gradle features were used in this build, making it incompatible with Gradle 8.0.
You can use '--warning-mode all' to show the individual deprecation warnings and determine if they come from your own scripts or plugins.
See https://docs.gradle.org/7.5.1/userguide/command_line_interface.html#sec:command_line_warnings
BUILD SUCCESSFUL in 1m 1s
132 actionable tasks: 78 executed, 52 from cache, 2 up-to-date
Publishing build scan...
https://gradle.com/s/jonndc5i52bkk
Build step 'Invoke Gradle script' changed build result to SUCCESS
[Gradle] - Launching build.
[src] $ /home/jenkins/jenkins-slave/workspace/beam_PostCommit_Java_ValidatesRunner_Dataflow_Java17/src/gradlew -x shadowJar -x shadowTestJar -x compileJava -x compileTestJava -x jar -x testJar -x classes -x testClasses -Dorg.gradle.java.home=/usr/lib/jvm/java-17-openjdk-amd64 --continue --max-workers=12 -Dorg.gradle.jvmargs=-Xms2g -Dorg.gradle.jvmargs=-Xmx6g -Dorg.gradle.vfs.watch=false -Pdocker-pull-licenses :runners:google-cloud-dataflow-java:validatesRunner
To honour the JVM settings for this build a single-use Daemon process will be forked. See https://docs.gradle.org/7.5.1/userguide/gradle_daemon.html#sec:disabling_the_daemon.
Daemon will be stopped at the end of the build
Configuration on demand is an incubating feature.
> Task :buildSrc:compileJava NO-SOURCE
> Task :buildSrc:compileGroovy
> Task :buildSrc:pluginDescriptors UP-TO-DATE
> Task :buildSrc:processResources UP-TO-DATE
> Task :buildSrc:classes
> Task :buildSrc:jar
> Task :buildSrc:assemble
> Task :buildSrc:spotlessGroovy UP-TO-DATE
> Task :buildSrc:spotlessGroovyCheck UP-TO-DATE
> Task :buildSrc:spotlessGroovyGradle UP-TO-DATE
> Task :buildSrc:spotlessGroovyGradleCheck UP-TO-DATE
> Task :buildSrc:spotlessCheck UP-TO-DATE
> Task :buildSrc:pluginUnderTestMetadata
> Task :buildSrc:compileTestJava NO-SOURCE
> Task :buildSrc:compileTestGroovy NO-SOURCE
> Task :buildSrc:processTestResources NO-SOURCE
> Task :buildSrc:testClasses UP-TO-DATE
> Task :buildSrc:test NO-SOURCE
> Task :buildSrc:validatePlugins
> Task :buildSrc:check
> Task :buildSrc:build
> Task :runners:google-cloud-dataflow-java:validatesRunnerLegacyWorkerTest
org.apache.beam.sdk.schemas.AvroSchemaTest > testAvroPipelineGroupBy FAILED
java.lang.IllegalArgumentException at AvroSchemaTest.java:478
FATAL: command execution failed
java.io.IOException: Backing channel 'apache-beam-jenkins-12' is disconnected.
at hudson.remoting.RemoteInvocationHandler.channelOrFail(RemoteInvocationHandler.java:215)
at hudson.remoting.RemoteInvocationHandler.invoke(RemoteInvocationHandler.java:285)
at com.sun.proxy.$Proxy143.isAlive(Unknown Source)
at hudson.Launcher$RemoteLauncher$ProcImpl.isAlive(Launcher.java:1215)
at hudson.Launcher$RemoteLauncher$ProcImpl.join(Launcher.java:1207)
at hudson.Launcher$ProcStarter.join(Launcher.java:524)
at hudson.plugins.gradle.Gradle.perform(Gradle.java:317)
at hudson.tasks.BuildStepMonitor$1.perform(BuildStepMonitor.java:20)
at hudson.model.AbstractBuild$AbstractBuildExecution.perform(AbstractBuild.java:814)
at hudson.model.Build$BuildExecution.build(Build.java:199)
at hudson.model.Build$BuildExecution.doRun(Build.java:164)
at hudson.model.AbstractBuild$AbstractBuildExecution.run(AbstractBuild.java:522)
at hudson.model.Run.execute(Run.java:1896)
at hudson.model.FreeStyleBuild.run(FreeStyleBuild.java:44)
at hudson.model.ResourceController.execute(ResourceController.java:101)
at hudson.model.Executor.run(Executor.java:442)
Caused by: java.io.IOException: Pipe closed after 0 cycles
at org.apache.sshd.common.channel.ChannelPipedInputStream.read(ChannelPipedInputStream.java:126)
at org.apache.sshd.common.channel.ChannelPipedInputStream.read(ChannelPipedInputStream.java:105)
at hudson.remoting.FlightRecorderInputStream.read(FlightRecorderInputStream.java:94)
at hudson.remoting.ChunkedInputStream.readHeader(ChunkedInputStream.java:75)
at hudson.remoting.ChunkedInputStream.readUntilBreak(ChunkedInputStream.java:105)
at hudson.remoting.ChunkedCommandTransport.readBlock(ChunkedCommandTransport.java:39)
at hudson.remoting.AbstractSynchronousByteArrayCommandTransport.read(AbstractSynchronousByteArrayCommandTransport.java:34)
at hudson.remoting.SynchronousCommandTransport$ReaderThread.run(SynchronousCommandTransport.java:61)
Build step 'Invoke Gradle script' changed build result to FAILURE
Build step 'Invoke Gradle script' marked build as failure
ERROR: apache-beam-jenkins-12 is offline; cannot locate jdk_1.8_latest
---------------------------------------------------------------------
To unsubscribe, e-mail: builds-unsubscribe@beam.apache.org
For additional commands, e-mail: builds-help@beam.apache.org
Jenkins build is back to normal : beam_PostCommit_Java_ValidatesRunner_Dataflow_Java17 #1656
Posted by Apache Jenkins Server <je...@builds.apache.org>.
See <https://ci-beam.apache.org/job/beam_PostCommit_Java_ValidatesRunner_Dataflow_Java17/1656/display/redirect?page=changes>
---------------------------------------------------------------------
To unsubscribe, e-mail: builds-unsubscribe@beam.apache.org
For additional commands, e-mail: builds-help@beam.apache.org
Build failed in Jenkins: beam_PostCommit_Java_ValidatesRunner_Dataflow_Java17 #1655
Posted by Apache Jenkins Server <je...@builds.apache.org>.
See <https://ci-beam.apache.org/job/beam_PostCommit_Java_ValidatesRunner_Dataflow_Java17/1655/display/redirect?page=changes>
Changes:
[noreply] Better error for missing timezone info (#25444)
[noreply] Revert "Replace more uses of `ClassLoadingStrategy.Default.INJECTION`
[noreply] Use context param and error return value in mongodbio.Read SDF methods
[noreply] Revert workers for java tests (#25579)
[noreply] remove unnecessary error check (#25576)
[noreply] Making the default BigQuery write disposition to be WRITE_APPEND
------------------------------------------
[...truncated 12.65 KB...]
> Task :runners:java-fn-execution:processResources NO-SOURCE
> Task :sdks:java:extensions:arrow:processResources NO-SOURCE
> Task :runners:core-construction-java:processResources NO-SOURCE
> Task :sdks:java:expansion-service:processResources NO-SOURCE
> Task :sdks:java:fn-execution:processResources NO-SOURCE
> Task :runners:local-java:processResources NO-SOURCE
> Task :runners:core-java:processResources NO-SOURCE
> Task :sdks:java:extensions:google-cloud-platform-core:processResources NO-SOURCE
> Task :sdks:java:extensions:protobuf:processResources NO-SOURCE
> Task :sdks:java:core:generateAvroJava NO-SOURCE
> Task :runners:core-construction-java:processTestResources NO-SOURCE
> Task :runners:direct-java:processTestResources NO-SOURCE
> Task :runners:core-java:processTestResources NO-SOURCE
> Task :sdks:java:extensions:google-cloud-platform-core:processTestResources NO-SOURCE
> Task :sdks:java:io:kafka:createCheckerFrameworkManifest
> Task :sdks:java:extensions:protobuf:extractTestProto
> Task :runners:google-cloud-dataflow-java:worker:createCheckerFrameworkManifest
> Task :model:job-management:extractProto
> Task :sdks:java:io:kafka:processResources NO-SOURCE
> Task :sdks:java:extensions:python:createCheckerFrameworkManifest
> Task :sdks:java:core:generateGrammarSource FROM-CACHE
> Task :model:fn-execution:extractProto
> Task :sdks:java:io:common:createCheckerFrameworkManifest
> Task :runners:google-cloud-dataflow-java:worker:windmill:createCheckerFrameworkManifest
> Task :sdks:java:testing:test-utils:createCheckerFrameworkManifest
> Task :sdks:java:testing:test-utils:processResources NO-SOURCE
> Task :sdks:java:testing:test-utils:processTestResources NO-SOURCE
> Task :sdks:java:io:common:compileJava NO-SOURCE
> Task :sdks:java:io:google-cloud-platform:createCheckerFrameworkManifest
> Task :sdks:java:extensions:python:processResources
> Task :runners:google-cloud-dataflow-java:worker:processResources
> Task :sdks:java:io:common:processResources NO-SOURCE
> Task :sdks:java:io:common:classes UP-TO-DATE
> Task :sdks:java:extensions:python:processTestResources NO-SOURCE
> Task :sdks:java:io:google-cloud-platform:processResources NO-SOURCE
> Task :model:job-management:processResources
> Task :model:fn-execution:processResources
> Task :runners:google-cloud-dataflow-java:processResources
> Task :sdks:java:core:processResources
> Task :sdks:java:core:generateTestAvroProtocol NO-SOURCE
> Task :runners:google-cloud-dataflow-java:processTestResources NO-SOURCE
> Task :sdks:java:extensions:protobuf:processTestResources
> Task :sdks:java:io:common:jar
> Task :sdks:java:io:common:processTestResources NO-SOURCE
> Task :sdks:java:io:google-cloud-platform:processTestResources
> Task :sdks:java:core:generateTestAvroJava
> Task :sdks:java:core:generateTestGrammarSource NO-SOURCE
> Task :sdks:java:core:processTestResources
> Task :runners:google-cloud-dataflow-java:worker:windmill:extractIncludeProto
> Task :runners:google-cloud-dataflow-java:worker:windmill:extractProto
> Task :model:pipeline:extractIncludeProto
> Task :model:pipeline:extractProto
> Task :runners:google-cloud-dataflow-java:worker:windmill:generateProto FROM-CACHE
> Task :model:pipeline:generateProto FROM-CACHE
> Task :runners:google-cloud-dataflow-java:worker:windmill:compileJava FROM-CACHE
> Task :runners:google-cloud-dataflow-java:worker:windmill:processResources
> Task :runners:google-cloud-dataflow-java:worker:windmill:classes
> Task :runners:google-cloud-dataflow-java:worker:windmill:shadowJar FROM-CACHE
> Task :model:pipeline:compileJava FROM-CACHE
> Task :model:pipeline:processResources
> Task :model:pipeline:classes
> Task :model:pipeline:jar
> Task :model:pipeline:shadowJar FROM-CACHE
> Task :model:fn-execution:extractIncludeProto
> Task :model:job-management:extractIncludeProto
> Task :model:job-management:generateProto FROM-CACHE
> Task :model:fn-execution:generateProto FROM-CACHE
> Task :model:job-management:compileJava FROM-CACHE
> Task :model:job-management:classes
> Task :model:fn-execution:compileJava FROM-CACHE
> Task :model:fn-execution:classes
> Task :model:job-management:shadowJar FROM-CACHE
> Task :model:fn-execution:shadowJar FROM-CACHE
> Task :sdks:java:core:compileJava FROM-CACHE
> Task :sdks:java:core:classes
> Task :sdks:java:core:shadowJar FROM-CACHE
> Task :runners:local-java:compileJava FROM-CACHE
> Task :sdks:java:extensions:arrow:compileJava FROM-CACHE
> Task :runners:local-java:classes UP-TO-DATE
> Task :sdks:java:extensions:arrow:classes UP-TO-DATE
> Task :sdks:java:io:common:compileTestJava FROM-CACHE
> Task :sdks:java:io:common:testClasses UP-TO-DATE
> Task :sdks:java:testing:test-utils:compileJava FROM-CACHE
> Task :sdks:java:testing:test-utils:classes UP-TO-DATE
> Task :runners:local-java:jar
> Task :sdks:java:extensions:arrow:jar
> Task :sdks:java:io:common:testJar
> Task :sdks:java:testing:test-utils:jar
> Task :sdks:java:fn-execution:compileJava FROM-CACHE
> Task :sdks:java:fn-execution:classes UP-TO-DATE
> Task :sdks:java:testing:test-utils:compileTestJava FROM-CACHE
> Task :sdks:java:testing:test-utils:testClasses UP-TO-DATE
> Task :sdks:java:testing:test-utils:testJar
> Task :sdks:java:fn-execution:jar
> Task :sdks:java:core:jar
> Task :runners:core-construction-java:compileJava FROM-CACHE
> Task :runners:core-construction-java:classes UP-TO-DATE
> Task :sdks:java:extensions:protobuf:extractIncludeProto
> Task :sdks:java:extensions:protobuf:generateProto NO-SOURCE
> Task :sdks:java:extensions:protobuf:compileJava FROM-CACHE
> Task :sdks:java:extensions:protobuf:classes UP-TO-DATE
> Task :runners:core-construction-java:jar
> Task :sdks:java:extensions:protobuf:jar
> Task :sdks:java:extensions:python:compileJava FROM-CACHE
> Task :sdks:java:extensions:python:classes
> Task :sdks:java:extensions:python:jar
> Task :runners:core-java:compileJava FROM-CACHE
> Task :runners:core-java:classes UP-TO-DATE
> Task :runners:core-java:jar
> Task :sdks:java:harness:compileJava FROM-CACHE
> Task :sdks:java:harness:classes UP-TO-DATE
> Task :sdks:java:extensions:google-cloud-platform-core:compileJava FROM-CACHE
> Task :sdks:java:extensions:google-cloud-platform-core:classes UP-TO-DATE
> Task :sdks:java:extensions:google-cloud-platform-core:jar
> Task :sdks:java:harness:jar
> Task :runners:java-fn-execution:compileJava FROM-CACHE
> Task :runners:java-fn-execution:classes UP-TO-DATE
> Task :runners:java-fn-execution:jar
> Task :sdks:java:expansion-service:compileJava FROM-CACHE
> Task :sdks:java:expansion-service:classes UP-TO-DATE
> Task :runners:direct-java:compileJava FROM-CACHE
> Task :runners:direct-java:classes UP-TO-DATE
> Task :sdks:java:expansion-service:jar
> Task :sdks:java:core:compileTestJava FROM-CACHE
> Task :sdks:java:core:testClasses
> Task :sdks:java:io:kafka:compileJava FROM-CACHE
> Task :sdks:java:io:kafka:classes UP-TO-DATE
> Task :sdks:java:io:kafka:jar
> Task :runners:direct-java:shadowJar FROM-CACHE
> Task :sdks:java:core:shadowTestJar FROM-CACHE
> Task :sdks:java:extensions:google-cloud-platform-core:compileTestJava FROM-CACHE
> Task :sdks:java:extensions:google-cloud-platform-core:testClasses UP-TO-DATE
> Task :sdks:java:extensions:google-cloud-platform-core:testJar
> Task :sdks:java:io:google-cloud-platform:compileJava FROM-CACHE
> Task :sdks:java:io:google-cloud-platform:classes UP-TO-DATE
> Task :runners:core-java:compileTestJava FROM-CACHE
> Task :runners:core-java:testClasses UP-TO-DATE
> Task :runners:core-construction-java:compileTestJava FROM-CACHE
> Task :runners:core-construction-java:testClasses UP-TO-DATE
> Task :sdks:java:io:google-cloud-platform:jar
> Task :runners:core-java:testJar
> Task :runners:core-construction-java:testJar
> Task :sdks:java:extensions:python:compileTestJava FROM-CACHE
> Task :sdks:java:extensions:python:testClasses UP-TO-DATE
> Task :sdks:java:extensions:python:testJar
> Task :runners:direct-java:compileTestJava FROM-CACHE
> Task :runners:direct-java:testClasses UP-TO-DATE
> Task :runners:google-cloud-dataflow-java:compileJava FROM-CACHE
> Task :runners:google-cloud-dataflow-java:classes
> Task :runners:google-cloud-dataflow-java:jar
> Task :runners:direct-java:shadowTestJar FROM-CACHE
> Task :sdks:java:extensions:protobuf:extractIncludeTestProto
> Task :sdks:java:extensions:protobuf:generateTestProto FROM-CACHE
> Task :runners:google-cloud-dataflow-java:worker:compileJava FROM-CACHE
> Task :runners:google-cloud-dataflow-java:worker:classes
> Task :sdks:java:extensions:protobuf:compileTestJava FROM-CACHE
> Task :sdks:java:extensions:protobuf:testClasses
> Task :sdks:java:extensions:protobuf:testJar
> Task :runners:google-cloud-dataflow-java:worker:shadowJar FROM-CACHE
> Task :sdks:java:io:google-cloud-platform:compileTestJava FROM-CACHE
> Task :sdks:java:io:google-cloud-platform:testClasses
> Task :sdks:java:io:google-cloud-platform:testJar
> Task :runners:google-cloud-dataflow-java:compileTestJava FROM-CACHE
> Task :runners:google-cloud-dataflow-java:testClasses UP-TO-DATE
> Task :runners:google-cloud-dataflow-java:testJar
Deprecated Gradle features were used in this build, making it incompatible with Gradle 8.0.
You can use '--warning-mode all' to show the individual deprecation warnings and determine if they come from your own scripts or plugins.
See https://docs.gradle.org/7.5.1/userguide/command_line_interface.html#sec:command_line_warnings
BUILD SUCCESSFUL in 36s
132 actionable tasks: 78 executed, 52 from cache, 2 up-to-date
Publishing build scan...
https://gradle.com/s/orp77n7nfcqxo
Build step 'Invoke Gradle script' changed build result to SUCCESS
[Gradle] - Launching build.
[src] $ <https://ci-beam.apache.org/job/beam_PostCommit_Java_ValidatesRunner_Dataflow_Java17/ws/src/gradlew> -x shadowJar -x shadowTestJar -x compileJava -x compileTestJava -x jar -x testJar -x classes -x testClasses -Dorg.gradle.java.home=/usr/lib/jvm/java-17-openjdk-amd64 --continue --max-workers=12 -Dorg.gradle.jvmargs=-Xms2g -Dorg.gradle.jvmargs=-Xmx6g -Dorg.gradle.vfs.watch=false -Pdocker-pull-licenses :runners:google-cloud-dataflow-java:validatesRunner
To honour the JVM settings for this build a single-use Daemon process will be forked. See https://docs.gradle.org/7.5.1/userguide/gradle_daemon.html#sec:disabling_the_daemon.
Daemon will be stopped at the end of the build
Configuration on demand is an incubating feature.
> Task :buildSrc:compileJava NO-SOURCE
> Task :buildSrc:compileGroovy
> Task :buildSrc:pluginDescriptors UP-TO-DATE
> Task :buildSrc:processResources UP-TO-DATE
> Task :buildSrc:classes
> Task :buildSrc:jar
> Task :buildSrc:assemble
> Task :buildSrc:spotlessGroovy UP-TO-DATE
> Task :buildSrc:spotlessGroovyCheck UP-TO-DATE
> Task :buildSrc:spotlessGroovyGradle UP-TO-DATE
> Task :buildSrc:spotlessGroovyGradleCheck UP-TO-DATE
> Task :buildSrc:spotlessCheck UP-TO-DATE
> Task :buildSrc:pluginUnderTestMetadata
> Task :buildSrc:compileTestJava NO-SOURCE
> Task :buildSrc:compileTestGroovy NO-SOURCE
> Task :buildSrc:processTestResources NO-SOURCE
> Task :buildSrc:testClasses UP-TO-DATE
> Task :buildSrc:test NO-SOURCE
> Task :buildSrc:validatePlugins
> Task :buildSrc:check
> Task :buildSrc:build
> Task :runners:google-cloud-dataflow-java:validatesRunnerLegacyWorkerTest
org.apache.beam.sdk.transforms.ParDoSchemaTest > testFieldAccessSchemaPipeline FAILED
java.lang.RuntimeException at ParDoSchemaTest.java:349
org.apache.beam.sdk.testing.PAssertTest > testContainsInAnyOrder FAILED
java.lang.RuntimeException at PAssertTest.java:411
org.apache.beam.sdk.transforms.FlattenTest > testFlattenMultipleCoders FAILED
java.lang.RuntimeException at FlattenTest.java:189
org.apache.beam.sdk.transforms.ParDoTest$TimerTests > testEventTimeTimerBounded FAILED
java.lang.RuntimeException at ParDoTest.java:4481
297 tests completed, 4 failed, 1 skipped
> Task :runners:google-cloud-dataflow-java:validatesRunnerLegacyWorkerTest FAILED
FAILURE: Build failed with an exception.
* What went wrong:
Execution failed for task ':runners:google-cloud-dataflow-java:validatesRunnerLegacyWorkerTest'.
> There were failing tests. See the report at: file://<https://ci-beam.apache.org/job/beam_PostCommit_Java_ValidatesRunner_Dataflow_Java17/ws/src/runners/google-cloud-dataflow-java/build/reports/tests/validatesRunnerLegacyWorkerTest/index.html>
* Try:
> Run with --stacktrace option to get the stack trace.
> Run with --info or --debug option to get more log output.
* Get more help at https://help.gradle.org
Deprecated Gradle features were used in this build, making it incompatible with Gradle 8.0.
You can use '--warning-mode all' to show the individual deprecation warnings and determine if they come from your own scripts or plugins.
See https://docs.gradle.org/7.5.1/userguide/command_line_interface.html#sec:command_line_warnings
BUILD FAILED in 5h 17m 2s
11 actionable tasks: 5 executed, 6 up-to-date
Publishing build scan...
https://gradle.com/s/mfmsd2culxxbi
Build step 'Invoke Gradle script' changed build result to FAILURE
Build step 'Invoke Gradle script' marked build as failure
---------------------------------------------------------------------
To unsubscribe, e-mail: builds-unsubscribe@beam.apache.org
For additional commands, e-mail: builds-help@beam.apache.org
Build failed in Jenkins: beam_PostCommit_Java_ValidatesRunner_Dataflow_Java17 #1653
Posted by Apache Jenkins Server <je...@builds.apache.org>.
See <https://ci-beam.apache.org/job/beam_PostCommit_Java_ValidatesRunner_Dataflow_Java17/1653/display/redirect>
Changes:
------------------------------------------
[...truncated 21.65 KB...]
> Task :sdks:java:core:processResources
> Task :sdks:java:io:common:classes UP-TO-DATE
> Task :runners:google-cloud-dataflow-java:processTestResources NO-SOURCE
> Task :sdks:java:core:generateTestAvroProtocol NO-SOURCE
> Task :sdks:java:extensions:protobuf:processTestResources
> Task :sdks:java:io:common:jar
> Task :sdks:java:io:common:processTestResources NO-SOURCE
> Task :model:fn-execution:processResources
> Task :sdks:java:io:google-cloud-platform:processTestResources
> Task :sdks:java:core:generateTestAvroJava
> Task :sdks:java:core:generateTestGrammarSource NO-SOURCE
> Task :sdks:java:core:processTestResources
> Task :runners:google-cloud-dataflow-java:worker:windmill:extractIncludeProto
> Task :model:pipeline:extractIncludeProto
> Task :runners:google-cloud-dataflow-java:worker:windmill:extractProto
> Task :model:pipeline:extractProto
> Task :runners:google-cloud-dataflow-java:worker:windmill:generateProto FROM-CACHE
> Task :model:pipeline:generateProto FROM-CACHE
> Task :runners:google-cloud-dataflow-java:worker:windmill:compileJava FROM-CACHE
> Task :runners:google-cloud-dataflow-java:worker:windmill:processResources
> Task :runners:google-cloud-dataflow-java:worker:windmill:classes
> Task :runners:google-cloud-dataflow-java:worker:windmill:shadowJar FROM-CACHE
> Task :model:pipeline:compileJava FROM-CACHE
> Task :model:pipeline:processResources
> Task :model:pipeline:classes
> Task :model:pipeline:jar
> Task :model:pipeline:shadowJar FROM-CACHE
> Task :model:fn-execution:extractIncludeProto
> Task :model:job-management:extractIncludeProto
> Task :model:job-management:generateProto FROM-CACHE
> Task :model:fn-execution:generateProto FROM-CACHE
> Task :model:fn-execution:compileJava FROM-CACHE
> Task :model:fn-execution:classes
> Task :model:job-management:compileJava FROM-CACHE
> Task :model:job-management:classes
> Task :model:job-management:shadowJar FROM-CACHE
> Task :model:fn-execution:shadowJar FROM-CACHE
> Task :sdks:java:core:compileJava FROM-CACHE
> Task :sdks:java:core:classes
> Task :sdks:java:core:shadowJar FROM-CACHE
> Task :sdks:java:testing:test-utils:compileJava FROM-CACHE
> Task :sdks:java:testing:test-utils:classes UP-TO-DATE
> Task :sdks:java:testing:test-utils:jar
> Task :runners:local-java:compileJava FROM-CACHE
> Task :runners:local-java:classes UP-TO-DATE
> Task :sdks:java:core:jar
> Task :runners:local-java:jar
> Task :sdks:java:io:common:compileTestJava FROM-CACHE
> Task :sdks:java:io:common:testClasses UP-TO-DATE
> Task :sdks:java:extensions:arrow:compileJava FROM-CACHE
> Task :sdks:java:extensions:arrow:classes UP-TO-DATE
> Task :sdks:java:testing:test-utils:compileTestJava FROM-CACHE
> Task :sdks:java:testing:test-utils:testClasses UP-TO-DATE
> Task :sdks:java:extensions:arrow:jar
> Task :sdks:java:testing:test-utils:testJar
> Task :sdks:java:fn-execution:compileJava FROM-CACHE
> Task :sdks:java:fn-execution:classes UP-TO-DATE
> Task :sdks:java:fn-execution:jar
> Task :sdks:java:io:common:testJar
> Task :runners:core-construction-java:compileJava FROM-CACHE
> Task :runners:core-construction-java:classes UP-TO-DATE
> Task :sdks:java:extensions:protobuf:extractIncludeProto
> Task :sdks:java:extensions:protobuf:generateProto NO-SOURCE
> Task :sdks:java:extensions:protobuf:compileJava FROM-CACHE
> Task :sdks:java:extensions:protobuf:classes UP-TO-DATE
> Task :runners:core-construction-java:jar
> Task :sdks:java:extensions:protobuf:jar
> Task :sdks:java:extensions:python:compileJava FROM-CACHE
> Task :sdks:java:extensions:python:classes
> Task :sdks:java:extensions:python:jar
> Task :runners:core-java:compileJava FROM-CACHE
> Task :runners:core-java:classes UP-TO-DATE
> Task :runners:core-java:jar
> Task :sdks:java:extensions:google-cloud-platform-core:compileJava FROM-CACHE
> Task :sdks:java:extensions:google-cloud-platform-core:classes UP-TO-DATE
> Task :sdks:java:harness:compileJava FROM-CACHE
> Task :sdks:java:harness:classes UP-TO-DATE
> Task :sdks:java:extensions:google-cloud-platform-core:jar
> Task :sdks:java:harness:jar
> Task :runners:java-fn-execution:compileJava FROM-CACHE
> Task :runners:java-fn-execution:classes UP-TO-DATE
> Task :runners:java-fn-execution:jar
> Task :sdks:java:expansion-service:compileJava FROM-CACHE
> Task :sdks:java:expansion-service:classes UP-TO-DATE
> Task :sdks:java:expansion-service:jar
> Task :runners:direct-java:compileJava FROM-CACHE
> Task :runners:direct-java:classes UP-TO-DATE
> Task :sdks:java:io:kafka:compileJava FROM-CACHE
> Task :sdks:java:io:kafka:classes UP-TO-DATE
> Task :sdks:java:io:kafka:jar
> Task :sdks:java:core:compileTestJava FROM-CACHE
> Task :sdks:java:core:testClasses
> Task :runners:direct-java:shadowJar FROM-CACHE
> Task :sdks:java:core:shadowTestJar FROM-CACHE
> Task :sdks:java:io:google-cloud-platform:compileJava FROM-CACHE
> Task :sdks:java:io:google-cloud-platform:classes UP-TO-DATE
> Task :sdks:java:extensions:google-cloud-platform-core:compileTestJava FROM-CACHE
> Task :sdks:java:extensions:google-cloud-platform-core:testClasses UP-TO-DATE
> Task :sdks:java:extensions:google-cloud-platform-core:testJar
> Task :runners:core-java:compileTestJava FROM-CACHE
> Task :runners:core-java:testClasses UP-TO-DATE
> Task :runners:core-construction-java:compileTestJava FROM-CACHE
> Task :runners:core-construction-java:testClasses UP-TO-DATE
> Task :runners:core-java:testJar
> Task :sdks:java:io:google-cloud-platform:jar
> Task :runners:core-construction-java:testJar
> Task :sdks:java:extensions:python:compileTestJava FROM-CACHE
> Task :sdks:java:extensions:python:testClasses UP-TO-DATE
> Task :sdks:java:extensions:python:testJar
> Task :runners:direct-java:compileTestJava FROM-CACHE
> Task :runners:direct-java:testClasses UP-TO-DATE
> Task :runners:google-cloud-dataflow-java:compileJava FROM-CACHE
> Task :runners:google-cloud-dataflow-java:classes
> Task :runners:google-cloud-dataflow-java:jar
> Task :runners:direct-java:shadowTestJar FROM-CACHE
> Task :runners:google-cloud-dataflow-java:worker:compileJava FROM-CACHE
> Task :runners:google-cloud-dataflow-java:worker:classes
> Task :sdks:java:extensions:protobuf:extractIncludeTestProto
> Task :sdks:java:extensions:protobuf:generateTestProto FROM-CACHE
> Task :sdks:java:extensions:protobuf:compileTestJava FROM-CACHE
> Task :sdks:java:extensions:protobuf:testClasses
> Task :runners:google-cloud-dataflow-java:worker:shadowJar FROM-CACHE
> Task :sdks:java:extensions:protobuf:testJar
> Task :sdks:java:io:google-cloud-platform:compileTestJava FROM-CACHE
> Task :sdks:java:io:google-cloud-platform:testClasses
> Task :sdks:java:io:google-cloud-platform:testJar
> Task :runners:google-cloud-dataflow-java:compileTestJava FROM-CACHE
> Task :runners:google-cloud-dataflow-java:testClasses UP-TO-DATE
> Task :runners:google-cloud-dataflow-java:testJar
Deprecated Gradle features were used in this build, making it incompatible with Gradle 8.0.
You can use '--warning-mode all' to show the individual deprecation warnings and determine if they come from your own scripts or plugins.
See https://docs.gradle.org/7.5.1/userguide/command_line_interface.html#sec:command_line_warnings
BUILD SUCCESSFUL in 35s
132 actionable tasks: 78 executed, 52 from cache, 2 up-to-date
Publishing build scan...
https://gradle.com/s/v6d7mzbey3abc
Build step 'Invoke Gradle script' changed build result to SUCCESS
[Gradle] - Launching build.
[src] $ <https://ci-beam.apache.org/job/beam_PostCommit_Java_ValidatesRunner_Dataflow_Java17/ws/src/gradlew> -x shadowJar -x shadowTestJar -x compileJava -x compileTestJava -x jar -x testJar -x classes -x testClasses -Dorg.gradle.java.home=/usr/lib/jvm/java-17-openjdk-amd64 --continue --max-workers=12 -Dorg.gradle.jvmargs=-Xms2g -Dorg.gradle.jvmargs=-Xmx6g -Dorg.gradle.vfs.watch=false -Pdocker-pull-licenses :runners:google-cloud-dataflow-java:validatesRunner
To honour the JVM settings for this build a single-use Daemon process will be forked. See https://docs.gradle.org/7.5.1/userguide/gradle_daemon.html#sec:disabling_the_daemon.
Daemon will be stopped at the end of the build
Configuration on demand is an incubating feature.
> Task :buildSrc:compileJava NO-SOURCE
> Task :buildSrc:compileGroovy FROM-CACHE
> Task :buildSrc:pluginDescriptors UP-TO-DATE
> Task :buildSrc:processResources UP-TO-DATE
> Task :buildSrc:classes UP-TO-DATE
> Task :buildSrc:jar
> Task :buildSrc:assemble
> Task :buildSrc:spotlessGroovy UP-TO-DATE
> Task :buildSrc:spotlessGroovyCheck UP-TO-DATE
> Task :buildSrc:spotlessGroovyGradle UP-TO-DATE
> Task :buildSrc:spotlessGroovyGradleCheck UP-TO-DATE
> Task :buildSrc:spotlessCheck UP-TO-DATE
> Task :buildSrc:pluginUnderTestMetadata
> Task :buildSrc:compileTestJava NO-SOURCE
> Task :buildSrc:compileTestGroovy NO-SOURCE
> Task :buildSrc:processTestResources NO-SOURCE
> Task :buildSrc:testClasses UP-TO-DATE
> Task :buildSrc:test NO-SOURCE
> Task :buildSrc:validatePlugins FROM-CACHE
> Task :buildSrc:check UP-TO-DATE
> Task :buildSrc:build
> Task :runners:google-cloud-dataflow-java:validatesRunnerLegacyWorkerTest
org.apache.beam.sdk.schemas.AvroSchemaTest > testAvroPipelineGroupBy FAILED
java.lang.IllegalArgumentException at AvroSchemaTest.java:478
org.apache.beam.sdk.transforms.PerKeyOrderingTest > testMultipleStatefulOrderingWithShuffle FAILED
java.lang.IllegalArgumentException at PerKeyOrderingTest.java:254
org.apache.beam.sdk.transforms.ParDoSchemaTest > testReadAndWrite FAILED
java.lang.IllegalArgumentException at ParDoSchemaTest.java:135
org.apache.beam.sdk.transforms.ParDoSchemaTest > testSchemasPassedThrough FAILED
java.lang.IllegalArgumentException at ParDoSchemaTest.java:439
org.apache.beam.sdk.transforms.ParDoSchemaTest > testSchemaFieldSelectionNested FAILED
java.lang.IllegalArgumentException at ParDoSchemaTest.java:629
org.apache.beam.sdk.transforms.ParDoSchemaTest > testSchemaFieldSelectionUnboxing FAILED
java.lang.IllegalArgumentException at ParDoSchemaTest.java:538
org.apache.beam.sdk.transforms.ParDoSchemaTest > testSchemaFieldDescriptorSelectionUnboxing FAILED
java.lang.IllegalArgumentException at ParDoSchemaTest.java:578
org.apache.beam.sdk.transforms.ParDoSchemaTest > testInferredSchemaPipeline FAILED
java.lang.IllegalArgumentException at ParDoSchemaTest.java:417
org.apache.beam.sdk.transforms.ParDoSchemaTest > testFieldAccessSchemaPipeline FAILED
java.lang.IllegalArgumentException at ParDoSchemaTest.java:328
org.apache.beam.sdk.transforms.ParDoSchemaTest > testSimpleSchemaPipeline FAILED
java.lang.IllegalArgumentException at ParDoSchemaTest.java:101
org.apache.beam.sdk.transforms.ParDoSchemaTest > testSchemaConversionPipeline FAILED
java.lang.IllegalArgumentException at ParDoSchemaTest.java:465
org.apache.beam.sdk.transforms.ParDoSchemaTest > testReadAndWriteWithSchemaRegistry FAILED
java.lang.IllegalArgumentException at ParDoSchemaTest.java:291
org.apache.beam.sdk.transforms.ParDoSchemaTest > testReadAndWriteMultiOutput FAILED
java.lang.IllegalArgumentException at ParDoSchemaTest.java:195
org.apache.beam.sdk.transforms.ParDoSchemaTest > testNestedSchema FAILED
java.lang.IllegalArgumentException at ParDoSchemaTest.java:498
org.apache.beam.sdk.transforms.ParDoSchemaTest > testMapStateSchemaInference FAILED
java.lang.IllegalArgumentException at ParDoSchemaTest.java:879
org.apache.beam.sdk.transforms.PerKeyOrderingTest > testMultipleStatefulOrderingWithoutShuffle FAILED
java.lang.IllegalArgumentException at PerKeyOrderingTest.java:297
297 tests completed, 16 failed, 1 skipped
> Task :runners:google-cloud-dataflow-java:validatesRunnerLegacyWorkerTest FAILED
FAILURE: Build failed with an exception.
* What went wrong:
Execution failed for task ':runners:google-cloud-dataflow-java:validatesRunnerLegacyWorkerTest'.
> There were failing tests. See the report at: file://<https://ci-beam.apache.org/job/beam_PostCommit_Java_ValidatesRunner_Dataflow_Java17/ws/src/runners/google-cloud-dataflow-java/build/reports/tests/validatesRunnerLegacyWorkerTest/index.html>
* Try:
> Run with --stacktrace option to get the stack trace.
> Run with --info or --debug option to get more log output.
* Get more help at https://help.gradle.org
Deprecated Gradle features were used in this build, making it incompatible with Gradle 8.0.
You can use '--warning-mode all' to show the individual deprecation warnings and determine if they come from your own scripts or plugins.
See https://docs.gradle.org/7.5.1/userguide/command_line_interface.html#sec:command_line_warnings
BUILD FAILED in 5h 16m 53s
11 actionable tasks: 3 executed, 2 from cache, 6 up-to-date
Publishing build scan...
https://gradle.com/s/ykwpg2gfhffuy
Build step 'Invoke Gradle script' changed build result to FAILURE
Build step 'Invoke Gradle script' marked build as failure
---------------------------------------------------------------------
To unsubscribe, e-mail: builds-unsubscribe@beam.apache.org
For additional commands, e-mail: builds-help@beam.apache.org
Build failed in Jenkins: beam_PostCommit_Java_ValidatesRunner_Dataflow_Java17 #1652
Posted by Apache Jenkins Server <je...@builds.apache.org>.
See <https://ci-beam.apache.org/job/beam_PostCommit_Java_ValidatesRunner_Dataflow_Java17/1652/display/redirect?page=changes>
Changes:
[noreply] [prism] Add in element manager (#25565)
------------------------------------------
[...truncated 21.89 KB...]
> Task :sdks:java:io:common:processTestResources NO-SOURCE
> Task :sdks:java:core:processResources
> Task :sdks:java:extensions:protobuf:processTestResources
> Task :runners:google-cloud-dataflow-java:processResources
> Task :runners:google-cloud-dataflow-java:processTestResources NO-SOURCE
> Task :sdks:java:core:generateTestAvroProtocol NO-SOURCE
> Task :model:fn-execution:processResources
> Task :sdks:java:io:google-cloud-platform:processTestResources
> Task :sdks:java:core:generateTestAvroJava
> Task :sdks:java:core:generateTestGrammarSource NO-SOURCE
> Task :sdks:java:core:processTestResources
> Task :model:pipeline:extractIncludeProto
> Task :runners:google-cloud-dataflow-java:worker:windmill:extractIncludeProto
> Task :runners:google-cloud-dataflow-java:worker:windmill:extractProto
> Task :model:pipeline:extractProto
> Task :runners:google-cloud-dataflow-java:worker:windmill:generateProto FROM-CACHE
> Task :model:pipeline:generateProto FROM-CACHE
> Task :runners:google-cloud-dataflow-java:worker:windmill:compileJava FROM-CACHE
> Task :runners:google-cloud-dataflow-java:worker:windmill:processResources
> Task :runners:google-cloud-dataflow-java:worker:windmill:classes
> Task :runners:google-cloud-dataflow-java:worker:windmill:shadowJar FROM-CACHE
> Task :model:pipeline:compileJava FROM-CACHE
> Task :model:pipeline:processResources
> Task :model:pipeline:classes
> Task :model:pipeline:jar
> Task :model:pipeline:shadowJar FROM-CACHE
> Task :model:fn-execution:extractIncludeProto
> Task :model:job-management:extractIncludeProto
> Task :model:job-management:generateProto FROM-CACHE
> Task :model:fn-execution:generateProto FROM-CACHE
> Task :model:job-management:compileJava FROM-CACHE
> Task :model:job-management:classes
> Task :model:fn-execution:compileJava FROM-CACHE
> Task :model:fn-execution:classes
> Task :model:job-management:shadowJar FROM-CACHE
> Task :model:fn-execution:shadowJar FROM-CACHE
> Task :sdks:java:core:compileJava FROM-CACHE
> Task :sdks:java:core:classes
> Task :sdks:java:core:shadowJar FROM-CACHE
> Task :runners:local-java:compileJava FROM-CACHE
> Task :runners:local-java:classes UP-TO-DATE
> Task :sdks:java:io:common:compileTestJava FROM-CACHE
> Task :sdks:java:io:common:testClasses UP-TO-DATE
> Task :runners:local-java:jar
> Task :sdks:java:io:common:testJar
> Task :sdks:java:testing:test-utils:compileJava FROM-CACHE
> Task :sdks:java:testing:test-utils:classes UP-TO-DATE
> Task :sdks:java:testing:test-utils:jar
> Task :sdks:java:extensions:arrow:compileJava FROM-CACHE
> Task :sdks:java:extensions:arrow:classes UP-TO-DATE
> Task :sdks:java:extensions:arrow:jar
> Task :sdks:java:testing:test-utils:compileTestJava FROM-CACHE
> Task :sdks:java:testing:test-utils:testClasses UP-TO-DATE
> Task :sdks:java:testing:test-utils:testJar
> Task :sdks:java:fn-execution:compileJava FROM-CACHE
> Task :sdks:java:fn-execution:classes UP-TO-DATE
> Task :sdks:java:fn-execution:jar
> Task :sdks:java:extensions:protobuf:extractIncludeProto
> Task :sdks:java:extensions:protobuf:generateProto NO-SOURCE
> Task :sdks:java:core:jar
> Task :sdks:java:extensions:protobuf:compileJava FROM-CACHE
> Task :sdks:java:extensions:protobuf:classes UP-TO-DATE
> Task :sdks:java:extensions:protobuf:jar
> Task :runners:core-construction-java:compileJava FROM-CACHE
> Task :runners:core-construction-java:classes UP-TO-DATE
> Task :runners:core-construction-java:jar
> Task :sdks:java:extensions:python:compileJava FROM-CACHE
> Task :sdks:java:extensions:python:classes
> Task :sdks:java:extensions:python:jar
> Task :runners:core-java:compileJava FROM-CACHE
> Task :runners:core-java:classes UP-TO-DATE
> Task :runners:core-java:jar
> Task :sdks:java:extensions:google-cloud-platform-core:compileJava FROM-CACHE
> Task :sdks:java:extensions:google-cloud-platform-core:classes UP-TO-DATE
> Task :sdks:java:harness:compileJava FROM-CACHE
> Task :sdks:java:harness:classes UP-TO-DATE
> Task :sdks:java:extensions:google-cloud-platform-core:jar
> Task :sdks:java:harness:jar
> Task :runners:java-fn-execution:compileJava FROM-CACHE
> Task :runners:java-fn-execution:classes UP-TO-DATE
> Task :runners:java-fn-execution:jar
> Task :sdks:java:expansion-service:compileJava FROM-CACHE
> Task :sdks:java:expansion-service:classes UP-TO-DATE
> Task :sdks:java:expansion-service:jar
> Task :runners:direct-java:compileJava FROM-CACHE
> Task :runners:direct-java:classes UP-TO-DATE
> Task :sdks:java:io:kafka:compileJava FROM-CACHE
> Task :sdks:java:io:kafka:classes UP-TO-DATE
> Task :sdks:java:io:kafka:jar
> Task :sdks:java:core:compileTestJava FROM-CACHE
> Task :sdks:java:core:testClasses
> Task :runners:direct-java:shadowJar FROM-CACHE
> Task :sdks:java:core:shadowTestJar FROM-CACHE
> Task :sdks:java:io:google-cloud-platform:compileJava FROM-CACHE
> Task :sdks:java:io:google-cloud-platform:classes UP-TO-DATE
> Task :sdks:java:extensions:google-cloud-platform-core:compileTestJava FROM-CACHE
> Task :sdks:java:extensions:google-cloud-platform-core:testClasses UP-TO-DATE
> Task :sdks:java:extensions:google-cloud-platform-core:testJar
> Task :runners:core-construction-java:compileTestJava FROM-CACHE
> Task :runners:core-construction-java:testClasses UP-TO-DATE
> Task :sdks:java:io:google-cloud-platform:jar
> Task :runners:core-java:compileTestJava FROM-CACHE
> Task :runners:core-java:testClasses UP-TO-DATE
> Task :runners:core-construction-java:testJar
> Task :runners:core-java:testJar
> Task :sdks:java:extensions:python:compileTestJava FROM-CACHE
> Task :sdks:java:extensions:python:testClasses UP-TO-DATE
> Task :sdks:java:extensions:python:testJar
> Task :runners:direct-java:compileTestJava FROM-CACHE
> Task :runners:direct-java:testClasses UP-TO-DATE
> Task :runners:google-cloud-dataflow-java:compileJava FROM-CACHE
> Task :runners:google-cloud-dataflow-java:classes
> Task :runners:google-cloud-dataflow-java:jar
> Task :runners:direct-java:shadowTestJar FROM-CACHE
> Task :runners:google-cloud-dataflow-java:worker:compileJava FROM-CACHE
> Task :runners:google-cloud-dataflow-java:worker:classes
> Task :sdks:java:extensions:protobuf:extractIncludeTestProto
> Task :sdks:java:extensions:protobuf:generateTestProto FROM-CACHE
> Task :sdks:java:extensions:protobuf:compileTestJava FROM-CACHE
> Task :sdks:java:extensions:protobuf:testClasses
> Task :runners:google-cloud-dataflow-java:worker:shadowJar FROM-CACHE
> Task :sdks:java:extensions:protobuf:testJar
> Task :sdks:java:io:google-cloud-platform:compileTestJava FROM-CACHE
> Task :sdks:java:io:google-cloud-platform:testClasses
> Task :sdks:java:io:google-cloud-platform:testJar
> Task :runners:google-cloud-dataflow-java:compileTestJava FROM-CACHE
> Task :runners:google-cloud-dataflow-java:testClasses UP-TO-DATE
> Task :runners:google-cloud-dataflow-java:testJar
Deprecated Gradle features were used in this build, making it incompatible with Gradle 8.0.
You can use '--warning-mode all' to show the individual deprecation warnings and determine if they come from your own scripts or plugins.
See https://docs.gradle.org/7.5.1/userguide/command_line_interface.html#sec:command_line_warnings
BUILD SUCCESSFUL in 28s
132 actionable tasks: 78 executed, 52 from cache, 2 up-to-date
Publishing build scan...
https://gradle.com/s/veoedmnjexrgy
Build step 'Invoke Gradle script' changed build result to SUCCESS
[Gradle] - Launching build.
[src] $ <https://ci-beam.apache.org/job/beam_PostCommit_Java_ValidatesRunner_Dataflow_Java17/ws/src/gradlew> -x shadowJar -x shadowTestJar -x compileJava -x compileTestJava -x jar -x testJar -x classes -x testClasses -Dorg.gradle.java.home=/usr/lib/jvm/java-17-openjdk-amd64 --continue --max-workers=12 -Dorg.gradle.jvmargs=-Xms2g -Dorg.gradle.jvmargs=-Xmx6g -Dorg.gradle.vfs.watch=false -Pdocker-pull-licenses :runners:google-cloud-dataflow-java:validatesRunner
To honour the JVM settings for this build a single-use Daemon process will be forked. See https://docs.gradle.org/7.5.1/userguide/gradle_daemon.html#sec:disabling_the_daemon.
Daemon will be stopped at the end of the build
Configuration on demand is an incubating feature.
> Task :buildSrc:compileJava NO-SOURCE
> Task :buildSrc:compileGroovy FROM-CACHE
> Task :buildSrc:pluginDescriptors UP-TO-DATE
> Task :buildSrc:processResources UP-TO-DATE
> Task :buildSrc:classes UP-TO-DATE
> Task :buildSrc:jar
> Task :buildSrc:assemble
> Task :buildSrc:spotlessGroovy UP-TO-DATE
> Task :buildSrc:spotlessGroovyCheck UP-TO-DATE
> Task :buildSrc:spotlessGroovyGradle UP-TO-DATE
> Task :buildSrc:spotlessGroovyGradleCheck UP-TO-DATE
> Task :buildSrc:spotlessCheck UP-TO-DATE
> Task :buildSrc:pluginUnderTestMetadata
> Task :buildSrc:compileTestJava NO-SOURCE
> Task :buildSrc:compileTestGroovy NO-SOURCE
> Task :buildSrc:processTestResources NO-SOURCE
> Task :buildSrc:testClasses UP-TO-DATE
> Task :buildSrc:test NO-SOURCE
> Task :buildSrc:validatePlugins FROM-CACHE
> Task :buildSrc:check UP-TO-DATE
> Task :buildSrc:build
> Task :runners:google-cloud-dataflow-java:validatesRunnerLegacyWorkerTest
org.apache.beam.sdk.schemas.AvroSchemaTest > testAvroPipelineGroupBy FAILED
java.lang.IllegalArgumentException at AvroSchemaTest.java:478
org.apache.beam.sdk.transforms.PerKeyOrderingTest > testMultipleStatefulOrderingWithShuffle FAILED
java.lang.IllegalArgumentException at PerKeyOrderingTest.java:254
org.apache.beam.sdk.transforms.ParDoSchemaTest > testReadAndWrite FAILED
java.lang.IllegalArgumentException at ParDoSchemaTest.java:135
org.apache.beam.sdk.transforms.ParDoSchemaTest > testSchemasPassedThrough FAILED
java.lang.IllegalArgumentException at ParDoSchemaTest.java:439
org.apache.beam.sdk.transforms.ParDoSchemaTest > testSchemaFieldSelectionNested FAILED
java.lang.IllegalArgumentException at ParDoSchemaTest.java:629
org.apache.beam.sdk.transforms.ParDoSchemaTest > testSchemaFieldSelectionUnboxing FAILED
java.lang.IllegalArgumentException at ParDoSchemaTest.java:538
org.apache.beam.sdk.transforms.ParDoSchemaTest > testSchemaFieldDescriptorSelectionUnboxing FAILED
java.lang.IllegalArgumentException at ParDoSchemaTest.java:578
org.apache.beam.sdk.transforms.ParDoSchemaTest > testInferredSchemaPipeline FAILED
java.lang.IllegalArgumentException at ParDoSchemaTest.java:417
org.apache.beam.sdk.transforms.ParDoSchemaTest > testFieldAccessSchemaPipeline FAILED
java.lang.IllegalArgumentException at ParDoSchemaTest.java:328
org.apache.beam.sdk.transforms.ParDoSchemaTest > testSimpleSchemaPipeline FAILED
java.lang.IllegalArgumentException at ParDoSchemaTest.java:101
org.apache.beam.sdk.transforms.ParDoSchemaTest > testSchemaConversionPipeline FAILED
java.lang.IllegalArgumentException at ParDoSchemaTest.java:465
org.apache.beam.sdk.transforms.ParDoSchemaTest > testReadAndWriteWithSchemaRegistry FAILED
java.lang.IllegalArgumentException at ParDoSchemaTest.java:291
org.apache.beam.sdk.transforms.ParDoSchemaTest > testReadAndWriteMultiOutput FAILED
java.lang.IllegalArgumentException at ParDoSchemaTest.java:195
org.apache.beam.sdk.transforms.ParDoSchemaTest > testNestedSchema FAILED
java.lang.IllegalArgumentException at ParDoSchemaTest.java:498
org.apache.beam.sdk.transforms.ParDoSchemaTest > testMapStateSchemaInference FAILED
java.lang.IllegalArgumentException at ParDoSchemaTest.java:879
org.apache.beam.sdk.transforms.PerKeyOrderingTest > testMultipleStatefulOrderingWithoutShuffle FAILED
java.lang.IllegalArgumentException at PerKeyOrderingTest.java:297
297 tests completed, 16 failed, 1 skipped
> Task :runners:google-cloud-dataflow-java:validatesRunnerLegacyWorkerTest FAILED
FAILURE: Build failed with an exception.
* What went wrong:
Execution failed for task ':runners:google-cloud-dataflow-java:validatesRunnerLegacyWorkerTest'.
> There were failing tests. See the report at: file://<https://ci-beam.apache.org/job/beam_PostCommit_Java_ValidatesRunner_Dataflow_Java17/ws/src/runners/google-cloud-dataflow-java/build/reports/tests/validatesRunnerLegacyWorkerTest/index.html>
* Try:
> Run with --stacktrace option to get the stack trace.
> Run with --info or --debug option to get more log output.
* Get more help at https://help.gradle.org
Deprecated Gradle features were used in this build, making it incompatible with Gradle 8.0.
You can use '--warning-mode all' to show the individual deprecation warnings and determine if they come from your own scripts or plugins.
See https://docs.gradle.org/7.5.1/userguide/command_line_interface.html#sec:command_line_warnings
BUILD FAILED in 5h 15m 6s
11 actionable tasks: 3 executed, 2 from cache, 6 up-to-date
Publishing build scan...
https://gradle.com/s/7oukzjrxtxk2o
Build step 'Invoke Gradle script' changed build result to FAILURE
Build step 'Invoke Gradle script' marked build as failure
---------------------------------------------------------------------
To unsubscribe, e-mail: builds-unsubscribe@beam.apache.org
For additional commands, e-mail: builds-help@beam.apache.org
Build failed in Jenkins: beam_PostCommit_Java_ValidatesRunner_Dataflow_Java17 #1651
Posted by Apache Jenkins Server <je...@builds.apache.org>.
See <https://ci-beam.apache.org/job/beam_PostCommit_Java_ValidatesRunner_Dataflow_Java17/1651/display/redirect?page=changes>
Changes:
[noreply] [#24789][prism] Add testdofns for later (#25557)
[noreply] [#24789][prism] Minimum required jobservices (#25556)
[noreply] [#24789][prism] Handlers for combine, ParDo, GBK, Flatten (#25558)
[noreply] [prism] Tiny lint fixes (#25564)
[noreply] minor error handling fixes (#25555)
------------------------------------------
[...truncated 21.88 KB...]
> Task :sdks:java:core:processResources
> Task :runners:google-cloud-dataflow-java:processResources
> Task :sdks:java:io:common:jar
> Task :runners:google-cloud-dataflow-java:processTestResources NO-SOURCE
> Task :sdks:java:core:generateTestAvroProtocol NO-SOURCE
> Task :sdks:java:io:common:processTestResources NO-SOURCE
> Task :model:fn-execution:processResources
> Task :sdks:java:io:google-cloud-platform:processTestResources
> Task :sdks:java:core:generateTestAvroJava
> Task :sdks:java:core:generateTestGrammarSource NO-SOURCE
> Task :sdks:java:core:processTestResources
> Task :runners:google-cloud-dataflow-java:worker:windmill:extractIncludeProto
> Task :model:pipeline:extractIncludeProto
> Task :runners:google-cloud-dataflow-java:worker:windmill:extractProto
> Task :model:pipeline:extractProto
> Task :runners:google-cloud-dataflow-java:worker:windmill:generateProto FROM-CACHE
> Task :model:pipeline:generateProto FROM-CACHE
> Task :runners:google-cloud-dataflow-java:worker:windmill:compileJava FROM-CACHE
> Task :runners:google-cloud-dataflow-java:worker:windmill:processResources
> Task :runners:google-cloud-dataflow-java:worker:windmill:classes
> Task :runners:google-cloud-dataflow-java:worker:windmill:shadowJar FROM-CACHE
> Task :model:pipeline:compileJava FROM-CACHE
> Task :model:pipeline:processResources
> Task :model:pipeline:classes
> Task :model:pipeline:jar
> Task :model:pipeline:shadowJar FROM-CACHE
> Task :model:job-management:extractIncludeProto
> Task :model:fn-execution:extractIncludeProto
> Task :model:job-management:generateProto FROM-CACHE
> Task :model:fn-execution:generateProto FROM-CACHE
> Task :model:fn-execution:compileJava FROM-CACHE
> Task :model:fn-execution:classes
> Task :model:job-management:compileJava FROM-CACHE
> Task :model:job-management:classes
> Task :model:fn-execution:shadowJar FROM-CACHE
> Task :model:job-management:shadowJar FROM-CACHE
> Task :sdks:java:core:compileJava FROM-CACHE
> Task :sdks:java:core:classes
> Task :sdks:java:core:shadowJar FROM-CACHE
> Task :sdks:java:extensions:arrow:compileJava FROM-CACHE
> Task :sdks:java:extensions:arrow:classes UP-TO-DATE
> Task :sdks:java:extensions:arrow:jar
> Task :sdks:java:io:common:compileTestJava FROM-CACHE
> Task :sdks:java:io:common:testClasses UP-TO-DATE
> Task :runners:local-java:compileJava FROM-CACHE
> Task :runners:local-java:classes UP-TO-DATE
> Task :sdks:java:testing:test-utils:compileJava FROM-CACHE
> Task :sdks:java:testing:test-utils:classes UP-TO-DATE
> Task :sdks:java:io:common:testJar
> Task :runners:local-java:jar
> Task :sdks:java:testing:test-utils:jar
> Task :sdks:java:testing:test-utils:compileTestJava FROM-CACHE
> Task :sdks:java:testing:test-utils:testClasses UP-TO-DATE
> Task :sdks:java:core:jar
> Task :sdks:java:testing:test-utils:testJar
> Task :sdks:java:fn-execution:compileJava FROM-CACHE
> Task :sdks:java:fn-execution:classes UP-TO-DATE
> Task :sdks:java:fn-execution:jar
> Task :runners:core-construction-java:compileJava FROM-CACHE
> Task :runners:core-construction-java:classes UP-TO-DATE
> Task :sdks:java:extensions:protobuf:extractIncludeProto
> Task :sdks:java:extensions:protobuf:generateProto NO-SOURCE
> Task :sdks:java:extensions:protobuf:compileJava FROM-CACHE
> Task :sdks:java:extensions:protobuf:classes UP-TO-DATE
> Task :runners:core-construction-java:jar
> Task :sdks:java:extensions:protobuf:jar
> Task :sdks:java:extensions:python:compileJava FROM-CACHE
> Task :sdks:java:extensions:python:classes
> Task :sdks:java:extensions:python:jar
> Task :runners:core-java:compileJava FROM-CACHE
> Task :runners:core-java:classes UP-TO-DATE
> Task :runners:core-java:jar
> Task :sdks:java:extensions:google-cloud-platform-core:compileJava FROM-CACHE
> Task :sdks:java:extensions:google-cloud-platform-core:classes UP-TO-DATE
> Task :sdks:java:extensions:google-cloud-platform-core:jar
> Task :sdks:java:harness:compileJava FROM-CACHE
> Task :sdks:java:harness:classes UP-TO-DATE
> Task :sdks:java:harness:jar
> Task :runners:java-fn-execution:compileJava FROM-CACHE
> Task :runners:java-fn-execution:classes UP-TO-DATE
> Task :runners:java-fn-execution:jar
> Task :sdks:java:expansion-service:compileJava FROM-CACHE
> Task :sdks:java:expansion-service:classes UP-TO-DATE
> Task :sdks:java:expansion-service:jar
> Task :runners:direct-java:compileJava FROM-CACHE
> Task :runners:direct-java:classes UP-TO-DATE
> Task :sdks:java:io:kafka:compileJava FROM-CACHE
> Task :sdks:java:io:kafka:classes UP-TO-DATE
> Task :sdks:java:io:kafka:jar
> Task :sdks:java:core:compileTestJava FROM-CACHE
> Task :sdks:java:core:testClasses
> Task :sdks:java:core:shadowTestJar FROM-CACHE
> Task :runners:direct-java:shadowJar FROM-CACHE
> Task :sdks:java:io:google-cloud-platform:compileJava FROM-CACHE
> Task :sdks:java:io:google-cloud-platform:classes UP-TO-DATE
> Task :sdks:java:extensions:google-cloud-platform-core:compileTestJava FROM-CACHE
> Task :sdks:java:extensions:google-cloud-platform-core:testClasses UP-TO-DATE
> Task :sdks:java:extensions:google-cloud-platform-core:testJar
> Task :runners:core-java:compileTestJava FROM-CACHE
> Task :runners:core-java:testClasses UP-TO-DATE
> Task :runners:core-construction-java:compileTestJava FROM-CACHE
> Task :runners:core-construction-java:testClasses UP-TO-DATE
> Task :runners:core-java:testJar
> Task :runners:core-construction-java:testJar
> Task :sdks:java:io:google-cloud-platform:jar
> Task :sdks:java:extensions:python:compileTestJava FROM-CACHE
> Task :sdks:java:extensions:python:testClasses UP-TO-DATE
> Task :sdks:java:extensions:python:testJar
> Task :runners:direct-java:compileTestJava FROM-CACHE
> Task :runners:direct-java:testClasses UP-TO-DATE
> Task :runners:google-cloud-dataflow-java:compileJava FROM-CACHE
> Task :runners:google-cloud-dataflow-java:classes
> Task :runners:direct-java:shadowTestJar FROM-CACHE
> Task :runners:google-cloud-dataflow-java:jar
> Task :runners:google-cloud-dataflow-java:worker:compileJava FROM-CACHE
> Task :runners:google-cloud-dataflow-java:worker:classes
> Task :sdks:java:extensions:protobuf:extractIncludeTestProto
> Task :sdks:java:extensions:protobuf:generateTestProto FROM-CACHE
> Task :sdks:java:extensions:protobuf:compileTestJava FROM-CACHE
> Task :sdks:java:extensions:protobuf:testClasses
> Task :runners:google-cloud-dataflow-java:worker:shadowJar FROM-CACHE
> Task :sdks:java:extensions:protobuf:testJar
> Task :sdks:java:io:google-cloud-platform:compileTestJava FROM-CACHE
> Task :sdks:java:io:google-cloud-platform:testClasses
> Task :sdks:java:io:google-cloud-platform:testJar
> Task :runners:google-cloud-dataflow-java:compileTestJava FROM-CACHE
> Task :runners:google-cloud-dataflow-java:testClasses UP-TO-DATE
> Task :runners:google-cloud-dataflow-java:testJar
Deprecated Gradle features were used in this build, making it incompatible with Gradle 8.0.
You can use '--warning-mode all' to show the individual deprecation warnings and determine if they come from your own scripts or plugins.
See https://docs.gradle.org/7.5.1/userguide/command_line_interface.html#sec:command_line_warnings
BUILD SUCCESSFUL in 28s
132 actionable tasks: 78 executed, 52 from cache, 2 up-to-date
Publishing build scan...
https://gradle.com/s/qrd26iuvspwe6
Build step 'Invoke Gradle script' changed build result to SUCCESS
[Gradle] - Launching build.
[src] $ <https://ci-beam.apache.org/job/beam_PostCommit_Java_ValidatesRunner_Dataflow_Java17/ws/src/gradlew> -x shadowJar -x shadowTestJar -x compileJava -x compileTestJava -x jar -x testJar -x classes -x testClasses -Dorg.gradle.java.home=/usr/lib/jvm/java-17-openjdk-amd64 --continue --max-workers=12 -Dorg.gradle.jvmargs=-Xms2g -Dorg.gradle.jvmargs=-Xmx6g -Dorg.gradle.vfs.watch=false -Pdocker-pull-licenses :runners:google-cloud-dataflow-java:validatesRunner
To honour the JVM settings for this build a single-use Daemon process will be forked. See https://docs.gradle.org/7.5.1/userguide/gradle_daemon.html#sec:disabling_the_daemon.
Daemon will be stopped at the end of the build
Configuration on demand is an incubating feature.
> Task :buildSrc:compileJava NO-SOURCE
> Task :buildSrc:compileGroovy FROM-CACHE
> Task :buildSrc:pluginDescriptors UP-TO-DATE
> Task :buildSrc:processResources UP-TO-DATE
> Task :buildSrc:classes UP-TO-DATE
> Task :buildSrc:jar
> Task :buildSrc:assemble
> Task :buildSrc:spotlessGroovy UP-TO-DATE
> Task :buildSrc:spotlessGroovyCheck UP-TO-DATE
> Task :buildSrc:spotlessGroovyGradle UP-TO-DATE
> Task :buildSrc:spotlessGroovyGradleCheck UP-TO-DATE
> Task :buildSrc:spotlessCheck UP-TO-DATE
> Task :buildSrc:pluginUnderTestMetadata
> Task :buildSrc:compileTestJava NO-SOURCE
> Task :buildSrc:compileTestGroovy NO-SOURCE
> Task :buildSrc:processTestResources NO-SOURCE
> Task :buildSrc:testClasses UP-TO-DATE
> Task :buildSrc:test NO-SOURCE
> Task :buildSrc:validatePlugins FROM-CACHE
> Task :buildSrc:check UP-TO-DATE
> Task :buildSrc:build
> Task :runners:google-cloud-dataflow-java:validatesRunnerLegacyWorkerTest
org.apache.beam.sdk.schemas.AvroSchemaTest > testAvroPipelineGroupBy FAILED
java.lang.IllegalArgumentException at AvroSchemaTest.java:478
org.apache.beam.sdk.transforms.PerKeyOrderingTest > testMultipleStatefulOrderingWithShuffle FAILED
java.lang.IllegalArgumentException at PerKeyOrderingTest.java:254
org.apache.beam.sdk.transforms.ParDoSchemaTest > testReadAndWrite FAILED
java.lang.IllegalArgumentException at ParDoSchemaTest.java:135
org.apache.beam.sdk.transforms.ParDoSchemaTest > testSchemasPassedThrough FAILED
java.lang.IllegalArgumentException at ParDoSchemaTest.java:439
org.apache.beam.sdk.transforms.ParDoSchemaTest > testSchemaFieldSelectionNested FAILED
java.lang.IllegalArgumentException at ParDoSchemaTest.java:629
org.apache.beam.sdk.transforms.ParDoSchemaTest > testSchemaFieldSelectionUnboxing FAILED
java.lang.IllegalArgumentException at ParDoSchemaTest.java:538
org.apache.beam.sdk.transforms.ParDoSchemaTest > testSchemaFieldDescriptorSelectionUnboxing FAILED
java.lang.IllegalArgumentException at ParDoSchemaTest.java:578
org.apache.beam.sdk.transforms.ParDoSchemaTest > testInferredSchemaPipeline FAILED
java.lang.IllegalArgumentException at ParDoSchemaTest.java:417
org.apache.beam.sdk.transforms.ParDoSchemaTest > testFieldAccessSchemaPipeline FAILED
java.lang.IllegalArgumentException at ParDoSchemaTest.java:328
org.apache.beam.sdk.transforms.ParDoSchemaTest > testSimpleSchemaPipeline FAILED
java.lang.IllegalArgumentException at ParDoSchemaTest.java:101
org.apache.beam.sdk.transforms.ParDoSchemaTest > testSchemaConversionPipeline FAILED
java.lang.IllegalArgumentException at ParDoSchemaTest.java:465
org.apache.beam.sdk.transforms.ParDoSchemaTest > testReadAndWriteWithSchemaRegistry FAILED
java.lang.IllegalArgumentException at ParDoSchemaTest.java:291
org.apache.beam.sdk.transforms.ParDoSchemaTest > testReadAndWriteMultiOutput FAILED
java.lang.IllegalArgumentException at ParDoSchemaTest.java:195
org.apache.beam.sdk.transforms.ParDoSchemaTest > testNestedSchema FAILED
java.lang.IllegalArgumentException at ParDoSchemaTest.java:498
org.apache.beam.sdk.transforms.ParDoSchemaTest > testMapStateSchemaInference FAILED
java.lang.IllegalArgumentException at ParDoSchemaTest.java:879
org.apache.beam.sdk.transforms.PerKeyOrderingTest > testMultipleStatefulOrderingWithoutShuffle FAILED
java.lang.IllegalArgumentException at PerKeyOrderingTest.java:297
297 tests completed, 16 failed, 1 skipped
> Task :runners:google-cloud-dataflow-java:validatesRunnerLegacyWorkerTest FAILED
FAILURE: Build failed with an exception.
* What went wrong:
Execution failed for task ':runners:google-cloud-dataflow-java:validatesRunnerLegacyWorkerTest'.
> There were failing tests. See the report at: file://<https://ci-beam.apache.org/job/beam_PostCommit_Java_ValidatesRunner_Dataflow_Java17/ws/src/runners/google-cloud-dataflow-java/build/reports/tests/validatesRunnerLegacyWorkerTest/index.html>
* Try:
> Run with --stacktrace option to get the stack trace.
> Run with --info or --debug option to get more log output.
* Get more help at https://help.gradle.org
Deprecated Gradle features were used in this build, making it incompatible with Gradle 8.0.
You can use '--warning-mode all' to show the individual deprecation warnings and determine if they come from your own scripts or plugins.
See https://docs.gradle.org/7.5.1/userguide/command_line_interface.html#sec:command_line_warnings
BUILD FAILED in 5h 7m 6s
11 actionable tasks: 3 executed, 2 from cache, 6 up-to-date
Publishing build scan...
https://gradle.com/s/bnufadf7nulpg
Build step 'Invoke Gradle script' changed build result to FAILURE
Build step 'Invoke Gradle script' marked build as failure
---------------------------------------------------------------------
To unsubscribe, e-mail: builds-unsubscribe@beam.apache.org
For additional commands, e-mail: builds-help@beam.apache.org
Build failed in Jenkins: beam_PostCommit_Java_ValidatesRunner_Dataflow_Java17 #1650
Posted by Apache Jenkins Server <je...@builds.apache.org>.
See <https://ci-beam.apache.org/job/beam_PostCommit_Java_ValidatesRunner_Dataflow_Java17/1650/display/redirect>
Changes:
------------------------------------------
[...truncated 21.67 KB...]
> Task :sdks:java:extensions:python:processResources
> Task :sdks:java:core:processResources
> Task :runners:google-cloud-dataflow-java:processTestResources NO-SOURCE
> Task :sdks:java:extensions:python:processTestResources NO-SOURCE
> Task :sdks:java:core:generateTestAvroProtocol NO-SOURCE
> Task :sdks:java:extensions:protobuf:processTestResources
> Task :sdks:java:io:common:jar
> Task :sdks:java:io:common:processTestResources NO-SOURCE
> Task :sdks:java:io:google-cloud-platform:processTestResources
> Task :sdks:java:core:generateTestAvroJava
> Task :sdks:java:core:generateTestGrammarSource NO-SOURCE
> Task :sdks:java:core:processTestResources
> Task :model:pipeline:extractIncludeProto
> Task :model:pipeline:extractProto
> Task :runners:google-cloud-dataflow-java:worker:windmill:extractIncludeProto
> Task :runners:google-cloud-dataflow-java:worker:windmill:extractProto
> Task :runners:google-cloud-dataflow-java:worker:windmill:generateProto FROM-CACHE
> Task :model:pipeline:generateProto FROM-CACHE
> Task :runners:google-cloud-dataflow-java:worker:windmill:compileJava FROM-CACHE
> Task :runners:google-cloud-dataflow-java:worker:windmill:processResources
> Task :runners:google-cloud-dataflow-java:worker:windmill:classes
> Task :model:pipeline:compileJava FROM-CACHE
> Task :runners:google-cloud-dataflow-java:worker:windmill:shadowJar FROM-CACHE
> Task :model:pipeline:processResources
> Task :model:pipeline:classes
> Task :model:pipeline:jar
> Task :model:pipeline:shadowJar FROM-CACHE
> Task :model:job-management:extractIncludeProto
> Task :model:fn-execution:extractIncludeProto
> Task :model:job-management:generateProto FROM-CACHE
> Task :model:fn-execution:generateProto FROM-CACHE
> Task :model:job-management:compileJava FROM-CACHE
> Task :model:job-management:classes
> Task :model:job-management:shadowJar FROM-CACHE
> Task :model:fn-execution:compileJava FROM-CACHE
> Task :model:fn-execution:classes
> Task :model:fn-execution:shadowJar FROM-CACHE
> Task :sdks:java:core:compileJava FROM-CACHE
> Task :sdks:java:core:classes
> Task :sdks:java:core:shadowJar FROM-CACHE
> Task :sdks:java:extensions:arrow:compileJava FROM-CACHE
> Task :sdks:java:extensions:arrow:classes UP-TO-DATE
> Task :sdks:java:extensions:arrow:jar
> Task :sdks:java:io:common:compileTestJava FROM-CACHE
> Task :runners:local-java:compileJava FROM-CACHE
> Task :sdks:java:io:common:testClasses UP-TO-DATE
> Task :runners:local-java:classes UP-TO-DATE
> Task :runners:local-java:jar
> Task :sdks:java:io:common:testJar
> Task :sdks:java:testing:test-utils:compileJava FROM-CACHE
> Task :sdks:java:testing:test-utils:classes UP-TO-DATE
> Task :sdks:java:extensions:protobuf:extractIncludeProto
> Task :sdks:java:extensions:protobuf:generateProto NO-SOURCE
> Task :sdks:java:testing:test-utils:jar
> Task :sdks:java:fn-execution:compileJava FROM-CACHE
> Task :sdks:java:fn-execution:classes UP-TO-DATE
> Task :sdks:java:extensions:protobuf:compileJava FROM-CACHE
> Task :sdks:java:extensions:protobuf:classes UP-TO-DATE
> Task :sdks:java:testing:test-utils:compileTestJava FROM-CACHE
> Task :sdks:java:testing:test-utils:testClasses UP-TO-DATE
> Task :sdks:java:extensions:protobuf:jar
> Task :sdks:java:testing:test-utils:testJar
> Task :sdks:java:fn-execution:jar
> Task :runners:core-construction-java:compileJava FROM-CACHE
> Task :runners:core-construction-java:classes UP-TO-DATE
> Task :sdks:java:core:jar
> Task :runners:core-construction-java:jar
> Task :sdks:java:extensions:python:compileJava FROM-CACHE
> Task :sdks:java:extensions:python:classes
> Task :sdks:java:extensions:python:jar
> Task :runners:core-java:compileJava FROM-CACHE
> Task :runners:core-java:classes UP-TO-DATE
> Task :runners:core-java:jar
> Task :sdks:java:extensions:google-cloud-platform-core:compileJava FROM-CACHE
> Task :sdks:java:extensions:google-cloud-platform-core:classes UP-TO-DATE
> Task :sdks:java:harness:compileJava FROM-CACHE
> Task :sdks:java:harness:classes UP-TO-DATE
> Task :sdks:java:extensions:google-cloud-platform-core:jar
> Task :sdks:java:harness:jar
> Task :runners:java-fn-execution:compileJava FROM-CACHE
> Task :runners:java-fn-execution:classes UP-TO-DATE
> Task :runners:java-fn-execution:jar
> Task :sdks:java:expansion-service:compileJava FROM-CACHE
> Task :sdks:java:expansion-service:classes UP-TO-DATE
> Task :sdks:java:expansion-service:jar
> Task :runners:direct-java:compileJava FROM-CACHE
> Task :runners:direct-java:classes UP-TO-DATE
> Task :sdks:java:io:kafka:compileJava FROM-CACHE
> Task :sdks:java:io:kafka:classes UP-TO-DATE
> Task :runners:direct-java:shadowJar FROM-CACHE
> Task :sdks:java:io:kafka:jar
> Task :sdks:java:core:compileTestJava FROM-CACHE
> Task :sdks:java:core:testClasses
> Task :sdks:java:io:google-cloud-platform:compileJava FROM-CACHE
> Task :sdks:java:io:google-cloud-platform:classes UP-TO-DATE
> Task :sdks:java:core:shadowTestJar FROM-CACHE
> Task :sdks:java:io:google-cloud-platform:jar
> Task :sdks:java:extensions:google-cloud-platform-core:compileTestJava FROM-CACHE
> Task :sdks:java:extensions:google-cloud-platform-core:testClasses UP-TO-DATE
> Task :sdks:java:extensions:google-cloud-platform-core:testJar
> Task :runners:core-construction-java:compileTestJava FROM-CACHE
> Task :runners:core-construction-java:testClasses UP-TO-DATE
> Task :runners:google-cloud-dataflow-java:compileJava FROM-CACHE
> Task :runners:google-cloud-dataflow-java:classes
> Task :runners:core-java:compileTestJava FROM-CACHE
> Task :runners:core-java:testClasses UP-TO-DATE
> Task :runners:core-construction-java:testJar
> Task :runners:core-java:testJar
> Task :runners:google-cloud-dataflow-java:jar
> Task :sdks:java:extensions:python:compileTestJava FROM-CACHE
> Task :sdks:java:extensions:python:testClasses UP-TO-DATE
> Task :sdks:java:extensions:python:testJar
> Task :runners:direct-java:compileTestJava FROM-CACHE
> Task :runners:direct-java:testClasses UP-TO-DATE
> Task :runners:direct-java:shadowTestJar FROM-CACHE
> Task :runners:google-cloud-dataflow-java:worker:compileJava FROM-CACHE
> Task :runners:google-cloud-dataflow-java:worker:classes
> Task :sdks:java:extensions:protobuf:extractIncludeTestProto
> Task :sdks:java:extensions:protobuf:generateTestProto FROM-CACHE
> Task :runners:google-cloud-dataflow-java:worker:shadowJar FROM-CACHE
> Task :sdks:java:extensions:protobuf:compileTestJava FROM-CACHE
> Task :sdks:java:extensions:protobuf:testClasses
> Task :sdks:java:extensions:protobuf:testJar
> Task :sdks:java:io:google-cloud-platform:compileTestJava FROM-CACHE
> Task :sdks:java:io:google-cloud-platform:testClasses
> Task :sdks:java:io:google-cloud-platform:testJar
> Task :runners:google-cloud-dataflow-java:compileTestJava FROM-CACHE
> Task :runners:google-cloud-dataflow-java:testClasses UP-TO-DATE
> Task :runners:google-cloud-dataflow-java:testJar
Deprecated Gradle features were used in this build, making it incompatible with Gradle 8.0.
You can use '--warning-mode all' to show the individual deprecation warnings and determine if they come from your own scripts or plugins.
See https://docs.gradle.org/7.5.1/userguide/command_line_interface.html#sec:command_line_warnings
BUILD SUCCESSFUL in 45s
132 actionable tasks: 78 executed, 52 from cache, 2 up-to-date
Publishing build scan...
https://gradle.com/s/hkah6anaynvi6
Build step 'Invoke Gradle script' changed build result to SUCCESS
[Gradle] - Launching build.
[src] $ <https://ci-beam.apache.org/job/beam_PostCommit_Java_ValidatesRunner_Dataflow_Java17/ws/src/gradlew> -x shadowJar -x shadowTestJar -x compileJava -x compileTestJava -x jar -x testJar -x classes -x testClasses -Dorg.gradle.java.home=/usr/lib/jvm/java-17-openjdk-amd64 --continue --max-workers=12 -Dorg.gradle.jvmargs=-Xms2g -Dorg.gradle.jvmargs=-Xmx6g -Dorg.gradle.vfs.watch=false -Pdocker-pull-licenses :runners:google-cloud-dataflow-java:validatesRunner
To honour the JVM settings for this build a single-use Daemon process will be forked. See https://docs.gradle.org/7.5.1/userguide/gradle_daemon.html#sec:disabling_the_daemon.
Daemon will be stopped at the end of the build
Configuration on demand is an incubating feature.
> Task :buildSrc:compileJava NO-SOURCE
> Task :buildSrc:compileGroovy FROM-CACHE
> Task :buildSrc:pluginDescriptors UP-TO-DATE
> Task :buildSrc:processResources UP-TO-DATE
> Task :buildSrc:classes UP-TO-DATE
> Task :buildSrc:jar
> Task :buildSrc:assemble
> Task :buildSrc:spotlessGroovy UP-TO-DATE
> Task :buildSrc:spotlessGroovyCheck UP-TO-DATE
> Task :buildSrc:spotlessGroovyGradle UP-TO-DATE
> Task :buildSrc:spotlessGroovyGradleCheck UP-TO-DATE
> Task :buildSrc:spotlessCheck UP-TO-DATE
> Task :buildSrc:pluginUnderTestMetadata
> Task :buildSrc:compileTestJava NO-SOURCE
> Task :buildSrc:compileTestGroovy NO-SOURCE
> Task :buildSrc:processTestResources NO-SOURCE
> Task :buildSrc:testClasses UP-TO-DATE
> Task :buildSrc:test NO-SOURCE
> Task :buildSrc:validatePlugins FROM-CACHE
> Task :buildSrc:check UP-TO-DATE
> Task :buildSrc:build
> Task :runners:google-cloud-dataflow-java:validatesRunnerLegacyWorkerTest
org.apache.beam.sdk.schemas.AvroSchemaTest > testAvroPipelineGroupBy FAILED
java.lang.IllegalArgumentException at AvroSchemaTest.java:478
org.apache.beam.sdk.transforms.PerKeyOrderingTest > testMultipleStatefulOrderingWithShuffle FAILED
java.lang.IllegalArgumentException at PerKeyOrderingTest.java:254
org.apache.beam.sdk.transforms.ParDoSchemaTest > testReadAndWrite FAILED
java.lang.IllegalArgumentException at ParDoSchemaTest.java:135
org.apache.beam.sdk.transforms.ParDoSchemaTest > testSchemasPassedThrough FAILED
java.lang.IllegalArgumentException at ParDoSchemaTest.java:439
org.apache.beam.sdk.transforms.ParDoSchemaTest > testSchemaFieldSelectionNested FAILED
java.lang.IllegalArgumentException at ParDoSchemaTest.java:629
org.apache.beam.sdk.transforms.ParDoSchemaTest > testSchemaFieldSelectionUnboxing FAILED
java.lang.IllegalArgumentException at ParDoSchemaTest.java:538
org.apache.beam.sdk.transforms.ParDoSchemaTest > testSchemaFieldDescriptorSelectionUnboxing FAILED
java.lang.IllegalArgumentException at ParDoSchemaTest.java:578
org.apache.beam.sdk.transforms.ParDoSchemaTest > testInferredSchemaPipeline FAILED
java.lang.IllegalArgumentException at ParDoSchemaTest.java:417
org.apache.beam.sdk.transforms.ParDoSchemaTest > testFieldAccessSchemaPipeline FAILED
java.lang.IllegalArgumentException at ParDoSchemaTest.java:328
org.apache.beam.sdk.transforms.ParDoSchemaTest > testSimpleSchemaPipeline FAILED
java.lang.IllegalArgumentException at ParDoSchemaTest.java:101
org.apache.beam.sdk.transforms.ParDoSchemaTest > testSchemaConversionPipeline FAILED
java.lang.IllegalArgumentException at ParDoSchemaTest.java:465
org.apache.beam.sdk.transforms.ParDoSchemaTest > testReadAndWriteWithSchemaRegistry FAILED
java.lang.IllegalArgumentException at ParDoSchemaTest.java:291
org.apache.beam.sdk.transforms.ParDoSchemaTest > testReadAndWriteMultiOutput FAILED
java.lang.IllegalArgumentException at ParDoSchemaTest.java:195
org.apache.beam.sdk.transforms.ParDoSchemaTest > testNestedSchema FAILED
java.lang.IllegalArgumentException at ParDoSchemaTest.java:498
org.apache.beam.sdk.transforms.ParDoSchemaTest > testMapStateSchemaInference FAILED
java.lang.IllegalArgumentException at ParDoSchemaTest.java:879
org.apache.beam.sdk.transforms.PerKeyOrderingTest > testMultipleStatefulOrderingWithoutShuffle FAILED
java.lang.IllegalArgumentException at PerKeyOrderingTest.java:297
297 tests completed, 16 failed, 1 skipped
> Task :runners:google-cloud-dataflow-java:validatesRunnerLegacyWorkerTest FAILED
FAILURE: Build failed with an exception.
* What went wrong:
Execution failed for task ':runners:google-cloud-dataflow-java:validatesRunnerLegacyWorkerTest'.
> There were failing tests. See the report at: file://<https://ci-beam.apache.org/job/beam_PostCommit_Java_ValidatesRunner_Dataflow_Java17/ws/src/runners/google-cloud-dataflow-java/build/reports/tests/validatesRunnerLegacyWorkerTest/index.html>
* Try:
> Run with --stacktrace option to get the stack trace.
> Run with --info or --debug option to get more log output.
* Get more help at https://help.gradle.org
Deprecated Gradle features were used in this build, making it incompatible with Gradle 8.0.
You can use '--warning-mode all' to show the individual deprecation warnings and determine if they come from your own scripts or plugins.
See https://docs.gradle.org/7.5.1/userguide/command_line_interface.html#sec:command_line_warnings
BUILD FAILED in 5h 8m 50s
11 actionable tasks: 3 executed, 2 from cache, 6 up-to-date
Publishing build scan...
https://gradle.com/s/uxcqtczapkqpu
Build step 'Invoke Gradle script' changed build result to FAILURE
Build step 'Invoke Gradle script' marked build as failure
---------------------------------------------------------------------
To unsubscribe, e-mail: builds-unsubscribe@beam.apache.org
For additional commands, e-mail: builds-help@beam.apache.org
Build failed in Jenkins: beam_PostCommit_Java_ValidatesRunner_Dataflow_Java17 #1649
Posted by Apache Jenkins Server <je...@builds.apache.org>.
See <https://ci-beam.apache.org/job/beam_PostCommit_Java_ValidatesRunner_Dataflow_Java17/1649/display/redirect?page=changes>
Changes:
[noreply] Bump github.com/tetratelabs/wazero from 1.0.0-pre.7 to 1.0.0-pre.9 in
------------------------------------------
[...truncated 21.93 KB...]
> Task :sdks:java:core:processResources
> Task :runners:google-cloud-dataflow-java:worker:processResources
> Task :sdks:java:core:generateTestAvroProtocol NO-SOURCE
> Task :model:fn-execution:processResources
> Task :sdks:java:extensions:protobuf:processTestResources
> Task :sdks:java:io:common:jar
> Task :sdks:java:io:common:processTestResources NO-SOURCE
> Task :sdks:java:io:google-cloud-platform:processTestResources
> Task :sdks:java:core:generateTestAvroJava
> Task :sdks:java:core:generateTestGrammarSource NO-SOURCE
> Task :sdks:java:core:processTestResources
> Task :runners:google-cloud-dataflow-java:worker:windmill:extractIncludeProto
> Task :runners:google-cloud-dataflow-java:worker:windmill:extractProto
> Task :model:pipeline:extractIncludeProto
> Task :model:pipeline:extractProto
> Task :runners:google-cloud-dataflow-java:worker:windmill:generateProto FROM-CACHE
> Task :model:pipeline:generateProto FROM-CACHE
> Task :runners:google-cloud-dataflow-java:worker:windmill:compileJava FROM-CACHE
> Task :runners:google-cloud-dataflow-java:worker:windmill:processResources
> Task :runners:google-cloud-dataflow-java:worker:windmill:classes
> Task :runners:google-cloud-dataflow-java:worker:windmill:shadowJar FROM-CACHE
> Task :model:pipeline:compileJava FROM-CACHE
> Task :model:pipeline:processResources
> Task :model:pipeline:classes
> Task :model:pipeline:jar
> Task :model:pipeline:shadowJar FROM-CACHE
> Task :model:fn-execution:extractIncludeProto
> Task :model:job-management:extractIncludeProto
> Task :model:job-management:generateProto FROM-CACHE
> Task :model:fn-execution:generateProto FROM-CACHE
> Task :model:job-management:compileJava FROM-CACHE
> Task :model:job-management:classes
> Task :model:fn-execution:compileJava FROM-CACHE
> Task :model:fn-execution:classes
> Task :model:fn-execution:shadowJar FROM-CACHE
> Task :model:job-management:shadowJar FROM-CACHE
> Task :sdks:java:core:compileJava FROM-CACHE
> Task :sdks:java:core:classes
> Task :sdks:java:core:shadowJar FROM-CACHE
> Task :runners:local-java:compileJava FROM-CACHE
> Task :runners:local-java:classes UP-TO-DATE
> Task :runners:local-java:jar
> Task :sdks:java:extensions:arrow:compileJava FROM-CACHE
> Task :sdks:java:io:common:compileTestJava FROM-CACHE
> Task :sdks:java:io:common:testClasses UP-TO-DATE
> Task :sdks:java:extensions:arrow:classes UP-TO-DATE
> Task :sdks:java:extensions:arrow:jar
> Task :sdks:java:io:common:testJar
> Task :sdks:java:testing:test-utils:compileJava FROM-CACHE
> Task :sdks:java:testing:test-utils:classes UP-TO-DATE
> Task :sdks:java:testing:test-utils:jar
> Task :sdks:java:fn-execution:compileJava FROM-CACHE
> Task :sdks:java:fn-execution:classes UP-TO-DATE
> Task :sdks:java:testing:test-utils:compileTestJava FROM-CACHE
> Task :sdks:java:testing:test-utils:testClasses UP-TO-DATE
> Task :sdks:java:testing:test-utils:testJar
> Task :sdks:java:fn-execution:jar
> Task :runners:core-construction-java:compileJava FROM-CACHE
> Task :runners:core-construction-java:classes UP-TO-DATE
> Task :sdks:java:extensions:protobuf:extractIncludeProto
> Task :sdks:java:extensions:protobuf:generateProto NO-SOURCE
> Task :sdks:java:extensions:protobuf:compileJava FROM-CACHE
> Task :sdks:java:extensions:protobuf:classes UP-TO-DATE
> Task :runners:core-construction-java:jar
> Task :sdks:java:extensions:protobuf:jar
> Task :sdks:java:core:jar
> Task :sdks:java:extensions:python:compileJava FROM-CACHE
> Task :sdks:java:extensions:python:classes
> Task :sdks:java:extensions:python:jar
> Task :runners:core-java:compileJava FROM-CACHE
> Task :runners:core-java:classes UP-TO-DATE
> Task :runners:core-java:jar
> Task :sdks:java:extensions:google-cloud-platform-core:compileJava FROM-CACHE
> Task :sdks:java:extensions:google-cloud-platform-core:classes UP-TO-DATE
> Task :sdks:java:extensions:google-cloud-platform-core:jar
> Task :sdks:java:harness:compileJava FROM-CACHE
> Task :sdks:java:harness:classes UP-TO-DATE
> Task :sdks:java:harness:jar
> Task :runners:java-fn-execution:compileJava FROM-CACHE
> Task :runners:java-fn-execution:classes UP-TO-DATE
> Task :runners:java-fn-execution:jar
> Task :sdks:java:expansion-service:compileJava FROM-CACHE
> Task :sdks:java:expansion-service:classes UP-TO-DATE
> Task :sdks:java:expansion-service:jar
> Task :runners:direct-java:compileJava FROM-CACHE
> Task :runners:direct-java:classes UP-TO-DATE
> Task :sdks:java:io:kafka:compileJava FROM-CACHE
> Task :sdks:java:io:kafka:classes UP-TO-DATE
> Task :sdks:java:io:kafka:jar
> Task :runners:direct-java:shadowJar FROM-CACHE
> Task :sdks:java:core:compileTestJava FROM-CACHE
> Task :sdks:java:core:testClasses
> Task :sdks:java:io:google-cloud-platform:compileJava FROM-CACHE
> Task :sdks:java:io:google-cloud-platform:classes UP-TO-DATE
> Task :sdks:java:core:shadowTestJar FROM-CACHE
> Task :sdks:java:io:google-cloud-platform:jar
> Task :sdks:java:extensions:google-cloud-platform-core:compileTestJava FROM-CACHE
> Task :sdks:java:extensions:google-cloud-platform-core:testClasses UP-TO-DATE
> Task :sdks:java:extensions:google-cloud-platform-core:testJar
> Task :runners:core-construction-java:compileTestJava FROM-CACHE
> Task :runners:core-construction-java:testClasses UP-TO-DATE
> Task :runners:core-java:compileTestJava FROM-CACHE
> Task :runners:core-java:testClasses UP-TO-DATE
> Task :runners:core-construction-java:testJar
> Task :sdks:java:extensions:python:compileTestJava FROM-CACHE
> Task :sdks:java:extensions:python:testClasses UP-TO-DATE
> Task :runners:google-cloud-dataflow-java:compileJava FROM-CACHE
> Task :runners:google-cloud-dataflow-java:classes
> Task :sdks:java:extensions:python:testJar
> Task :runners:core-java:testJar
> Task :runners:google-cloud-dataflow-java:jar
> Task :runners:direct-java:compileTestJava FROM-CACHE
> Task :runners:direct-java:testClasses UP-TO-DATE
> Task :runners:google-cloud-dataflow-java:worker:compileJava FROM-CACHE
> Task :runners:google-cloud-dataflow-java:worker:classes
> Task :runners:direct-java:shadowTestJar FROM-CACHE
> Task :sdks:java:extensions:protobuf:extractIncludeTestProto
> Task :sdks:java:extensions:protobuf:generateTestProto FROM-CACHE
> Task :sdks:java:extensions:protobuf:compileTestJava FROM-CACHE
> Task :sdks:java:extensions:protobuf:testClasses
> Task :runners:google-cloud-dataflow-java:worker:shadowJar FROM-CACHE
> Task :sdks:java:extensions:protobuf:testJar
> Task :sdks:java:io:google-cloud-platform:compileTestJava FROM-CACHE
> Task :sdks:java:io:google-cloud-platform:testClasses
> Task :sdks:java:io:google-cloud-platform:testJar
> Task :runners:google-cloud-dataflow-java:compileTestJava FROM-CACHE
> Task :runners:google-cloud-dataflow-java:testClasses UP-TO-DATE
> Task :runners:google-cloud-dataflow-java:testJar
Deprecated Gradle features were used in this build, making it incompatible with Gradle 8.0.
You can use '--warning-mode all' to show the individual deprecation warnings and determine if they come from your own scripts or plugins.
See https://docs.gradle.org/7.5.1/userguide/command_line_interface.html#sec:command_line_warnings
BUILD SUCCESSFUL in 34s
132 actionable tasks: 78 executed, 52 from cache, 2 up-to-date
Publishing build scan...
https://gradle.com/s/conpsrx4dkwf4
Build step 'Invoke Gradle script' changed build result to SUCCESS
[Gradle] - Launching build.
[src] $ <https://ci-beam.apache.org/job/beam_PostCommit_Java_ValidatesRunner_Dataflow_Java17/ws/src/gradlew> -x shadowJar -x shadowTestJar -x compileJava -x compileTestJava -x jar -x testJar -x classes -x testClasses -Dorg.gradle.java.home=/usr/lib/jvm/java-17-openjdk-amd64 --continue --max-workers=12 -Dorg.gradle.jvmargs=-Xms2g -Dorg.gradle.jvmargs=-Xmx6g -Dorg.gradle.vfs.watch=false -Pdocker-pull-licenses :runners:google-cloud-dataflow-java:validatesRunner
To honour the JVM settings for this build a single-use Daemon process will be forked. See https://docs.gradle.org/7.5.1/userguide/gradle_daemon.html#sec:disabling_the_daemon.
Daemon will be stopped at the end of the build
Configuration on demand is an incubating feature.
> Task :buildSrc:compileJava NO-SOURCE
> Task :buildSrc:compileGroovy
> Task :buildSrc:pluginDescriptors UP-TO-DATE
> Task :buildSrc:processResources UP-TO-DATE
> Task :buildSrc:classes
> Task :buildSrc:jar
> Task :buildSrc:assemble
> Task :buildSrc:spotlessGroovy UP-TO-DATE
> Task :buildSrc:spotlessGroovyCheck UP-TO-DATE
> Task :buildSrc:spotlessGroovyGradle UP-TO-DATE
> Task :buildSrc:spotlessGroovyGradleCheck UP-TO-DATE
> Task :buildSrc:spotlessCheck UP-TO-DATE
> Task :buildSrc:pluginUnderTestMetadata
> Task :buildSrc:compileTestJava NO-SOURCE
> Task :buildSrc:compileTestGroovy NO-SOURCE
> Task :buildSrc:processTestResources NO-SOURCE
> Task :buildSrc:testClasses UP-TO-DATE
> Task :buildSrc:test NO-SOURCE
> Task :buildSrc:validatePlugins
> Task :buildSrc:check
> Task :buildSrc:build
> Task :runners:google-cloud-dataflow-java:validatesRunnerLegacyWorkerTest
org.apache.beam.sdk.schemas.AvroSchemaTest > testAvroPipelineGroupBy FAILED
java.lang.IllegalArgumentException at AvroSchemaTest.java:478
org.apache.beam.sdk.transforms.PerKeyOrderingTest > testMultipleStatefulOrderingWithShuffle FAILED
java.lang.IllegalArgumentException at PerKeyOrderingTest.java:254
org.apache.beam.sdk.transforms.ParDoSchemaTest > testReadAndWrite FAILED
java.lang.IllegalArgumentException at ParDoSchemaTest.java:135
org.apache.beam.sdk.transforms.ParDoSchemaTest > testSchemasPassedThrough FAILED
java.lang.IllegalArgumentException at ParDoSchemaTest.java:439
org.apache.beam.sdk.transforms.ParDoSchemaTest > testSchemaFieldSelectionNested FAILED
java.lang.IllegalArgumentException at ParDoSchemaTest.java:629
org.apache.beam.sdk.transforms.ParDoSchemaTest > testSchemaFieldSelectionUnboxing FAILED
java.lang.IllegalArgumentException at ParDoSchemaTest.java:538
org.apache.beam.sdk.transforms.ParDoSchemaTest > testSchemaFieldDescriptorSelectionUnboxing FAILED
java.lang.IllegalArgumentException at ParDoSchemaTest.java:578
org.apache.beam.sdk.transforms.ParDoSchemaTest > testInferredSchemaPipeline FAILED
java.lang.IllegalArgumentException at ParDoSchemaTest.java:417
org.apache.beam.sdk.transforms.ParDoSchemaTest > testFieldAccessSchemaPipeline FAILED
java.lang.IllegalArgumentException at ParDoSchemaTest.java:328
org.apache.beam.sdk.transforms.ParDoSchemaTest > testSimpleSchemaPipeline FAILED
java.lang.IllegalArgumentException at ParDoSchemaTest.java:101
org.apache.beam.sdk.transforms.ParDoSchemaTest > testSchemaConversionPipeline FAILED
java.lang.IllegalArgumentException at ParDoSchemaTest.java:465
org.apache.beam.sdk.transforms.ParDoSchemaTest > testReadAndWriteWithSchemaRegistry FAILED
java.lang.IllegalArgumentException at ParDoSchemaTest.java:291
org.apache.beam.sdk.transforms.ParDoSchemaTest > testReadAndWriteMultiOutput FAILED
java.lang.IllegalArgumentException at ParDoSchemaTest.java:195
org.apache.beam.sdk.transforms.ParDoSchemaTest > testNestedSchema FAILED
java.lang.IllegalArgumentException at ParDoSchemaTest.java:498
org.apache.beam.sdk.transforms.ParDoSchemaTest > testMapStateSchemaInference FAILED
java.lang.IllegalArgumentException at ParDoSchemaTest.java:879
org.apache.beam.sdk.transforms.PerKeyOrderingTest > testMultipleStatefulOrderingWithoutShuffle FAILED
java.lang.IllegalArgumentException at PerKeyOrderingTest.java:297
297 tests completed, 16 failed, 1 skipped
> Task :runners:google-cloud-dataflow-java:validatesRunnerLegacyWorkerTest FAILED
FAILURE: Build failed with an exception.
* What went wrong:
Execution failed for task ':runners:google-cloud-dataflow-java:validatesRunnerLegacyWorkerTest'.
> There were failing tests. See the report at: file://<https://ci-beam.apache.org/job/beam_PostCommit_Java_ValidatesRunner_Dataflow_Java17/ws/src/runners/google-cloud-dataflow-java/build/reports/tests/validatesRunnerLegacyWorkerTest/index.html>
* Try:
> Run with --stacktrace option to get the stack trace.
> Run with --info or --debug option to get more log output.
* Get more help at https://help.gradle.org
Deprecated Gradle features were used in this build, making it incompatible with Gradle 8.0.
You can use '--warning-mode all' to show the individual deprecation warnings and determine if they come from your own scripts or plugins.
See https://docs.gradle.org/7.5.1/userguide/command_line_interface.html#sec:command_line_warnings
BUILD FAILED in 5h 14m 41s
11 actionable tasks: 5 executed, 6 up-to-date
Publishing build scan...
https://gradle.com/s/wpko26jjbbtoo
Build step 'Invoke Gradle script' changed build result to FAILURE
Build step 'Invoke Gradle script' marked build as failure
---------------------------------------------------------------------
To unsubscribe, e-mail: builds-unsubscribe@beam.apache.org
For additional commands, e-mail: builds-help@beam.apache.org
Build failed in Jenkins: beam_PostCommit_Java_ValidatesRunner_Dataflow_Java17 #1648
Posted by Apache Jenkins Server <je...@builds.apache.org>.
See <https://ci-beam.apache.org/job/beam_PostCommit_Java_ValidatesRunner_Dataflow_Java17/1648/display/redirect?page=changes>
Changes:
[noreply] [Go SDK]: Retrieve file size in CreateInitialRestriction in textio.Read
[noreply] [#24789][prism] internal/worker + tentative data (#25478)
[noreply] [#24789][prism] add preprocessor and test (#25520)
------------------------------------------
[...truncated 21.90 KB...]
> Task :runners:google-cloud-dataflow-java:processTestResources NO-SOURCE
> Task :sdks:java:extensions:protobuf:processTestResources
> Task :sdks:java:core:processResources
> Task :sdks:java:io:common:jar
> Task :sdks:java:core:generateTestAvroProtocol NO-SOURCE
> Task :sdks:java:io:common:processTestResources NO-SOURCE
> Task :model:fn-execution:processResources
> Task :sdks:java:io:google-cloud-platform:processTestResources
> Task :sdks:java:core:generateTestAvroJava
> Task :sdks:java:core:generateTestGrammarSource NO-SOURCE
> Task :sdks:java:core:processTestResources
> Task :model:pipeline:extractIncludeProto
> Task :runners:google-cloud-dataflow-java:worker:windmill:extractIncludeProto
> Task :runners:google-cloud-dataflow-java:worker:windmill:extractProto
> Task :model:pipeline:extractProto
> Task :runners:google-cloud-dataflow-java:worker:windmill:generateProto FROM-CACHE
> Task :model:pipeline:generateProto FROM-CACHE
> Task :runners:google-cloud-dataflow-java:worker:windmill:compileJava FROM-CACHE
> Task :runners:google-cloud-dataflow-java:worker:windmill:processResources
> Task :runners:google-cloud-dataflow-java:worker:windmill:classes
> Task :runners:google-cloud-dataflow-java:worker:windmill:shadowJar FROM-CACHE
> Task :model:pipeline:compileJava FROM-CACHE
> Task :model:pipeline:processResources
> Task :model:pipeline:classes
> Task :model:pipeline:jar
> Task :model:pipeline:shadowJar FROM-CACHE
> Task :model:fn-execution:extractIncludeProto
> Task :model:job-management:extractIncludeProto
> Task :model:job-management:generateProto FROM-CACHE
> Task :model:fn-execution:generateProto FROM-CACHE
> Task :model:job-management:compileJava FROM-CACHE
> Task :model:job-management:classes
> Task :model:fn-execution:compileJava FROM-CACHE
> Task :model:fn-execution:classes
> Task :model:job-management:shadowJar FROM-CACHE
> Task :model:fn-execution:shadowJar FROM-CACHE
> Task :sdks:java:core:compileJava FROM-CACHE
> Task :sdks:java:core:classes
> Task :sdks:java:core:shadowJar FROM-CACHE
> Task :runners:local-java:compileJava FROM-CACHE
> Task :runners:local-java:classes UP-TO-DATE
> Task :runners:local-java:jar
> Task :sdks:java:io:common:compileTestJava FROM-CACHE
> Task :sdks:java:io:common:testClasses UP-TO-DATE
> Task :sdks:java:extensions:arrow:compileJava FROM-CACHE
> Task :sdks:java:extensions:arrow:classes UP-TO-DATE
> Task :sdks:java:io:common:testJar
> Task :sdks:java:extensions:arrow:jar
> Task :sdks:java:testing:test-utils:compileJava FROM-CACHE
> Task :sdks:java:testing:test-utils:classes UP-TO-DATE
> Task :sdks:java:core:jar
> Task :sdks:java:testing:test-utils:jar
> Task :sdks:java:testing:test-utils:compileTestJava FROM-CACHE
> Task :sdks:java:testing:test-utils:testClasses UP-TO-DATE
> Task :sdks:java:fn-execution:compileJava FROM-CACHE
> Task :sdks:java:fn-execution:classes UP-TO-DATE
> Task :sdks:java:testing:test-utils:testJar
> Task :sdks:java:fn-execution:jar
> Task :sdks:java:extensions:protobuf:extractIncludeProto
> Task :sdks:java:extensions:protobuf:generateProto NO-SOURCE
> Task :runners:core-construction-java:compileJava FROM-CACHE
> Task :runners:core-construction-java:classes UP-TO-DATE
> Task :sdks:java:extensions:protobuf:compileJava FROM-CACHE
> Task :sdks:java:extensions:protobuf:classes UP-TO-DATE
> Task :sdks:java:extensions:protobuf:jar
> Task :runners:core-construction-java:jar
> Task :sdks:java:extensions:python:compileJava FROM-CACHE
> Task :sdks:java:extensions:python:classes
> Task :sdks:java:extensions:python:jar
> Task :runners:core-java:compileJava FROM-CACHE
> Task :runners:core-java:classes UP-TO-DATE
> Task :runners:core-java:jar
> Task :sdks:java:extensions:google-cloud-platform-core:compileJava FROM-CACHE
> Task :sdks:java:extensions:google-cloud-platform-core:classes UP-TO-DATE
> Task :sdks:java:harness:compileJava FROM-CACHE
> Task :sdks:java:harness:classes UP-TO-DATE
> Task :sdks:java:extensions:google-cloud-platform-core:jar
> Task :sdks:java:harness:jar
> Task :runners:java-fn-execution:compileJava FROM-CACHE
> Task :runners:java-fn-execution:classes UP-TO-DATE
> Task :runners:java-fn-execution:jar
> Task :sdks:java:expansion-service:compileJava FROM-CACHE
> Task :sdks:java:expansion-service:classes UP-TO-DATE
> Task :sdks:java:expansion-service:jar
> Task :runners:direct-java:compileJava FROM-CACHE
> Task :runners:direct-java:classes UP-TO-DATE
> Task :sdks:java:io:kafka:compileJava FROM-CACHE
> Task :sdks:java:io:kafka:classes UP-TO-DATE
> Task :sdks:java:io:kafka:jar
> Task :runners:direct-java:shadowJar FROM-CACHE
> Task :sdks:java:core:compileTestJava FROM-CACHE
> Task :sdks:java:core:testClasses
> Task :sdks:java:core:shadowTestJar FROM-CACHE
> Task :sdks:java:io:google-cloud-platform:compileJava FROM-CACHE
> Task :sdks:java:io:google-cloud-platform:classes UP-TO-DATE
> Task :sdks:java:extensions:google-cloud-platform-core:compileTestJava FROM-CACHE
> Task :sdks:java:extensions:google-cloud-platform-core:testClasses UP-TO-DATE
> Task :sdks:java:extensions:google-cloud-platform-core:testJar
> Task :runners:core-construction-java:compileTestJava FROM-CACHE
> Task :runners:core-construction-java:testClasses UP-TO-DATE
> Task :sdks:java:io:google-cloud-platform:jar
> Task :runners:core-java:compileTestJava FROM-CACHE
> Task :runners:core-java:testClasses UP-TO-DATE
> Task :runners:core-construction-java:testJar
> Task :runners:core-java:testJar
> Task :sdks:java:extensions:python:compileTestJava FROM-CACHE
> Task :sdks:java:extensions:python:testClasses UP-TO-DATE
> Task :sdks:java:extensions:python:testJar
> Task :runners:direct-java:compileTestJava FROM-CACHE
> Task :runners:direct-java:testClasses UP-TO-DATE
> Task :runners:google-cloud-dataflow-java:compileJava FROM-CACHE
> Task :runners:google-cloud-dataflow-java:classes
> Task :runners:google-cloud-dataflow-java:jar
> Task :runners:direct-java:shadowTestJar FROM-CACHE
> Task :runners:google-cloud-dataflow-java:worker:compileJava FROM-CACHE
> Task :runners:google-cloud-dataflow-java:worker:classes
> Task :sdks:java:extensions:protobuf:extractIncludeTestProto
> Task :runners:google-cloud-dataflow-java:worker:shadowJar FROM-CACHE
> Task :sdks:java:extensions:protobuf:generateTestProto FROM-CACHE
> Task :sdks:java:extensions:protobuf:compileTestJava FROM-CACHE
> Task :sdks:java:extensions:protobuf:testClasses
> Task :sdks:java:extensions:protobuf:testJar
> Task :sdks:java:io:google-cloud-platform:compileTestJava FROM-CACHE
> Task :sdks:java:io:google-cloud-platform:testClasses
> Task :sdks:java:io:google-cloud-platform:testJar
> Task :runners:google-cloud-dataflow-java:compileTestJava FROM-CACHE
> Task :runners:google-cloud-dataflow-java:testClasses UP-TO-DATE
> Task :runners:google-cloud-dataflow-java:testJar
Deprecated Gradle features were used in this build, making it incompatible with Gradle 8.0.
You can use '--warning-mode all' to show the individual deprecation warnings and determine if they come from your own scripts or plugins.
See https://docs.gradle.org/7.5.1/userguide/command_line_interface.html#sec:command_line_warnings
BUILD SUCCESSFUL in 34s
132 actionable tasks: 78 executed, 52 from cache, 2 up-to-date
Publishing build scan...
https://gradle.com/s/yvijb3gyocu3s
Build step 'Invoke Gradle script' changed build result to SUCCESS
[Gradle] - Launching build.
[src] $ <https://ci-beam.apache.org/job/beam_PostCommit_Java_ValidatesRunner_Dataflow_Java17/ws/src/gradlew> -x shadowJar -x shadowTestJar -x compileJava -x compileTestJava -x jar -x testJar -x classes -x testClasses -Dorg.gradle.java.home=/usr/lib/jvm/java-17-openjdk-amd64 --continue --max-workers=12 -Dorg.gradle.jvmargs=-Xms2g -Dorg.gradle.jvmargs=-Xmx6g -Dorg.gradle.vfs.watch=false -Pdocker-pull-licenses :runners:google-cloud-dataflow-java:validatesRunner
To honour the JVM settings for this build a single-use Daemon process will be forked. See https://docs.gradle.org/7.5.1/userguide/gradle_daemon.html#sec:disabling_the_daemon.
Daemon will be stopped at the end of the build
Configuration on demand is an incubating feature.
> Task :buildSrc:compileJava NO-SOURCE
> Task :buildSrc:compileGroovy FROM-CACHE
> Task :buildSrc:pluginDescriptors UP-TO-DATE
> Task :buildSrc:processResources UP-TO-DATE
> Task :buildSrc:classes UP-TO-DATE
> Task :buildSrc:jar
> Task :buildSrc:assemble
> Task :buildSrc:spotlessGroovy UP-TO-DATE
> Task :buildSrc:spotlessGroovyCheck UP-TO-DATE
> Task :buildSrc:spotlessGroovyGradle UP-TO-DATE
> Task :buildSrc:spotlessGroovyGradleCheck UP-TO-DATE
> Task :buildSrc:spotlessCheck UP-TO-DATE
> Task :buildSrc:pluginUnderTestMetadata
> Task :buildSrc:compileTestJava NO-SOURCE
> Task :buildSrc:compileTestGroovy NO-SOURCE
> Task :buildSrc:processTestResources NO-SOURCE
> Task :buildSrc:testClasses UP-TO-DATE
> Task :buildSrc:test NO-SOURCE
> Task :buildSrc:validatePlugins FROM-CACHE
> Task :buildSrc:check UP-TO-DATE
> Task :buildSrc:build
> Task :runners:google-cloud-dataflow-java:validatesRunnerLegacyWorkerTest
org.apache.beam.sdk.schemas.AvroSchemaTest > testAvroPipelineGroupBy FAILED
java.lang.IllegalArgumentException at AvroSchemaTest.java:478
org.apache.beam.sdk.transforms.PerKeyOrderingTest > testMultipleStatefulOrderingWithShuffle FAILED
java.lang.IllegalArgumentException at PerKeyOrderingTest.java:254
org.apache.beam.sdk.transforms.ParDoSchemaTest > testReadAndWrite FAILED
java.lang.IllegalArgumentException at ParDoSchemaTest.java:135
org.apache.beam.sdk.transforms.ParDoSchemaTest > testSchemasPassedThrough FAILED
java.lang.IllegalArgumentException at ParDoSchemaTest.java:439
org.apache.beam.sdk.transforms.ParDoSchemaTest > testSchemaFieldSelectionNested FAILED
java.lang.IllegalArgumentException at ParDoSchemaTest.java:629
org.apache.beam.sdk.transforms.ParDoSchemaTest > testSchemaFieldSelectionUnboxing FAILED
java.lang.IllegalArgumentException at ParDoSchemaTest.java:538
org.apache.beam.sdk.transforms.ParDoSchemaTest > testSchemaFieldDescriptorSelectionUnboxing FAILED
java.lang.IllegalArgumentException at ParDoSchemaTest.java:578
org.apache.beam.sdk.transforms.ParDoSchemaTest > testInferredSchemaPipeline FAILED
java.lang.IllegalArgumentException at ParDoSchemaTest.java:417
org.apache.beam.sdk.transforms.ParDoSchemaTest > testFieldAccessSchemaPipeline FAILED
java.lang.IllegalArgumentException at ParDoSchemaTest.java:328
org.apache.beam.sdk.transforms.ParDoSchemaTest > testSimpleSchemaPipeline FAILED
java.lang.IllegalArgumentException at ParDoSchemaTest.java:101
org.apache.beam.sdk.transforms.ParDoSchemaTest > testSchemaConversionPipeline FAILED
java.lang.IllegalArgumentException at ParDoSchemaTest.java:465
org.apache.beam.sdk.transforms.ParDoSchemaTest > testReadAndWriteWithSchemaRegistry FAILED
java.lang.IllegalArgumentException at ParDoSchemaTest.java:291
org.apache.beam.sdk.transforms.ParDoSchemaTest > testReadAndWriteMultiOutput FAILED
java.lang.IllegalArgumentException at ParDoSchemaTest.java:195
org.apache.beam.sdk.transforms.ParDoSchemaTest > testNestedSchema FAILED
java.lang.IllegalArgumentException at ParDoSchemaTest.java:498
org.apache.beam.sdk.transforms.ParDoSchemaTest > testMapStateSchemaInference FAILED
java.lang.IllegalArgumentException at ParDoSchemaTest.java:879
org.apache.beam.sdk.transforms.PerKeyOrderingTest > testMultipleStatefulOrderingWithoutShuffle FAILED
java.lang.IllegalArgumentException at PerKeyOrderingTest.java:297
297 tests completed, 16 failed, 1 skipped
> Task :runners:google-cloud-dataflow-java:validatesRunnerLegacyWorkerTest FAILED
FAILURE: Build failed with an exception.
* What went wrong:
Execution failed for task ':runners:google-cloud-dataflow-java:validatesRunnerLegacyWorkerTest'.
> There were failing tests. See the report at: file://<https://ci-beam.apache.org/job/beam_PostCommit_Java_ValidatesRunner_Dataflow_Java17/ws/src/runners/google-cloud-dataflow-java/build/reports/tests/validatesRunnerLegacyWorkerTest/index.html>
* Try:
> Run with --stacktrace option to get the stack trace.
> Run with --info or --debug option to get more log output.
* Get more help at https://help.gradle.org
Deprecated Gradle features were used in this build, making it incompatible with Gradle 8.0.
You can use '--warning-mode all' to show the individual deprecation warnings and determine if they come from your own scripts or plugins.
See https://docs.gradle.org/7.5.1/userguide/command_line_interface.html#sec:command_line_warnings
BUILD FAILED in 5h 7m 33s
11 actionable tasks: 3 executed, 2 from cache, 6 up-to-date
Publishing build scan...
https://gradle.com/s/a5ddtubd57pem
Build step 'Invoke Gradle script' changed build result to FAILURE
Build step 'Invoke Gradle script' marked build as failure
---------------------------------------------------------------------
To unsubscribe, e-mail: builds-unsubscribe@beam.apache.org
For additional commands, e-mail: builds-help@beam.apache.org
Build failed in Jenkins: beam_PostCommit_Java_ValidatesRunner_Dataflow_Java17 #1647
Posted by Apache Jenkins Server <je...@builds.apache.org>.
See <https://ci-beam.apache.org/job/beam_PostCommit_Java_ValidatesRunner_Dataflow_Java17/1647/display/redirect?page=changes>
Changes:
[noreply] Fix Tensorflow intergration test model path (#25553)
------------------------------------------
[...truncated 21.90 KB...]
> Task :runners:google-cloud-dataflow-java:processResources
> Task :sdks:java:extensions:protobuf:processTestResources
> Task :runners:google-cloud-dataflow-java:processTestResources NO-SOURCE
> Task :sdks:java:core:generateTestAvroProtocol NO-SOURCE
> Task :sdks:java:io:common:jar
> Task :sdks:java:io:common:processTestResources NO-SOURCE
> Task :model:fn-execution:processResources
> Task :sdks:java:io:google-cloud-platform:processTestResources
> Task :sdks:java:core:generateTestAvroJava
> Task :sdks:java:core:generateTestGrammarSource NO-SOURCE
> Task :sdks:java:core:processTestResources
> Task :model:pipeline:extractIncludeProto
> Task :model:pipeline:extractProto
> Task :runners:google-cloud-dataflow-java:worker:windmill:extractIncludeProto
> Task :runners:google-cloud-dataflow-java:worker:windmill:extractProto
> Task :model:pipeline:generateProto FROM-CACHE
> Task :runners:google-cloud-dataflow-java:worker:windmill:generateProto FROM-CACHE
> Task :runners:google-cloud-dataflow-java:worker:windmill:compileJava FROM-CACHE
> Task :runners:google-cloud-dataflow-java:worker:windmill:processResources
> Task :runners:google-cloud-dataflow-java:worker:windmill:classes
> Task :runners:google-cloud-dataflow-java:worker:windmill:shadowJar FROM-CACHE
> Task :model:pipeline:compileJava FROM-CACHE
> Task :model:pipeline:processResources
> Task :model:pipeline:classes
> Task :model:pipeline:jar
> Task :model:pipeline:shadowJar FROM-CACHE
> Task :model:job-management:extractIncludeProto
> Task :model:fn-execution:extractIncludeProto
> Task :model:job-management:generateProto FROM-CACHE
> Task :model:fn-execution:generateProto FROM-CACHE
> Task :model:job-management:compileJava FROM-CACHE
> Task :model:job-management:classes
> Task :model:fn-execution:compileJava FROM-CACHE
> Task :model:fn-execution:classes
> Task :model:job-management:shadowJar FROM-CACHE
> Task :model:fn-execution:shadowJar FROM-CACHE
> Task :sdks:java:core:compileJava FROM-CACHE
> Task :sdks:java:core:classes
> Task :sdks:java:core:shadowJar FROM-CACHE
> Task :sdks:java:extensions:arrow:compileJava FROM-CACHE
> Task :sdks:java:extensions:arrow:classes UP-TO-DATE
> Task :sdks:java:extensions:arrow:jar
> Task :sdks:java:io:common:compileTestJava FROM-CACHE
> Task :sdks:java:io:common:testClasses UP-TO-DATE
> Task :sdks:java:testing:test-utils:compileJava FROM-CACHE
> Task :sdks:java:testing:test-utils:classes UP-TO-DATE
> Task :runners:local-java:compileJava FROM-CACHE
> Task :runners:local-java:classes UP-TO-DATE
> Task :sdks:java:io:common:testJar
> Task :sdks:java:testing:test-utils:jar
> Task :runners:local-java:jar
> Task :sdks:java:core:jar
> Task :sdks:java:testing:test-utils:compileTestJava FROM-CACHE
> Task :sdks:java:testing:test-utils:testClasses UP-TO-DATE
> Task :sdks:java:testing:test-utils:testJar
> Task :sdks:java:fn-execution:compileJava FROM-CACHE
> Task :sdks:java:fn-execution:classes UP-TO-DATE
> Task :sdks:java:fn-execution:jar
> Task :sdks:java:extensions:protobuf:extractIncludeProto
> Task :sdks:java:extensions:protobuf:generateProto NO-SOURCE
> Task :runners:core-construction-java:compileJava FROM-CACHE
> Task :runners:core-construction-java:classes UP-TO-DATE
> Task :sdks:java:extensions:protobuf:compileJava FROM-CACHE
> Task :sdks:java:extensions:protobuf:classes UP-TO-DATE
> Task :sdks:java:extensions:protobuf:jar
> Task :runners:core-construction-java:jar
> Task :sdks:java:extensions:python:compileJava FROM-CACHE
> Task :sdks:java:extensions:python:classes
> Task :sdks:java:extensions:python:jar
> Task :runners:core-java:compileJava FROM-CACHE
> Task :runners:core-java:classes UP-TO-DATE
> Task :runners:core-java:jar
> Task :sdks:java:harness:compileJava FROM-CACHE
> Task :sdks:java:harness:classes UP-TO-DATE
> Task :sdks:java:extensions:google-cloud-platform-core:compileJava FROM-CACHE
> Task :sdks:java:extensions:google-cloud-platform-core:classes UP-TO-DATE
> Task :sdks:java:extensions:google-cloud-platform-core:jar
> Task :sdks:java:harness:jar
> Task :runners:java-fn-execution:compileJava FROM-CACHE
> Task :runners:java-fn-execution:classes UP-TO-DATE
> Task :runners:java-fn-execution:jar
> Task :sdks:java:expansion-service:compileJava FROM-CACHE
> Task :sdks:java:expansion-service:classes UP-TO-DATE
> Task :sdks:java:expansion-service:jar
> Task :runners:direct-java:compileJava FROM-CACHE
> Task :runners:direct-java:classes UP-TO-DATE
> Task :sdks:java:core:compileTestJava FROM-CACHE
> Task :sdks:java:core:testClasses
> Task :sdks:java:io:kafka:compileJava FROM-CACHE
> Task :sdks:java:io:kafka:classes UP-TO-DATE
> Task :sdks:java:io:kafka:jar
> Task :sdks:java:core:shadowTestJar FROM-CACHE
> Task :runners:direct-java:shadowJar FROM-CACHE
> Task :sdks:java:extensions:google-cloud-platform-core:compileTestJava FROM-CACHE
> Task :sdks:java:extensions:google-cloud-platform-core:testClasses UP-TO-DATE
> Task :sdks:java:io:google-cloud-platform:compileJava FROM-CACHE
> Task :sdks:java:io:google-cloud-platform:classes UP-TO-DATE
> Task :sdks:java:extensions:google-cloud-platform-core:testJar
> Task :runners:core-construction-java:compileTestJava FROM-CACHE
> Task :runners:core-construction-java:testClasses UP-TO-DATE
> Task :runners:core-java:compileTestJava FROM-CACHE
> Task :runners:core-java:testClasses UP-TO-DATE
> Task :runners:core-construction-java:testJar
> Task :runners:core-java:testJar
> Task :sdks:java:extensions:python:compileTestJava FROM-CACHE
> Task :sdks:java:extensions:python:testClasses UP-TO-DATE
> Task :sdks:java:extensions:python:testJar
> Task :sdks:java:io:google-cloud-platform:jar
> Task :runners:direct-java:compileTestJava FROM-CACHE
> Task :runners:direct-java:testClasses UP-TO-DATE
> Task :runners:google-cloud-dataflow-java:compileJava FROM-CACHE
> Task :runners:google-cloud-dataflow-java:classes
> Task :runners:direct-java:shadowTestJar FROM-CACHE
> Task :runners:google-cloud-dataflow-java:jar
> Task :runners:google-cloud-dataflow-java:worker:compileJava FROM-CACHE
> Task :runners:google-cloud-dataflow-java:worker:classes
> Task :sdks:java:extensions:protobuf:extractIncludeTestProto
> Task :sdks:java:extensions:protobuf:generateTestProto FROM-CACHE
> Task :sdks:java:extensions:protobuf:compileTestJava FROM-CACHE
> Task :sdks:java:extensions:protobuf:testClasses
> Task :sdks:java:extensions:protobuf:testJar
> Task :runners:google-cloud-dataflow-java:worker:shadowJar FROM-CACHE
> Task :sdks:java:io:google-cloud-platform:compileTestJava FROM-CACHE
> Task :sdks:java:io:google-cloud-platform:testClasses
> Task :sdks:java:io:google-cloud-platform:testJar
> Task :runners:google-cloud-dataflow-java:compileTestJava FROM-CACHE
> Task :runners:google-cloud-dataflow-java:testClasses UP-TO-DATE
> Task :runners:google-cloud-dataflow-java:testJar
Deprecated Gradle features were used in this build, making it incompatible with Gradle 8.0.
You can use '--warning-mode all' to show the individual deprecation warnings and determine if they come from your own scripts or plugins.
See https://docs.gradle.org/7.5.1/userguide/command_line_interface.html#sec:command_line_warnings
BUILD SUCCESSFUL in 28s
132 actionable tasks: 78 executed, 52 from cache, 2 up-to-date
Publishing build scan...
https://gradle.com/s/obbewtoddpjuc
Build step 'Invoke Gradle script' changed build result to SUCCESS
[Gradle] - Launching build.
[src] $ <https://ci-beam.apache.org/job/beam_PostCommit_Java_ValidatesRunner_Dataflow_Java17/ws/src/gradlew> -x shadowJar -x shadowTestJar -x compileJava -x compileTestJava -x jar -x testJar -x classes -x testClasses -Dorg.gradle.java.home=/usr/lib/jvm/java-17-openjdk-amd64 --continue --max-workers=12 -Dorg.gradle.jvmargs=-Xms2g -Dorg.gradle.jvmargs=-Xmx6g -Dorg.gradle.vfs.watch=false -Pdocker-pull-licenses :runners:google-cloud-dataflow-java:validatesRunner
To honour the JVM settings for this build a single-use Daemon process will be forked. See https://docs.gradle.org/7.5.1/userguide/gradle_daemon.html#sec:disabling_the_daemon.
Daemon will be stopped at the end of the build
Configuration on demand is an incubating feature.
> Task :buildSrc:compileJava NO-SOURCE
> Task :buildSrc:compileGroovy FROM-CACHE
> Task :buildSrc:pluginDescriptors UP-TO-DATE
> Task :buildSrc:processResources UP-TO-DATE
> Task :buildSrc:classes UP-TO-DATE
> Task :buildSrc:jar
> Task :buildSrc:assemble
> Task :buildSrc:spotlessGroovy UP-TO-DATE
> Task :buildSrc:spotlessGroovyCheck UP-TO-DATE
> Task :buildSrc:spotlessGroovyGradle UP-TO-DATE
> Task :buildSrc:spotlessGroovyGradleCheck UP-TO-DATE
> Task :buildSrc:spotlessCheck UP-TO-DATE
> Task :buildSrc:pluginUnderTestMetadata
> Task :buildSrc:compileTestJava NO-SOURCE
> Task :buildSrc:compileTestGroovy NO-SOURCE
> Task :buildSrc:processTestResources NO-SOURCE
> Task :buildSrc:testClasses UP-TO-DATE
> Task :buildSrc:test NO-SOURCE
> Task :buildSrc:validatePlugins FROM-CACHE
> Task :buildSrc:check UP-TO-DATE
> Task :buildSrc:build
> Task :runners:google-cloud-dataflow-java:validatesRunnerLegacyWorkerTest
org.apache.beam.sdk.schemas.AvroSchemaTest > testAvroPipelineGroupBy FAILED
java.lang.IllegalArgumentException at AvroSchemaTest.java:478
org.apache.beam.sdk.transforms.PerKeyOrderingTest > testMultipleStatefulOrderingWithShuffle FAILED
java.lang.IllegalArgumentException at PerKeyOrderingTest.java:254
org.apache.beam.sdk.transforms.ParDoSchemaTest > testReadAndWrite FAILED
java.lang.IllegalArgumentException at ParDoSchemaTest.java:135
org.apache.beam.sdk.transforms.ParDoSchemaTest > testSchemasPassedThrough FAILED
java.lang.IllegalArgumentException at ParDoSchemaTest.java:439
org.apache.beam.sdk.transforms.ParDoSchemaTest > testSchemaFieldSelectionNested FAILED
java.lang.IllegalArgumentException at ParDoSchemaTest.java:629
org.apache.beam.sdk.transforms.ParDoSchemaTest > testSchemaFieldSelectionUnboxing FAILED
java.lang.IllegalArgumentException at ParDoSchemaTest.java:538
org.apache.beam.sdk.transforms.ParDoSchemaTest > testSchemaFieldDescriptorSelectionUnboxing FAILED
java.lang.IllegalArgumentException at ParDoSchemaTest.java:578
org.apache.beam.sdk.transforms.ParDoSchemaTest > testInferredSchemaPipeline FAILED
java.lang.IllegalArgumentException at ParDoSchemaTest.java:417
org.apache.beam.sdk.transforms.ParDoSchemaTest > testFieldAccessSchemaPipeline FAILED
java.lang.IllegalArgumentException at ParDoSchemaTest.java:328
org.apache.beam.sdk.transforms.ParDoSchemaTest > testSimpleSchemaPipeline FAILED
java.lang.IllegalArgumentException at ParDoSchemaTest.java:101
org.apache.beam.sdk.transforms.ParDoSchemaTest > testSchemaConversionPipeline FAILED
java.lang.IllegalArgumentException at ParDoSchemaTest.java:465
org.apache.beam.sdk.transforms.ParDoSchemaTest > testReadAndWriteWithSchemaRegistry FAILED
java.lang.IllegalArgumentException at ParDoSchemaTest.java:291
org.apache.beam.sdk.transforms.ParDoSchemaTest > testReadAndWriteMultiOutput FAILED
java.lang.IllegalArgumentException at ParDoSchemaTest.java:195
org.apache.beam.sdk.transforms.ParDoSchemaTest > testNestedSchema FAILED
java.lang.IllegalArgumentException at ParDoSchemaTest.java:498
org.apache.beam.sdk.transforms.ParDoSchemaTest > testMapStateSchemaInference FAILED
java.lang.IllegalArgumentException at ParDoSchemaTest.java:879
org.apache.beam.sdk.transforms.PerKeyOrderingTest > testMultipleStatefulOrderingWithoutShuffle FAILED
java.lang.IllegalArgumentException at PerKeyOrderingTest.java:297
297 tests completed, 16 failed, 1 skipped
> Task :runners:google-cloud-dataflow-java:validatesRunnerLegacyWorkerTest FAILED
FAILURE: Build failed with an exception.
* What went wrong:
Execution failed for task ':runners:google-cloud-dataflow-java:validatesRunnerLegacyWorkerTest'.
> There were failing tests. See the report at: file://<https://ci-beam.apache.org/job/beam_PostCommit_Java_ValidatesRunner_Dataflow_Java17/ws/src/runners/google-cloud-dataflow-java/build/reports/tests/validatesRunnerLegacyWorkerTest/index.html>
* Try:
> Run with --stacktrace option to get the stack trace.
> Run with --info or --debug option to get more log output.
* Get more help at https://help.gradle.org
Deprecated Gradle features were used in this build, making it incompatible with Gradle 8.0.
You can use '--warning-mode all' to show the individual deprecation warnings and determine if they come from your own scripts or plugins.
See https://docs.gradle.org/7.5.1/userguide/command_line_interface.html#sec:command_line_warnings
BUILD FAILED in 5h 7m 35s
11 actionable tasks: 3 executed, 2 from cache, 6 up-to-date
Publishing build scan...
https://gradle.com/s/idsqqjrtjxn6w
Build step 'Invoke Gradle script' changed build result to FAILURE
Build step 'Invoke Gradle script' marked build as failure
---------------------------------------------------------------------
To unsubscribe, e-mail: builds-unsubscribe@beam.apache.org
For additional commands, e-mail: builds-help@beam.apache.org
Build failed in Jenkins: beam_PostCommit_Java_ValidatesRunner_Dataflow_Java17 #1646
Posted by Apache Jenkins Server <je...@builds.apache.org>.
See <https://ci-beam.apache.org/job/beam_PostCommit_Java_ValidatesRunner_Dataflow_Java17/1646/display/redirect>
Changes:
------------------------------------------
[...truncated 21.89 KB...]
> Task :runners:google-cloud-dataflow-java:processResources
> Task :sdks:java:io:common:jar
> Task :runners:google-cloud-dataflow-java:processTestResources NO-SOURCE
> Task :sdks:java:core:generateTestAvroProtocol NO-SOURCE
> Task :sdks:java:io:common:processTestResources NO-SOURCE
> Task :sdks:java:extensions:protobuf:processTestResources
> Task :model:fn-execution:processResources
> Task :sdks:java:io:google-cloud-platform:processTestResources
> Task :sdks:java:core:generateTestAvroJava
> Task :sdks:java:core:generateTestGrammarSource NO-SOURCE
> Task :sdks:java:core:processTestResources
> Task :model:pipeline:extractIncludeProto
> Task :runners:google-cloud-dataflow-java:worker:windmill:extractIncludeProto
> Task :model:pipeline:extractProto
> Task :runners:google-cloud-dataflow-java:worker:windmill:extractProto
> Task :runners:google-cloud-dataflow-java:worker:windmill:generateProto FROM-CACHE
> Task :model:pipeline:generateProto FROM-CACHE
> Task :runners:google-cloud-dataflow-java:worker:windmill:compileJava FROM-CACHE
> Task :runners:google-cloud-dataflow-java:worker:windmill:processResources
> Task :runners:google-cloud-dataflow-java:worker:windmill:classes
> Task :runners:google-cloud-dataflow-java:worker:windmill:shadowJar FROM-CACHE
> Task :model:pipeline:compileJava FROM-CACHE
> Task :model:pipeline:processResources
> Task :model:pipeline:classes
> Task :model:pipeline:jar
> Task :model:pipeline:shadowJar FROM-CACHE
> Task :model:job-management:extractIncludeProto
> Task :model:fn-execution:extractIncludeProto
> Task :model:job-management:generateProto FROM-CACHE
> Task :model:fn-execution:generateProto FROM-CACHE
> Task :model:job-management:compileJava FROM-CACHE
> Task :model:job-management:classes
> Task :model:fn-execution:compileJava FROM-CACHE
> Task :model:fn-execution:classes
> Task :model:job-management:shadowJar FROM-CACHE
> Task :model:fn-execution:shadowJar FROM-CACHE
> Task :sdks:java:core:compileJava FROM-CACHE
> Task :sdks:java:core:classes
> Task :sdks:java:core:shadowJar FROM-CACHE
> Task :sdks:java:io:common:compileTestJava FROM-CACHE
> Task :sdks:java:io:common:testClasses UP-TO-DATE
> Task :runners:local-java:compileJava FROM-CACHE
> Task :runners:local-java:classes UP-TO-DATE
> Task :sdks:java:extensions:arrow:compileJava FROM-CACHE
> Task :runners:local-java:jar
> Task :sdks:java:extensions:arrow:classes UP-TO-DATE
> Task :sdks:java:io:common:testJar
> Task :sdks:java:extensions:arrow:jar
> Task :sdks:java:core:jar
> Task :sdks:java:testing:test-utils:compileJava FROM-CACHE
> Task :sdks:java:testing:test-utils:classes UP-TO-DATE
> Task :sdks:java:testing:test-utils:jar
> Task :sdks:java:testing:test-utils:compileTestJava FROM-CACHE
> Task :sdks:java:testing:test-utils:testClasses UP-TO-DATE
> Task :sdks:java:testing:test-utils:testJar
> Task :sdks:java:fn-execution:compileJava FROM-CACHE
> Task :sdks:java:fn-execution:classes UP-TO-DATE
> Task :sdks:java:fn-execution:jar
> Task :sdks:java:extensions:protobuf:extractIncludeProto
> Task :sdks:java:extensions:protobuf:generateProto NO-SOURCE
> Task :runners:core-construction-java:compileJava FROM-CACHE
> Task :runners:core-construction-java:classes UP-TO-DATE
> Task :sdks:java:extensions:protobuf:compileJava FROM-CACHE
> Task :sdks:java:extensions:protobuf:classes UP-TO-DATE
> Task :sdks:java:extensions:protobuf:jar
> Task :runners:core-construction-java:jar
> Task :sdks:java:extensions:python:compileJava FROM-CACHE
> Task :sdks:java:extensions:python:classes
> Task :sdks:java:extensions:python:jar
> Task :runners:core-java:compileJava FROM-CACHE
> Task :runners:core-java:classes UP-TO-DATE
> Task :runners:core-java:jar
> Task :sdks:java:extensions:google-cloud-platform-core:compileJava FROM-CACHE
> Task :sdks:java:extensions:google-cloud-platform-core:classes UP-TO-DATE
> Task :sdks:java:harness:compileJava FROM-CACHE
> Task :sdks:java:harness:classes UP-TO-DATE
> Task :sdks:java:extensions:google-cloud-platform-core:jar
> Task :sdks:java:harness:jar
> Task :runners:java-fn-execution:compileJava FROM-CACHE
> Task :runners:java-fn-execution:classes UP-TO-DATE
> Task :runners:java-fn-execution:jar
> Task :sdks:java:expansion-service:compileJava FROM-CACHE
> Task :sdks:java:expansion-service:classes UP-TO-DATE
> Task :sdks:java:expansion-service:jar
> Task :runners:direct-java:compileJava FROM-CACHE
> Task :runners:direct-java:classes UP-TO-DATE
> Task :sdks:java:io:kafka:compileJava FROM-CACHE
> Task :sdks:java:io:kafka:classes UP-TO-DATE
> Task :sdks:java:core:compileTestJava FROM-CACHE
> Task :sdks:java:core:testClasses
> Task :sdks:java:io:kafka:jar
> Task :sdks:java:core:shadowTestJar FROM-CACHE
> Task :runners:direct-java:shadowJar FROM-CACHE
> Task :sdks:java:io:google-cloud-platform:compileJava FROM-CACHE
> Task :sdks:java:io:google-cloud-platform:classes UP-TO-DATE
> Task :sdks:java:extensions:google-cloud-platform-core:compileTestJava FROM-CACHE
> Task :sdks:java:extensions:google-cloud-platform-core:testClasses UP-TO-DATE
> Task :sdks:java:extensions:google-cloud-platform-core:testJar
> Task :sdks:java:io:google-cloud-platform:jar
> Task :runners:core-construction-java:compileTestJava FROM-CACHE
> Task :runners:core-construction-java:testClasses UP-TO-DATE
> Task :runners:core-construction-java:testJar
> Task :sdks:java:extensions:python:compileTestJava FROM-CACHE
> Task :sdks:java:extensions:python:testClasses UP-TO-DATE
> Task :sdks:java:extensions:python:testJar
> Task :runners:core-java:compileTestJava FROM-CACHE
> Task :runners:core-java:testClasses UP-TO-DATE
> Task :runners:core-java:testJar
> Task :runners:google-cloud-dataflow-java:compileJava FROM-CACHE
> Task :runners:google-cloud-dataflow-java:classes
> Task :runners:direct-java:compileTestJava FROM-CACHE
> Task :runners:direct-java:testClasses UP-TO-DATE
> Task :runners:google-cloud-dataflow-java:jar
> Task :runners:direct-java:shadowTestJar FROM-CACHE
> Task :runners:google-cloud-dataflow-java:worker:compileJava FROM-CACHE
> Task :runners:google-cloud-dataflow-java:worker:classes
> Task :sdks:java:extensions:protobuf:extractIncludeTestProto
> Task :sdks:java:extensions:protobuf:generateTestProto FROM-CACHE
> Task :sdks:java:extensions:protobuf:compileTestJava FROM-CACHE
> Task :sdks:java:extensions:protobuf:testClasses
> Task :sdks:java:extensions:protobuf:testJar
> Task :runners:google-cloud-dataflow-java:worker:shadowJar FROM-CACHE
> Task :sdks:java:io:google-cloud-platform:compileTestJava FROM-CACHE
> Task :sdks:java:io:google-cloud-platform:testClasses
> Task :sdks:java:io:google-cloud-platform:testJar
> Task :runners:google-cloud-dataflow-java:compileTestJava FROM-CACHE
> Task :runners:google-cloud-dataflow-java:testClasses UP-TO-DATE
> Task :runners:google-cloud-dataflow-java:testJar
Deprecated Gradle features were used in this build, making it incompatible with Gradle 8.0.
You can use '--warning-mode all' to show the individual deprecation warnings and determine if they come from your own scripts or plugins.
See https://docs.gradle.org/7.5.1/userguide/command_line_interface.html#sec:command_line_warnings
BUILD SUCCESSFUL in 29s
132 actionable tasks: 78 executed, 52 from cache, 2 up-to-date
Publishing build scan...
https://gradle.com/s/bu46yn6axpeog
Build step 'Invoke Gradle script' changed build result to SUCCESS
[Gradle] - Launching build.
[src] $ <https://ci-beam.apache.org/job/beam_PostCommit_Java_ValidatesRunner_Dataflow_Java17/ws/src/gradlew> -x shadowJar -x shadowTestJar -x compileJava -x compileTestJava -x jar -x testJar -x classes -x testClasses -Dorg.gradle.java.home=/usr/lib/jvm/java-17-openjdk-amd64 --continue --max-workers=12 -Dorg.gradle.jvmargs=-Xms2g -Dorg.gradle.jvmargs=-Xmx6g -Dorg.gradle.vfs.watch=false -Pdocker-pull-licenses :runners:google-cloud-dataflow-java:validatesRunner
To honour the JVM settings for this build a single-use Daemon process will be forked. See https://docs.gradle.org/7.5.1/userguide/gradle_daemon.html#sec:disabling_the_daemon.
Daemon will be stopped at the end of the build
Configuration on demand is an incubating feature.
> Task :buildSrc:compileJava NO-SOURCE
> Task :buildSrc:compileGroovy FROM-CACHE
> Task :buildSrc:pluginDescriptors UP-TO-DATE
> Task :buildSrc:processResources UP-TO-DATE
> Task :buildSrc:classes UP-TO-DATE
> Task :buildSrc:jar
> Task :buildSrc:assemble
> Task :buildSrc:spotlessGroovy UP-TO-DATE
> Task :buildSrc:spotlessGroovyCheck UP-TO-DATE
> Task :buildSrc:spotlessGroovyGradle UP-TO-DATE
> Task :buildSrc:spotlessGroovyGradleCheck UP-TO-DATE
> Task :buildSrc:spotlessCheck UP-TO-DATE
> Task :buildSrc:pluginUnderTestMetadata
> Task :buildSrc:compileTestJava NO-SOURCE
> Task :buildSrc:compileTestGroovy NO-SOURCE
> Task :buildSrc:processTestResources NO-SOURCE
> Task :buildSrc:testClasses UP-TO-DATE
> Task :buildSrc:test NO-SOURCE
> Task :buildSrc:validatePlugins FROM-CACHE
> Task :buildSrc:check UP-TO-DATE
> Task :buildSrc:build
> Task :runners:google-cloud-dataflow-java:validatesRunnerLegacyWorkerTest
org.apache.beam.sdk.schemas.AvroSchemaTest > testAvroPipelineGroupBy FAILED
java.lang.IllegalArgumentException at AvroSchemaTest.java:478
org.apache.beam.sdk.transforms.PerKeyOrderingTest > testMultipleStatefulOrderingWithShuffle FAILED
java.lang.IllegalArgumentException at PerKeyOrderingTest.java:254
org.apache.beam.sdk.transforms.ParDoSchemaTest > testReadAndWrite FAILED
java.lang.IllegalArgumentException at ParDoSchemaTest.java:135
org.apache.beam.sdk.transforms.ParDoSchemaTest > testSchemasPassedThrough FAILED
java.lang.IllegalArgumentException at ParDoSchemaTest.java:439
org.apache.beam.sdk.transforms.ParDoSchemaTest > testSchemaFieldSelectionNested FAILED
java.lang.IllegalArgumentException at ParDoSchemaTest.java:629
org.apache.beam.sdk.transforms.ParDoSchemaTest > testSchemaFieldSelectionUnboxing FAILED
java.lang.IllegalArgumentException at ParDoSchemaTest.java:538
org.apache.beam.sdk.transforms.ParDoSchemaTest > testSchemaFieldDescriptorSelectionUnboxing FAILED
java.lang.IllegalArgumentException at ParDoSchemaTest.java:578
org.apache.beam.sdk.transforms.ParDoSchemaTest > testInferredSchemaPipeline FAILED
java.lang.IllegalArgumentException at ParDoSchemaTest.java:417
org.apache.beam.sdk.transforms.ParDoSchemaTest > testFieldAccessSchemaPipeline FAILED
java.lang.IllegalArgumentException at ParDoSchemaTest.java:328
org.apache.beam.sdk.transforms.ParDoSchemaTest > testSimpleSchemaPipeline FAILED
java.lang.IllegalArgumentException at ParDoSchemaTest.java:101
org.apache.beam.sdk.transforms.ParDoSchemaTest > testSchemaConversionPipeline FAILED
java.lang.IllegalArgumentException at ParDoSchemaTest.java:465
org.apache.beam.sdk.transforms.ParDoSchemaTest > testReadAndWriteWithSchemaRegistry FAILED
java.lang.IllegalArgumentException at ParDoSchemaTest.java:291
org.apache.beam.sdk.transforms.ParDoSchemaTest > testReadAndWriteMultiOutput FAILED
java.lang.IllegalArgumentException at ParDoSchemaTest.java:195
org.apache.beam.sdk.transforms.ParDoSchemaTest > testNestedSchema FAILED
java.lang.IllegalArgumentException at ParDoSchemaTest.java:498
org.apache.beam.sdk.transforms.ParDoSchemaTest > testMapStateSchemaInference FAILED
java.lang.IllegalArgumentException at ParDoSchemaTest.java:879
org.apache.beam.sdk.transforms.PerKeyOrderingTest > testMultipleStatefulOrderingWithoutShuffle FAILED
java.lang.IllegalArgumentException at PerKeyOrderingTest.java:297
297 tests completed, 16 failed, 1 skipped
> Task :runners:google-cloud-dataflow-java:validatesRunnerLegacyWorkerTest FAILED
FAILURE: Build failed with an exception.
* What went wrong:
Execution failed for task ':runners:google-cloud-dataflow-java:validatesRunnerLegacyWorkerTest'.
> There were failing tests. See the report at: file://<https://ci-beam.apache.org/job/beam_PostCommit_Java_ValidatesRunner_Dataflow_Java17/ws/src/runners/google-cloud-dataflow-java/build/reports/tests/validatesRunnerLegacyWorkerTest/index.html>
* Try:
> Run with --stacktrace option to get the stack trace.
> Run with --info or --debug option to get more log output.
* Get more help at https://help.gradle.org
Deprecated Gradle features were used in this build, making it incompatible with Gradle 8.0.
You can use '--warning-mode all' to show the individual deprecation warnings and determine if they come from your own scripts or plugins.
See https://docs.gradle.org/7.5.1/userguide/command_line_interface.html#sec:command_line_warnings
BUILD FAILED in 5h 7m 1s
11 actionable tasks: 3 executed, 2 from cache, 6 up-to-date
Publishing build scan...
https://gradle.com/s/hgh5xnp6eitfq
Build step 'Invoke Gradle script' changed build result to FAILURE
Build step 'Invoke Gradle script' marked build as failure
---------------------------------------------------------------------
To unsubscribe, e-mail: builds-unsubscribe@beam.apache.org
For additional commands, e-mail: builds-help@beam.apache.org
Build failed in Jenkins: beam_PostCommit_Java_ValidatesRunner_Dataflow_Java17 #1645
Posted by Apache Jenkins Server <je...@builds.apache.org>.
See <https://ci-beam.apache.org/job/beam_PostCommit_Java_ValidatesRunner_Dataflow_Java17/1645/display/redirect>
Changes:
------------------------------------------
[...truncated 21.89 KB...]
> Task :runners:google-cloud-dataflow-java:processResources
> Task :sdks:java:io:common:jar
> Task :sdks:java:core:generateTestAvroProtocol NO-SOURCE
> Task :sdks:java:io:common:processTestResources NO-SOURCE
> Task :runners:google-cloud-dataflow-java:processTestResources NO-SOURCE
> Task :sdks:java:extensions:protobuf:processTestResources
> Task :model:fn-execution:processResources
> Task :sdks:java:io:google-cloud-platform:processTestResources
> Task :sdks:java:core:generateTestAvroJava
> Task :sdks:java:core:generateTestGrammarSource NO-SOURCE
> Task :sdks:java:core:processTestResources
> Task :runners:google-cloud-dataflow-java:worker:windmill:extractIncludeProto
> Task :model:pipeline:extractIncludeProto
> Task :runners:google-cloud-dataflow-java:worker:windmill:extractProto
> Task :model:pipeline:extractProto
> Task :runners:google-cloud-dataflow-java:worker:windmill:generateProto FROM-CACHE
> Task :model:pipeline:generateProto FROM-CACHE
> Task :runners:google-cloud-dataflow-java:worker:windmill:compileJava FROM-CACHE
> Task :runners:google-cloud-dataflow-java:worker:windmill:processResources
> Task :runners:google-cloud-dataflow-java:worker:windmill:classes
> Task :model:pipeline:compileJava FROM-CACHE
> Task :runners:google-cloud-dataflow-java:worker:windmill:shadowJar FROM-CACHE
> Task :model:pipeline:processResources
> Task :model:pipeline:classes
> Task :model:pipeline:jar
> Task :model:pipeline:shadowJar FROM-CACHE
> Task :model:fn-execution:extractIncludeProto
> Task :model:job-management:extractIncludeProto
> Task :model:fn-execution:generateProto FROM-CACHE
> Task :model:job-management:generateProto FROM-CACHE
> Task :model:job-management:compileJava FROM-CACHE
> Task :model:job-management:classes
> Task :model:fn-execution:compileJava FROM-CACHE
> Task :model:fn-execution:classes
> Task :model:job-management:shadowJar FROM-CACHE
> Task :model:fn-execution:shadowJar FROM-CACHE
> Task :sdks:java:core:compileJava FROM-CACHE
> Task :sdks:java:core:classes
> Task :sdks:java:core:shadowJar FROM-CACHE
> Task :sdks:java:extensions:arrow:compileJava FROM-CACHE
> Task :sdks:java:extensions:arrow:classes UP-TO-DATE
> Task :sdks:java:extensions:arrow:jar
> Task :runners:local-java:compileJava FROM-CACHE
> Task :runners:local-java:classes UP-TO-DATE
> Task :runners:local-java:jar
> Task :sdks:java:io:common:compileTestJava FROM-CACHE
> Task :sdks:java:io:common:testClasses UP-TO-DATE
> Task :sdks:java:io:common:testJar
> Task :sdks:java:testing:test-utils:compileJava FROM-CACHE
> Task :sdks:java:testing:test-utils:classes UP-TO-DATE
> Task :sdks:java:testing:test-utils:jar
> Task :sdks:java:testing:test-utils:compileTestJava FROM-CACHE
> Task :sdks:java:fn-execution:compileJava FROM-CACHE
> Task :sdks:java:fn-execution:classes UP-TO-DATE
> Task :sdks:java:testing:test-utils:testClasses UP-TO-DATE
> Task :sdks:java:testing:test-utils:testJar
> Task :sdks:java:fn-execution:jar
> Task :runners:core-construction-java:compileJava FROM-CACHE
> Task :runners:core-construction-java:classes UP-TO-DATE
> Task :sdks:java:core:jar
> Task :runners:core-construction-java:jar
> Task :sdks:java:extensions:protobuf:extractIncludeProto
> Task :sdks:java:extensions:protobuf:generateProto NO-SOURCE
> Task :sdks:java:extensions:python:compileJava FROM-CACHE
> Task :sdks:java:extensions:python:classes
> Task :sdks:java:extensions:python:jar
> Task :sdks:java:extensions:protobuf:compileJava FROM-CACHE
> Task :sdks:java:extensions:protobuf:classes UP-TO-DATE
> Task :sdks:java:extensions:protobuf:jar
> Task :runners:core-java:compileJava FROM-CACHE
> Task :runners:core-java:classes UP-TO-DATE
> Task :runners:core-java:jar
> Task :sdks:java:extensions:google-cloud-platform-core:compileJava FROM-CACHE
> Task :sdks:java:extensions:google-cloud-platform-core:classes UP-TO-DATE
> Task :sdks:java:harness:compileJava FROM-CACHE
> Task :sdks:java:harness:classes UP-TO-DATE
> Task :sdks:java:extensions:google-cloud-platform-core:jar
> Task :sdks:java:harness:jar
> Task :runners:java-fn-execution:compileJava FROM-CACHE
> Task :runners:java-fn-execution:classes UP-TO-DATE
> Task :runners:java-fn-execution:jar
> Task :sdks:java:expansion-service:compileJava FROM-CACHE
> Task :sdks:java:expansion-service:classes UP-TO-DATE
> Task :sdks:java:expansion-service:jar
> Task :runners:direct-java:compileJava FROM-CACHE
> Task :runners:direct-java:classes UP-TO-DATE
> Task :sdks:java:io:kafka:compileJava FROM-CACHE
> Task :sdks:java:io:kafka:classes UP-TO-DATE
> Task :sdks:java:io:kafka:jar
> Task :runners:direct-java:shadowJar FROM-CACHE
> Task :sdks:java:core:compileTestJava FROM-CACHE
> Task :sdks:java:core:testClasses
> Task :sdks:java:io:google-cloud-platform:compileJava FROM-CACHE
> Task :sdks:java:io:google-cloud-platform:classes UP-TO-DATE
> Task :sdks:java:core:shadowTestJar FROM-CACHE
> Task :sdks:java:io:google-cloud-platform:jar
> Task :sdks:java:extensions:google-cloud-platform-core:compileTestJava FROM-CACHE
> Task :sdks:java:extensions:google-cloud-platform-core:testClasses UP-TO-DATE
> Task :sdks:java:extensions:google-cloud-platform-core:testJar
> Task :runners:core-construction-java:compileTestJava FROM-CACHE
> Task :runners:core-construction-java:testClasses UP-TO-DATE
> Task :sdks:java:extensions:python:compileTestJava FROM-CACHE
> Task :sdks:java:extensions:python:testClasses UP-TO-DATE
> Task :sdks:java:extensions:python:testJar
> Task :runners:core-construction-java:testJar
> Task :runners:core-java:compileTestJava FROM-CACHE
> Task :runners:core-java:testClasses UP-TO-DATE
> Task :runners:core-java:testJar
> Task :runners:google-cloud-dataflow-java:compileJava FROM-CACHE
> Task :runners:google-cloud-dataflow-java:classes
> Task :runners:google-cloud-dataflow-java:jar
> Task :runners:direct-java:compileTestJava FROM-CACHE
> Task :runners:direct-java:testClasses UP-TO-DATE
> Task :runners:direct-java:shadowTestJar FROM-CACHE
> Task :runners:google-cloud-dataflow-java:worker:compileJava FROM-CACHE
> Task :runners:google-cloud-dataflow-java:worker:classes
> Task :sdks:java:extensions:protobuf:extractIncludeTestProto
> Task :sdks:java:extensions:protobuf:generateTestProto FROM-CACHE
> Task :runners:google-cloud-dataflow-java:worker:shadowJar FROM-CACHE
> Task :sdks:java:extensions:protobuf:compileTestJava FROM-CACHE
> Task :sdks:java:extensions:protobuf:testClasses
> Task :sdks:java:extensions:protobuf:testJar
> Task :sdks:java:io:google-cloud-platform:compileTestJava FROM-CACHE
> Task :sdks:java:io:google-cloud-platform:testClasses
> Task :sdks:java:io:google-cloud-platform:testJar
> Task :runners:google-cloud-dataflow-java:compileTestJava FROM-CACHE
> Task :runners:google-cloud-dataflow-java:testClasses UP-TO-DATE
> Task :runners:google-cloud-dataflow-java:testJar
Deprecated Gradle features were used in this build, making it incompatible with Gradle 8.0.
You can use '--warning-mode all' to show the individual deprecation warnings and determine if they come from your own scripts or plugins.
See https://docs.gradle.org/7.5.1/userguide/command_line_interface.html#sec:command_line_warnings
BUILD SUCCESSFUL in 29s
132 actionable tasks: 78 executed, 52 from cache, 2 up-to-date
Publishing build scan...
https://gradle.com/s/suovwuzarfc4e
Build step 'Invoke Gradle script' changed build result to SUCCESS
[Gradle] - Launching build.
[src] $ <https://ci-beam.apache.org/job/beam_PostCommit_Java_ValidatesRunner_Dataflow_Java17/ws/src/gradlew> -x shadowJar -x shadowTestJar -x compileJava -x compileTestJava -x jar -x testJar -x classes -x testClasses -Dorg.gradle.java.home=/usr/lib/jvm/java-17-openjdk-amd64 --continue --max-workers=12 -Dorg.gradle.jvmargs=-Xms2g -Dorg.gradle.jvmargs=-Xmx6g -Dorg.gradle.vfs.watch=false -Pdocker-pull-licenses :runners:google-cloud-dataflow-java:validatesRunner
To honour the JVM settings for this build a single-use Daemon process will be forked. See https://docs.gradle.org/7.5.1/userguide/gradle_daemon.html#sec:disabling_the_daemon.
Daemon will be stopped at the end of the build
Configuration on demand is an incubating feature.
> Task :buildSrc:compileJava NO-SOURCE
> Task :buildSrc:compileGroovy FROM-CACHE
> Task :buildSrc:pluginDescriptors UP-TO-DATE
> Task :buildSrc:processResources UP-TO-DATE
> Task :buildSrc:classes UP-TO-DATE
> Task :buildSrc:jar
> Task :buildSrc:assemble
> Task :buildSrc:spotlessGroovy UP-TO-DATE
> Task :buildSrc:spotlessGroovyCheck UP-TO-DATE
> Task :buildSrc:spotlessGroovyGradle UP-TO-DATE
> Task :buildSrc:spotlessGroovyGradleCheck UP-TO-DATE
> Task :buildSrc:spotlessCheck UP-TO-DATE
> Task :buildSrc:pluginUnderTestMetadata
> Task :buildSrc:compileTestJava NO-SOURCE
> Task :buildSrc:compileTestGroovy NO-SOURCE
> Task :buildSrc:processTestResources NO-SOURCE
> Task :buildSrc:testClasses UP-TO-DATE
> Task :buildSrc:test NO-SOURCE
> Task :buildSrc:validatePlugins FROM-CACHE
> Task :buildSrc:check UP-TO-DATE
> Task :buildSrc:build
> Task :runners:google-cloud-dataflow-java:validatesRunnerLegacyWorkerTest
org.apache.beam.sdk.schemas.AvroSchemaTest > testAvroPipelineGroupBy FAILED
java.lang.IllegalArgumentException at AvroSchemaTest.java:478
org.apache.beam.sdk.transforms.PerKeyOrderingTest > testMultipleStatefulOrderingWithShuffle FAILED
java.lang.IllegalArgumentException at PerKeyOrderingTest.java:254
org.apache.beam.sdk.transforms.ParDoSchemaTest > testReadAndWrite FAILED
java.lang.IllegalArgumentException at ParDoSchemaTest.java:135
org.apache.beam.sdk.transforms.ParDoSchemaTest > testSchemasPassedThrough FAILED
java.lang.IllegalArgumentException at ParDoSchemaTest.java:439
org.apache.beam.sdk.transforms.ParDoSchemaTest > testSchemaFieldSelectionNested FAILED
java.lang.IllegalArgumentException at ParDoSchemaTest.java:629
org.apache.beam.sdk.transforms.ParDoSchemaTest > testSchemaFieldSelectionUnboxing FAILED
java.lang.IllegalArgumentException at ParDoSchemaTest.java:538
org.apache.beam.sdk.transforms.ParDoSchemaTest > testSchemaFieldDescriptorSelectionUnboxing FAILED
java.lang.IllegalArgumentException at ParDoSchemaTest.java:578
org.apache.beam.sdk.transforms.ParDoSchemaTest > testInferredSchemaPipeline FAILED
java.lang.IllegalArgumentException at ParDoSchemaTest.java:417
org.apache.beam.sdk.transforms.ParDoSchemaTest > testFieldAccessSchemaPipeline FAILED
java.lang.IllegalArgumentException at ParDoSchemaTest.java:328
org.apache.beam.sdk.transforms.ParDoSchemaTest > testSimpleSchemaPipeline FAILED
java.lang.IllegalArgumentException at ParDoSchemaTest.java:101
org.apache.beam.sdk.transforms.ParDoSchemaTest > testSchemaConversionPipeline FAILED
java.lang.IllegalArgumentException at ParDoSchemaTest.java:465
org.apache.beam.sdk.transforms.ParDoSchemaTest > testReadAndWriteWithSchemaRegistry FAILED
java.lang.IllegalArgumentException at ParDoSchemaTest.java:291
org.apache.beam.sdk.transforms.ParDoSchemaTest > testReadAndWriteMultiOutput FAILED
java.lang.IllegalArgumentException at ParDoSchemaTest.java:195
org.apache.beam.sdk.transforms.ParDoSchemaTest > testNestedSchema FAILED
java.lang.IllegalArgumentException at ParDoSchemaTest.java:498
org.apache.beam.sdk.transforms.ParDoSchemaTest > testMapStateSchemaInference FAILED
java.lang.IllegalArgumentException at ParDoSchemaTest.java:879
org.apache.beam.sdk.transforms.PerKeyOrderingTest > testMultipleStatefulOrderingWithoutShuffle FAILED
java.lang.IllegalArgumentException at PerKeyOrderingTest.java:297
297 tests completed, 16 failed, 1 skipped
> Task :runners:google-cloud-dataflow-java:validatesRunnerLegacyWorkerTest FAILED
FAILURE: Build failed with an exception.
* What went wrong:
Execution failed for task ':runners:google-cloud-dataflow-java:validatesRunnerLegacyWorkerTest'.
> There were failing tests. See the report at: file://<https://ci-beam.apache.org/job/beam_PostCommit_Java_ValidatesRunner_Dataflow_Java17/ws/src/runners/google-cloud-dataflow-java/build/reports/tests/validatesRunnerLegacyWorkerTest/index.html>
* Try:
> Run with --stacktrace option to get the stack trace.
> Run with --info or --debug option to get more log output.
* Get more help at https://help.gradle.org
Deprecated Gradle features were used in this build, making it incompatible with Gradle 8.0.
You can use '--warning-mode all' to show the individual deprecation warnings and determine if they come from your own scripts or plugins.
See https://docs.gradle.org/7.5.1/userguide/command_line_interface.html#sec:command_line_warnings
BUILD FAILED in 5h 8m 32s
11 actionable tasks: 3 executed, 2 from cache, 6 up-to-date
Publishing build scan...
https://gradle.com/s/zpwivlpsn3dts
Build step 'Invoke Gradle script' changed build result to FAILURE
Build step 'Invoke Gradle script' marked build as failure
---------------------------------------------------------------------
To unsubscribe, e-mail: builds-unsubscribe@beam.apache.org
For additional commands, e-mail: builds-help@beam.apache.org
Build failed in Jenkins: beam_PostCommit_Java_ValidatesRunner_Dataflow_Java17 #1644
Posted by Apache Jenkins Server <je...@builds.apache.org>.
See <https://ci-beam.apache.org/job/beam_PostCommit_Java_ValidatesRunner_Dataflow_Java17/1644/display/redirect>
Changes:
------------------------------------------
[...truncated 21.89 KB...]
> Task :runners:google-cloud-dataflow-java:processResources
> Task :sdks:java:core:generateTestAvroProtocol NO-SOURCE
> Task :runners:google-cloud-dataflow-java:processTestResources NO-SOURCE
> Task :sdks:java:io:common:jar
> Task :sdks:java:io:common:processTestResources NO-SOURCE
> Task :sdks:java:extensions:protobuf:processTestResources
> Task :model:fn-execution:processResources
> Task :sdks:java:io:google-cloud-platform:processTestResources
> Task :sdks:java:core:generateTestAvroJava
> Task :sdks:java:core:generateTestGrammarSource NO-SOURCE
> Task :sdks:java:core:processTestResources
> Task :runners:google-cloud-dataflow-java:worker:windmill:extractIncludeProto
> Task :model:pipeline:extractIncludeProto
> Task :model:pipeline:extractProto
> Task :runners:google-cloud-dataflow-java:worker:windmill:extractProto
> Task :runners:google-cloud-dataflow-java:worker:windmill:generateProto FROM-CACHE
> Task :model:pipeline:generateProto FROM-CACHE
> Task :runners:google-cloud-dataflow-java:worker:windmill:compileJava FROM-CACHE
> Task :runners:google-cloud-dataflow-java:worker:windmill:processResources
> Task :runners:google-cloud-dataflow-java:worker:windmill:classes
> Task :runners:google-cloud-dataflow-java:worker:windmill:shadowJar FROM-CACHE
> Task :model:pipeline:compileJava FROM-CACHE
> Task :model:pipeline:processResources
> Task :model:pipeline:classes
> Task :model:pipeline:jar
> Task :model:pipeline:shadowJar FROM-CACHE
> Task :model:fn-execution:extractIncludeProto
> Task :model:job-management:extractIncludeProto
> Task :model:job-management:generateProto FROM-CACHE
> Task :model:fn-execution:generateProto FROM-CACHE
> Task :model:fn-execution:compileJava FROM-CACHE
> Task :model:fn-execution:classes
> Task :model:job-management:compileJava FROM-CACHE
> Task :model:job-management:classes
> Task :model:job-management:shadowJar FROM-CACHE
> Task :model:fn-execution:shadowJar FROM-CACHE
> Task :sdks:java:core:compileJava FROM-CACHE
> Task :sdks:java:core:classes
> Task :sdks:java:core:shadowJar FROM-CACHE
> Task :runners:local-java:compileJava FROM-CACHE
> Task :runners:local-java:classes UP-TO-DATE
> Task :runners:local-java:jar
> Task :sdks:java:io:common:compileTestJava FROM-CACHE
> Task :sdks:java:io:common:testClasses UP-TO-DATE
> Task :sdks:java:extensions:arrow:compileJava FROM-CACHE
> Task :sdks:java:extensions:arrow:classes UP-TO-DATE
> Task :sdks:java:extensions:arrow:jar
> Task :sdks:java:io:common:testJar
> Task :sdks:java:testing:test-utils:compileJava FROM-CACHE
> Task :sdks:java:testing:test-utils:classes UP-TO-DATE
> Task :sdks:java:testing:test-utils:jar
> Task :sdks:java:testing:test-utils:compileTestJava FROM-CACHE
> Task :sdks:java:testing:test-utils:testClasses UP-TO-DATE
> Task :sdks:java:testing:test-utils:testJar
> Task :sdks:java:fn-execution:compileJava FROM-CACHE
> Task :sdks:java:fn-execution:classes UP-TO-DATE
> Task :sdks:java:fn-execution:jar
> Task :sdks:java:core:jar
> Task :runners:core-construction-java:compileJava FROM-CACHE
> Task :runners:core-construction-java:classes UP-TO-DATE
> Task :sdks:java:extensions:protobuf:extractIncludeProto
> Task :sdks:java:extensions:protobuf:generateProto NO-SOURCE
> Task :runners:core-construction-java:jar
> Task :sdks:java:extensions:protobuf:compileJava FROM-CACHE
> Task :sdks:java:extensions:protobuf:classes UP-TO-DATE
> Task :sdks:java:extensions:protobuf:jar
> Task :sdks:java:extensions:python:compileJava FROM-CACHE
> Task :sdks:java:extensions:python:classes
> Task :sdks:java:extensions:python:jar
> Task :runners:core-java:compileJava FROM-CACHE
> Task :runners:core-java:classes UP-TO-DATE
> Task :runners:core-java:jar
> Task :sdks:java:extensions:google-cloud-platform-core:compileJava FROM-CACHE
> Task :sdks:java:extensions:google-cloud-platform-core:classes UP-TO-DATE
> Task :sdks:java:harness:compileJava FROM-CACHE
> Task :sdks:java:harness:classes UP-TO-DATE
> Task :sdks:java:extensions:google-cloud-platform-core:jar
> Task :sdks:java:harness:jar
> Task :runners:java-fn-execution:compileJava FROM-CACHE
> Task :runners:java-fn-execution:classes UP-TO-DATE
> Task :runners:java-fn-execution:jar
> Task :sdks:java:expansion-service:compileJava FROM-CACHE
> Task :sdks:java:expansion-service:classes UP-TO-DATE
> Task :sdks:java:expansion-service:jar
> Task :runners:direct-java:compileJava FROM-CACHE
> Task :runners:direct-java:classes UP-TO-DATE
> Task :sdks:java:io:kafka:compileJava FROM-CACHE
> Task :sdks:java:io:kafka:classes UP-TO-DATE
> Task :sdks:java:io:kafka:jar
> Task :sdks:java:core:compileTestJava FROM-CACHE
> Task :sdks:java:core:testClasses
> Task :runners:direct-java:shadowJar FROM-CACHE
> Task :sdks:java:core:shadowTestJar FROM-CACHE
> Task :sdks:java:io:google-cloud-platform:compileJava FROM-CACHE
> Task :sdks:java:io:google-cloud-platform:classes UP-TO-DATE
> Task :sdks:java:extensions:google-cloud-platform-core:compileTestJava FROM-CACHE
> Task :sdks:java:extensions:google-cloud-platform-core:testClasses UP-TO-DATE
> Task :sdks:java:extensions:google-cloud-platform-core:testJar
> Task :runners:core-java:compileTestJava FROM-CACHE
> Task :runners:core-java:testClasses UP-TO-DATE
> Task :runners:core-construction-java:compileTestJava FROM-CACHE
> Task :runners:core-construction-java:testClasses UP-TO-DATE
> Task :runners:core-java:testJar
> Task :runners:core-construction-java:testJar
> Task :sdks:java:extensions:python:compileTestJava FROM-CACHE
> Task :sdks:java:extensions:python:testClasses UP-TO-DATE
> Task :sdks:java:extensions:python:testJar
> Task :sdks:java:io:google-cloud-platform:jar
> Task :runners:direct-java:compileTestJava FROM-CACHE
> Task :runners:direct-java:testClasses UP-TO-DATE
> Task :runners:google-cloud-dataflow-java:compileJava FROM-CACHE
> Task :runners:google-cloud-dataflow-java:classes
> Task :runners:direct-java:shadowTestJar FROM-CACHE
> Task :runners:google-cloud-dataflow-java:jar
> Task :runners:google-cloud-dataflow-java:worker:compileJava FROM-CACHE
> Task :runners:google-cloud-dataflow-java:worker:classes
> Task :sdks:java:extensions:protobuf:extractIncludeTestProto
> Task :sdks:java:extensions:protobuf:generateTestProto FROM-CACHE
> Task :sdks:java:extensions:protobuf:compileTestJava FROM-CACHE
> Task :sdks:java:extensions:protobuf:testClasses
> Task :sdks:java:extensions:protobuf:testJar
> Task :runners:google-cloud-dataflow-java:worker:shadowJar FROM-CACHE
> Task :sdks:java:io:google-cloud-platform:compileTestJava FROM-CACHE
> Task :sdks:java:io:google-cloud-platform:testClasses
> Task :sdks:java:io:google-cloud-platform:testJar
> Task :runners:google-cloud-dataflow-java:compileTestJava FROM-CACHE
> Task :runners:google-cloud-dataflow-java:testClasses UP-TO-DATE
> Task :runners:google-cloud-dataflow-java:testJar
Deprecated Gradle features were used in this build, making it incompatible with Gradle 8.0.
You can use '--warning-mode all' to show the individual deprecation warnings and determine if they come from your own scripts or plugins.
See https://docs.gradle.org/7.5.1/userguide/command_line_interface.html#sec:command_line_warnings
BUILD SUCCESSFUL in 28s
132 actionable tasks: 78 executed, 52 from cache, 2 up-to-date
Publishing build scan...
https://gradle.com/s/wgbiibn5vayle
Build step 'Invoke Gradle script' changed build result to SUCCESS
[Gradle] - Launching build.
[src] $ <https://ci-beam.apache.org/job/beam_PostCommit_Java_ValidatesRunner_Dataflow_Java17/ws/src/gradlew> -x shadowJar -x shadowTestJar -x compileJava -x compileTestJava -x jar -x testJar -x classes -x testClasses -Dorg.gradle.java.home=/usr/lib/jvm/java-17-openjdk-amd64 --continue --max-workers=12 -Dorg.gradle.jvmargs=-Xms2g -Dorg.gradle.jvmargs=-Xmx6g -Dorg.gradle.vfs.watch=false -Pdocker-pull-licenses :runners:google-cloud-dataflow-java:validatesRunner
To honour the JVM settings for this build a single-use Daemon process will be forked. See https://docs.gradle.org/7.5.1/userguide/gradle_daemon.html#sec:disabling_the_daemon.
Daemon will be stopped at the end of the build
Configuration on demand is an incubating feature.
> Task :buildSrc:compileJava NO-SOURCE
> Task :buildSrc:compileGroovy FROM-CACHE
> Task :buildSrc:pluginDescriptors UP-TO-DATE
> Task :buildSrc:processResources UP-TO-DATE
> Task :buildSrc:classes UP-TO-DATE
> Task :buildSrc:jar
> Task :buildSrc:assemble
> Task :buildSrc:spotlessGroovy UP-TO-DATE
> Task :buildSrc:spotlessGroovyCheck UP-TO-DATE
> Task :buildSrc:spotlessGroovyGradle UP-TO-DATE
> Task :buildSrc:spotlessGroovyGradleCheck UP-TO-DATE
> Task :buildSrc:spotlessCheck UP-TO-DATE
> Task :buildSrc:pluginUnderTestMetadata
> Task :buildSrc:compileTestJava NO-SOURCE
> Task :buildSrc:compileTestGroovy NO-SOURCE
> Task :buildSrc:processTestResources NO-SOURCE
> Task :buildSrc:testClasses UP-TO-DATE
> Task :buildSrc:test NO-SOURCE
> Task :buildSrc:validatePlugins FROM-CACHE
> Task :buildSrc:check UP-TO-DATE
> Task :buildSrc:build
> Task :runners:google-cloud-dataflow-java:validatesRunnerLegacyWorkerTest
org.apache.beam.sdk.schemas.AvroSchemaTest > testAvroPipelineGroupBy FAILED
java.lang.IllegalArgumentException at AvroSchemaTest.java:478
org.apache.beam.sdk.transforms.PerKeyOrderingTest > testMultipleStatefulOrderingWithShuffle FAILED
java.lang.IllegalArgumentException at PerKeyOrderingTest.java:254
org.apache.beam.sdk.transforms.ParDoSchemaTest > testReadAndWrite FAILED
java.lang.IllegalArgumentException at ParDoSchemaTest.java:135
org.apache.beam.sdk.transforms.ParDoSchemaTest > testSchemasPassedThrough FAILED
java.lang.IllegalArgumentException at ParDoSchemaTest.java:439
org.apache.beam.sdk.transforms.ParDoSchemaTest > testSchemaFieldSelectionNested FAILED
java.lang.IllegalArgumentException at ParDoSchemaTest.java:629
org.apache.beam.sdk.transforms.ParDoSchemaTest > testSchemaFieldSelectionUnboxing FAILED
java.lang.IllegalArgumentException at ParDoSchemaTest.java:538
org.apache.beam.sdk.transforms.ParDoSchemaTest > testSchemaFieldDescriptorSelectionUnboxing FAILED
java.lang.IllegalArgumentException at ParDoSchemaTest.java:578
org.apache.beam.sdk.transforms.ParDoSchemaTest > testInferredSchemaPipeline FAILED
java.lang.IllegalArgumentException at ParDoSchemaTest.java:417
org.apache.beam.sdk.transforms.ParDoSchemaTest > testFieldAccessSchemaPipeline FAILED
java.lang.IllegalArgumentException at ParDoSchemaTest.java:328
org.apache.beam.sdk.transforms.ParDoSchemaTest > testSimpleSchemaPipeline FAILED
java.lang.IllegalArgumentException at ParDoSchemaTest.java:101
org.apache.beam.sdk.transforms.ParDoSchemaTest > testSchemaConversionPipeline FAILED
java.lang.IllegalArgumentException at ParDoSchemaTest.java:465
org.apache.beam.sdk.transforms.ParDoSchemaTest > testReadAndWriteWithSchemaRegistry FAILED
java.lang.IllegalArgumentException at ParDoSchemaTest.java:291
org.apache.beam.sdk.transforms.ParDoSchemaTest > testReadAndWriteMultiOutput FAILED
java.lang.IllegalArgumentException at ParDoSchemaTest.java:195
org.apache.beam.sdk.transforms.ParDoSchemaTest > testNestedSchema FAILED
java.lang.IllegalArgumentException at ParDoSchemaTest.java:498
org.apache.beam.sdk.transforms.ParDoSchemaTest > testMapStateSchemaInference FAILED
java.lang.IllegalArgumentException at ParDoSchemaTest.java:879
org.apache.beam.sdk.transforms.PerKeyOrderingTest > testMultipleStatefulOrderingWithoutShuffle FAILED
java.lang.IllegalArgumentException at PerKeyOrderingTest.java:297
297 tests completed, 16 failed, 1 skipped
> Task :runners:google-cloud-dataflow-java:validatesRunnerLegacyWorkerTest FAILED
FAILURE: Build failed with an exception.
* What went wrong:
Execution failed for task ':runners:google-cloud-dataflow-java:validatesRunnerLegacyWorkerTest'.
> There were failing tests. See the report at: file://<https://ci-beam.apache.org/job/beam_PostCommit_Java_ValidatesRunner_Dataflow_Java17/ws/src/runners/google-cloud-dataflow-java/build/reports/tests/validatesRunnerLegacyWorkerTest/index.html>
* Try:
> Run with --stacktrace option to get the stack trace.
> Run with --info or --debug option to get more log output.
* Get more help at https://help.gradle.org
Deprecated Gradle features were used in this build, making it incompatible with Gradle 8.0.
You can use '--warning-mode all' to show the individual deprecation warnings and determine if they come from your own scripts or plugins.
See https://docs.gradle.org/7.5.1/userguide/command_line_interface.html#sec:command_line_warnings
BUILD FAILED in 5h 6m 48s
11 actionable tasks: 3 executed, 2 from cache, 6 up-to-date
Publishing build scan...
https://gradle.com/s/6ztdcfhvfvema
Build step 'Invoke Gradle script' changed build result to FAILURE
Build step 'Invoke Gradle script' marked build as failure
---------------------------------------------------------------------
To unsubscribe, e-mail: builds-unsubscribe@beam.apache.org
For additional commands, e-mail: builds-help@beam.apache.org
Build failed in Jenkins: beam_PostCommit_Java_ValidatesRunner_Dataflow_Java17 #1643
Posted by Apache Jenkins Server <je...@builds.apache.org>.
See <https://ci-beam.apache.org/job/beam_PostCommit_Java_ValidatesRunner_Dataflow_Java17/1643/display/redirect>
Changes:
------------------------------------------
[...truncated 21.89 KB...]
> Task :sdks:java:io:common:processTestResources NO-SOURCE
> Task :sdks:java:extensions:protobuf:processTestResources
> Task :sdks:java:core:processResources
> Task :runners:google-cloud-dataflow-java:processResources
> Task :sdks:java:core:generateTestAvroProtocol NO-SOURCE
> Task :runners:google-cloud-dataflow-java:processTestResources NO-SOURCE
> Task :model:fn-execution:processResources
> Task :sdks:java:io:google-cloud-platform:processTestResources
> Task :sdks:java:core:generateTestAvroJava
> Task :sdks:java:core:generateTestGrammarSource NO-SOURCE
> Task :sdks:java:core:processTestResources
> Task :model:pipeline:extractIncludeProto
> Task :model:pipeline:extractProto
> Task :runners:google-cloud-dataflow-java:worker:windmill:extractIncludeProto
> Task :runners:google-cloud-dataflow-java:worker:windmill:extractProto
> Task :model:pipeline:generateProto FROM-CACHE
> Task :runners:google-cloud-dataflow-java:worker:windmill:generateProto FROM-CACHE
> Task :runners:google-cloud-dataflow-java:worker:windmill:compileJava FROM-CACHE
> Task :runners:google-cloud-dataflow-java:worker:windmill:processResources
> Task :runners:google-cloud-dataflow-java:worker:windmill:classes
> Task :runners:google-cloud-dataflow-java:worker:windmill:shadowJar FROM-CACHE
> Task :model:pipeline:compileJava FROM-CACHE
> Task :model:pipeline:processResources
> Task :model:pipeline:classes
> Task :model:pipeline:jar
> Task :model:pipeline:shadowJar FROM-CACHE
> Task :model:fn-execution:extractIncludeProto
> Task :model:job-management:extractIncludeProto
> Task :model:job-management:generateProto FROM-CACHE
> Task :model:fn-execution:generateProto FROM-CACHE
> Task :model:fn-execution:compileJava FROM-CACHE
> Task :model:fn-execution:classes
> Task :model:job-management:compileJava FROM-CACHE
> Task :model:job-management:classes
> Task :model:fn-execution:shadowJar FROM-CACHE
> Task :model:job-management:shadowJar FROM-CACHE
> Task :sdks:java:core:compileJava FROM-CACHE
> Task :sdks:java:core:classes
> Task :sdks:java:core:shadowJar FROM-CACHE
> Task :sdks:java:io:common:compileTestJava FROM-CACHE
> Task :sdks:java:io:common:testClasses UP-TO-DATE
> Task :sdks:java:testing:test-utils:compileJava FROM-CACHE
> Task :runners:local-java:compileJava FROM-CACHE
> Task :sdks:java:testing:test-utils:classes UP-TO-DATE
> Task :sdks:java:extensions:arrow:compileJava FROM-CACHE
> Task :sdks:java:extensions:arrow:classes UP-TO-DATE
> Task :runners:local-java:classes UP-TO-DATE
> Task :sdks:java:io:common:testJar
> Task :sdks:java:extensions:arrow:jar
> Task :runners:local-java:jar
> Task :sdks:java:testing:test-utils:jar
> Task :sdks:java:core:jar
> Task :sdks:java:testing:test-utils:compileTestJava FROM-CACHE
> Task :sdks:java:testing:test-utils:testClasses UP-TO-DATE
> Task :sdks:java:testing:test-utils:testJar
> Task :sdks:java:fn-execution:compileJava FROM-CACHE
> Task :sdks:java:fn-execution:classes UP-TO-DATE
> Task :sdks:java:fn-execution:jar
> Task :runners:core-construction-java:compileJava FROM-CACHE
> Task :runners:core-construction-java:classes UP-TO-DATE
> Task :sdks:java:extensions:protobuf:extractIncludeProto
> Task :sdks:java:extensions:protobuf:generateProto NO-SOURCE
> Task :sdks:java:extensions:protobuf:compileJava FROM-CACHE
> Task :sdks:java:extensions:protobuf:classes UP-TO-DATE
> Task :sdks:java:extensions:protobuf:jar
> Task :runners:core-construction-java:jar
> Task :sdks:java:extensions:python:compileJava FROM-CACHE
> Task :sdks:java:extensions:python:classes
> Task :sdks:java:extensions:python:jar
> Task :runners:core-java:compileJava FROM-CACHE
> Task :runners:core-java:classes UP-TO-DATE
> Task :runners:core-java:jar
> Task :sdks:java:extensions:google-cloud-platform-core:compileJava FROM-CACHE
> Task :sdks:java:extensions:google-cloud-platform-core:classes UP-TO-DATE
> Task :sdks:java:harness:compileJava FROM-CACHE
> Task :sdks:java:extensions:google-cloud-platform-core:jar
> Task :sdks:java:harness:classes UP-TO-DATE
> Task :sdks:java:harness:jar
> Task :runners:java-fn-execution:compileJava FROM-CACHE
> Task :runners:java-fn-execution:classes UP-TO-DATE
> Task :runners:java-fn-execution:jar
> Task :sdks:java:core:compileTestJava FROM-CACHE
> Task :sdks:java:core:testClasses
> Task :sdks:java:expansion-service:compileJava FROM-CACHE
> Task :sdks:java:expansion-service:classes UP-TO-DATE
> Task :sdks:java:expansion-service:jar
> Task :runners:direct-java:compileJava FROM-CACHE
> Task :runners:direct-java:classes UP-TO-DATE
> Task :sdks:java:core:shadowTestJar FROM-CACHE
> Task :sdks:java:io:kafka:compileJava FROM-CACHE
> Task :sdks:java:io:kafka:classes UP-TO-DATE
> Task :sdks:java:io:kafka:jar
> Task :runners:direct-java:shadowJar FROM-CACHE
> Task :sdks:java:io:google-cloud-platform:compileJava FROM-CACHE
> Task :sdks:java:io:google-cloud-platform:classes UP-TO-DATE
> Task :sdks:java:extensions:google-cloud-platform-core:compileTestJava FROM-CACHE
> Task :sdks:java:extensions:google-cloud-platform-core:testClasses UP-TO-DATE
> Task :sdks:java:extensions:google-cloud-platform-core:testJar
> Task :runners:core-construction-java:compileTestJava FROM-CACHE
> Task :runners:core-construction-java:testClasses UP-TO-DATE
> Task :runners:core-construction-java:testJar
> Task :sdks:java:extensions:python:compileTestJava FROM-CACHE
> Task :sdks:java:extensions:python:testClasses UP-TO-DATE
> Task :runners:core-java:compileTestJava FROM-CACHE
> Task :runners:core-java:testClasses UP-TO-DATE
> Task :sdks:java:extensions:python:testJar
> Task :runners:core-java:testJar
> Task :runners:direct-java:compileTestJava FROM-CACHE
> Task :runners:direct-java:testClasses UP-TO-DATE
> Task :sdks:java:io:google-cloud-platform:jar
> Task :runners:direct-java:shadowTestJar FROM-CACHE
> Task :runners:google-cloud-dataflow-java:compileJava FROM-CACHE
> Task :runners:google-cloud-dataflow-java:classes
> Task :runners:google-cloud-dataflow-java:jar
> Task :sdks:java:extensions:protobuf:extractIncludeTestProto
> Task :sdks:java:extensions:protobuf:generateTestProto FROM-CACHE
> Task :runners:google-cloud-dataflow-java:worker:compileJava FROM-CACHE
> Task :runners:google-cloud-dataflow-java:worker:classes
> Task :sdks:java:extensions:protobuf:compileTestJava FROM-CACHE
> Task :sdks:java:extensions:protobuf:testClasses
> Task :sdks:java:extensions:protobuf:testJar
> Task :runners:google-cloud-dataflow-java:worker:shadowJar FROM-CACHE
> Task :sdks:java:io:google-cloud-platform:compileTestJava FROM-CACHE
> Task :sdks:java:io:google-cloud-platform:testClasses
> Task :sdks:java:io:google-cloud-platform:testJar
> Task :runners:google-cloud-dataflow-java:compileTestJava FROM-CACHE
> Task :runners:google-cloud-dataflow-java:testClasses UP-TO-DATE
> Task :runners:google-cloud-dataflow-java:testJar
Deprecated Gradle features were used in this build, making it incompatible with Gradle 8.0.
You can use '--warning-mode all' to show the individual deprecation warnings and determine if they come from your own scripts or plugins.
See https://docs.gradle.org/7.5.1/userguide/command_line_interface.html#sec:command_line_warnings
BUILD SUCCESSFUL in 27s
132 actionable tasks: 78 executed, 52 from cache, 2 up-to-date
Publishing build scan...
https://gradle.com/s/5vkgynbo7fqra
Build step 'Invoke Gradle script' changed build result to SUCCESS
[Gradle] - Launching build.
[src] $ <https://ci-beam.apache.org/job/beam_PostCommit_Java_ValidatesRunner_Dataflow_Java17/ws/src/gradlew> -x shadowJar -x shadowTestJar -x compileJava -x compileTestJava -x jar -x testJar -x classes -x testClasses -Dorg.gradle.java.home=/usr/lib/jvm/java-17-openjdk-amd64 --continue --max-workers=12 -Dorg.gradle.jvmargs=-Xms2g -Dorg.gradle.jvmargs=-Xmx6g -Dorg.gradle.vfs.watch=false -Pdocker-pull-licenses :runners:google-cloud-dataflow-java:validatesRunner
To honour the JVM settings for this build a single-use Daemon process will be forked. See https://docs.gradle.org/7.5.1/userguide/gradle_daemon.html#sec:disabling_the_daemon.
Daemon will be stopped at the end of the build
Configuration on demand is an incubating feature.
> Task :buildSrc:compileJava NO-SOURCE
> Task :buildSrc:compileGroovy FROM-CACHE
> Task :buildSrc:pluginDescriptors UP-TO-DATE
> Task :buildSrc:processResources UP-TO-DATE
> Task :buildSrc:classes UP-TO-DATE
> Task :buildSrc:jar
> Task :buildSrc:assemble
> Task :buildSrc:spotlessGroovy UP-TO-DATE
> Task :buildSrc:spotlessGroovyCheck UP-TO-DATE
> Task :buildSrc:spotlessGroovyGradle UP-TO-DATE
> Task :buildSrc:spotlessGroovyGradleCheck UP-TO-DATE
> Task :buildSrc:spotlessCheck UP-TO-DATE
> Task :buildSrc:pluginUnderTestMetadata
> Task :buildSrc:compileTestJava NO-SOURCE
> Task :buildSrc:compileTestGroovy NO-SOURCE
> Task :buildSrc:processTestResources NO-SOURCE
> Task :buildSrc:testClasses UP-TO-DATE
> Task :buildSrc:test NO-SOURCE
> Task :buildSrc:validatePlugins FROM-CACHE
> Task :buildSrc:check UP-TO-DATE
> Task :buildSrc:build
> Task :runners:google-cloud-dataflow-java:validatesRunnerLegacyWorkerTest
org.apache.beam.sdk.schemas.AvroSchemaTest > testAvroPipelineGroupBy FAILED
java.lang.IllegalArgumentException at AvroSchemaTest.java:478
org.apache.beam.sdk.transforms.PerKeyOrderingTest > testMultipleStatefulOrderingWithShuffle FAILED
java.lang.IllegalArgumentException at PerKeyOrderingTest.java:254
org.apache.beam.sdk.transforms.ParDoSchemaTest > testReadAndWrite FAILED
java.lang.IllegalArgumentException at ParDoSchemaTest.java:135
org.apache.beam.sdk.transforms.ParDoSchemaTest > testSchemasPassedThrough FAILED
java.lang.IllegalArgumentException at ParDoSchemaTest.java:439
org.apache.beam.sdk.transforms.ParDoSchemaTest > testSchemaFieldSelectionNested FAILED
java.lang.IllegalArgumentException at ParDoSchemaTest.java:629
org.apache.beam.sdk.transforms.ParDoSchemaTest > testSchemaFieldSelectionUnboxing FAILED
java.lang.IllegalArgumentException at ParDoSchemaTest.java:538
org.apache.beam.sdk.transforms.ParDoSchemaTest > testSchemaFieldDescriptorSelectionUnboxing FAILED
java.lang.IllegalArgumentException at ParDoSchemaTest.java:578
org.apache.beam.sdk.transforms.ParDoSchemaTest > testInferredSchemaPipeline FAILED
java.lang.IllegalArgumentException at ParDoSchemaTest.java:417
org.apache.beam.sdk.transforms.ParDoSchemaTest > testFieldAccessSchemaPipeline FAILED
java.lang.IllegalArgumentException at ParDoSchemaTest.java:328
org.apache.beam.sdk.transforms.ParDoSchemaTest > testSimpleSchemaPipeline FAILED
java.lang.IllegalArgumentException at ParDoSchemaTest.java:101
org.apache.beam.sdk.transforms.ParDoSchemaTest > testSchemaConversionPipeline FAILED
java.lang.IllegalArgumentException at ParDoSchemaTest.java:465
org.apache.beam.sdk.transforms.ParDoSchemaTest > testReadAndWriteWithSchemaRegistry FAILED
java.lang.IllegalArgumentException at ParDoSchemaTest.java:291
org.apache.beam.sdk.transforms.ParDoSchemaTest > testReadAndWriteMultiOutput FAILED
java.lang.IllegalArgumentException at ParDoSchemaTest.java:195
org.apache.beam.sdk.transforms.ParDoSchemaTest > testNestedSchema FAILED
java.lang.IllegalArgumentException at ParDoSchemaTest.java:498
org.apache.beam.sdk.transforms.ParDoSchemaTest > testMapStateSchemaInference FAILED
java.lang.IllegalArgumentException at ParDoSchemaTest.java:879
org.apache.beam.sdk.transforms.PerKeyOrderingTest > testMultipleStatefulOrderingWithoutShuffle FAILED
java.lang.IllegalArgumentException at PerKeyOrderingTest.java:297
297 tests completed, 16 failed, 1 skipped
> Task :runners:google-cloud-dataflow-java:validatesRunnerLegacyWorkerTest FAILED
FAILURE: Build failed with an exception.
* What went wrong:
Execution failed for task ':runners:google-cloud-dataflow-java:validatesRunnerLegacyWorkerTest'.
> There were failing tests. See the report at: file://<https://ci-beam.apache.org/job/beam_PostCommit_Java_ValidatesRunner_Dataflow_Java17/ws/src/runners/google-cloud-dataflow-java/build/reports/tests/validatesRunnerLegacyWorkerTest/index.html>
* Try:
> Run with --stacktrace option to get the stack trace.
> Run with --info or --debug option to get more log output.
* Get more help at https://help.gradle.org
Deprecated Gradle features were used in this build, making it incompatible with Gradle 8.0.
You can use '--warning-mode all' to show the individual deprecation warnings and determine if they come from your own scripts or plugins.
See https://docs.gradle.org/7.5.1/userguide/command_line_interface.html#sec:command_line_warnings
BUILD FAILED in 5h 10m 14s
11 actionable tasks: 3 executed, 2 from cache, 6 up-to-date
Publishing build scan...
https://gradle.com/s/h5ixk3heq3x6u
Build step 'Invoke Gradle script' changed build result to FAILURE
Build step 'Invoke Gradle script' marked build as failure
---------------------------------------------------------------------
To unsubscribe, e-mail: builds-unsubscribe@beam.apache.org
For additional commands, e-mail: builds-help@beam.apache.org
Build failed in Jenkins: beam_PostCommit_Java_ValidatesRunner_Dataflow_Java17 #1642
Posted by Apache Jenkins Server <je...@builds.apache.org>.
See <https://ci-beam.apache.org/job/beam_PostCommit_Java_ValidatesRunner_Dataflow_Java17/1642/display/redirect>
Changes:
------------------------------------------
[...truncated 21.89 KB...]
> Task :runners:google-cloud-dataflow-java:processResources
> Task :sdks:java:io:common:jar
> Task :runners:google-cloud-dataflow-java:processTestResources NO-SOURCE
> Task :sdks:java:io:common:processTestResources NO-SOURCE
> Task :sdks:java:core:generateTestAvroProtocol NO-SOURCE
> Task :sdks:java:extensions:protobuf:processTestResources
> Task :model:fn-execution:processResources
> Task :sdks:java:io:google-cloud-platform:processTestResources
> Task :sdks:java:core:generateTestAvroJava
> Task :sdks:java:core:generateTestGrammarSource NO-SOURCE
> Task :sdks:java:core:processTestResources
> Task :runners:google-cloud-dataflow-java:worker:windmill:extractIncludeProto
> Task :model:pipeline:extractIncludeProto
> Task :runners:google-cloud-dataflow-java:worker:windmill:extractProto
> Task :model:pipeline:extractProto
> Task :runners:google-cloud-dataflow-java:worker:windmill:generateProto FROM-CACHE
> Task :model:pipeline:generateProto FROM-CACHE
> Task :runners:google-cloud-dataflow-java:worker:windmill:compileJava FROM-CACHE
> Task :runners:google-cloud-dataflow-java:worker:windmill:processResources
> Task :runners:google-cloud-dataflow-java:worker:windmill:classes
> Task :runners:google-cloud-dataflow-java:worker:windmill:shadowJar FROM-CACHE
> Task :model:pipeline:compileJava FROM-CACHE
> Task :model:pipeline:processResources
> Task :model:pipeline:classes
> Task :model:pipeline:jar
> Task :model:pipeline:shadowJar FROM-CACHE
> Task :model:fn-execution:extractIncludeProto
> Task :model:job-management:extractIncludeProto
> Task :model:job-management:generateProto FROM-CACHE
> Task :model:fn-execution:generateProto FROM-CACHE
> Task :model:job-management:compileJava FROM-CACHE
> Task :model:job-management:classes
> Task :model:fn-execution:compileJava FROM-CACHE
> Task :model:fn-execution:classes
> Task :model:job-management:shadowJar FROM-CACHE
> Task :model:fn-execution:shadowJar FROM-CACHE
> Task :sdks:java:core:compileJava FROM-CACHE
> Task :sdks:java:core:classes
> Task :sdks:java:core:shadowJar FROM-CACHE
> Task :sdks:java:extensions:arrow:compileJava FROM-CACHE
> Task :sdks:java:extensions:arrow:classes UP-TO-DATE
> Task :runners:local-java:compileJava FROM-CACHE
> Task :runners:local-java:classes UP-TO-DATE
> Task :sdks:java:extensions:arrow:jar
> Task :runners:local-java:jar
> Task :sdks:java:io:common:compileTestJava FROM-CACHE
> Task :sdks:java:io:common:testClasses UP-TO-DATE
> Task :sdks:java:testing:test-utils:compileJava FROM-CACHE
> Task :sdks:java:testing:test-utils:classes UP-TO-DATE
> Task :sdks:java:testing:test-utils:jar
> Task :sdks:java:io:common:testJar
> Task :sdks:java:core:jar
> Task :sdks:java:testing:test-utils:compileTestJava FROM-CACHE
> Task :sdks:java:testing:test-utils:testClasses UP-TO-DATE
> Task :sdks:java:fn-execution:compileJava FROM-CACHE
> Task :sdks:java:fn-execution:classes UP-TO-DATE
> Task :sdks:java:testing:test-utils:testJar
> Task :sdks:java:fn-execution:jar
> Task :runners:core-construction-java:compileJava FROM-CACHE
> Task :runners:core-construction-java:classes UP-TO-DATE
> Task :sdks:java:extensions:protobuf:extractIncludeProto
> Task :sdks:java:extensions:protobuf:generateProto NO-SOURCE
> Task :sdks:java:extensions:protobuf:compileJava FROM-CACHE
> Task :sdks:java:extensions:protobuf:classes UP-TO-DATE
> Task :runners:core-construction-java:jar
> Task :sdks:java:extensions:protobuf:jar
> Task :sdks:java:extensions:python:compileJava FROM-CACHE
> Task :sdks:java:extensions:python:classes
> Task :sdks:java:extensions:python:jar
> Task :runners:core-java:compileJava FROM-CACHE
> Task :runners:core-java:classes UP-TO-DATE
> Task :runners:core-java:jar
> Task :sdks:java:extensions:google-cloud-platform-core:compileJava FROM-CACHE
> Task :sdks:java:extensions:google-cloud-platform-core:classes UP-TO-DATE
> Task :sdks:java:extensions:google-cloud-platform-core:jar
> Task :sdks:java:harness:compileJava FROM-CACHE
> Task :sdks:java:harness:classes UP-TO-DATE
> Task :sdks:java:harness:jar
> Task :runners:java-fn-execution:compileJava FROM-CACHE
> Task :runners:java-fn-execution:classes UP-TO-DATE
> Task :runners:java-fn-execution:jar
> Task :sdks:java:expansion-service:compileJava FROM-CACHE
> Task :sdks:java:expansion-service:classes UP-TO-DATE
> Task :sdks:java:expansion-service:jar
> Task :runners:direct-java:compileJava FROM-CACHE
> Task :runners:direct-java:classes UP-TO-DATE
> Task :sdks:java:io:kafka:compileJava FROM-CACHE
> Task :sdks:java:io:kafka:classes UP-TO-DATE
> Task :sdks:java:core:compileTestJava FROM-CACHE
> Task :sdks:java:core:testClasses
> Task :sdks:java:io:kafka:jar
> Task :sdks:java:core:shadowTestJar FROM-CACHE
> Task :runners:direct-java:shadowJar FROM-CACHE
> Task :sdks:java:io:google-cloud-platform:compileJava FROM-CACHE
> Task :sdks:java:io:google-cloud-platform:classes UP-TO-DATE
> Task :sdks:java:extensions:google-cloud-platform-core:compileTestJava FROM-CACHE
> Task :sdks:java:extensions:google-cloud-platform-core:testClasses UP-TO-DATE
> Task :sdks:java:extensions:google-cloud-platform-core:testJar
> Task :runners:core-java:compileTestJava FROM-CACHE
> Task :runners:core-java:testClasses UP-TO-DATE
> Task :runners:core-java:testJar
> Task :runners:direct-java:compileTestJava FROM-CACHE
> Task :runners:direct-java:testClasses UP-TO-DATE
> Task :sdks:java:io:google-cloud-platform:jar
> Task :runners:core-construction-java:compileTestJava FROM-CACHE
> Task :runners:core-construction-java:testClasses UP-TO-DATE
> Task :runners:core-construction-java:testJar
> Task :sdks:java:extensions:python:compileTestJava FROM-CACHE
> Task :sdks:java:extensions:python:testClasses UP-TO-DATE
> Task :sdks:java:extensions:python:testJar
> Task :runners:direct-java:shadowTestJar FROM-CACHE
> Task :runners:google-cloud-dataflow-java:compileJava FROM-CACHE
> Task :runners:google-cloud-dataflow-java:classes
> Task :runners:google-cloud-dataflow-java:jar
> Task :sdks:java:extensions:protobuf:extractIncludeTestProto
> Task :sdks:java:extensions:protobuf:generateTestProto FROM-CACHE
> Task :runners:google-cloud-dataflow-java:worker:compileJava FROM-CACHE
> Task :runners:google-cloud-dataflow-java:worker:classes
> Task :sdks:java:extensions:protobuf:compileTestJava FROM-CACHE
> Task :sdks:java:extensions:protobuf:testClasses
> Task :sdks:java:extensions:protobuf:testJar
> Task :runners:google-cloud-dataflow-java:worker:shadowJar FROM-CACHE
> Task :sdks:java:io:google-cloud-platform:compileTestJava FROM-CACHE
> Task :sdks:java:io:google-cloud-platform:testClasses
> Task :sdks:java:io:google-cloud-platform:testJar
> Task :runners:google-cloud-dataflow-java:compileTestJava FROM-CACHE
> Task :runners:google-cloud-dataflow-java:testClasses UP-TO-DATE
> Task :runners:google-cloud-dataflow-java:testJar
Deprecated Gradle features were used in this build, making it incompatible with Gradle 8.0.
You can use '--warning-mode all' to show the individual deprecation warnings and determine if they come from your own scripts or plugins.
See https://docs.gradle.org/7.5.1/userguide/command_line_interface.html#sec:command_line_warnings
BUILD SUCCESSFUL in 27s
132 actionable tasks: 78 executed, 52 from cache, 2 up-to-date
Publishing build scan...
https://gradle.com/s/mcq5o56p4huaa
Build step 'Invoke Gradle script' changed build result to SUCCESS
[Gradle] - Launching build.
[src] $ <https://ci-beam.apache.org/job/beam_PostCommit_Java_ValidatesRunner_Dataflow_Java17/ws/src/gradlew> -x shadowJar -x shadowTestJar -x compileJava -x compileTestJava -x jar -x testJar -x classes -x testClasses -Dorg.gradle.java.home=/usr/lib/jvm/java-17-openjdk-amd64 --continue --max-workers=12 -Dorg.gradle.jvmargs=-Xms2g -Dorg.gradle.jvmargs=-Xmx6g -Dorg.gradle.vfs.watch=false -Pdocker-pull-licenses :runners:google-cloud-dataflow-java:validatesRunner
To honour the JVM settings for this build a single-use Daemon process will be forked. See https://docs.gradle.org/7.5.1/userguide/gradle_daemon.html#sec:disabling_the_daemon.
Daemon will be stopped at the end of the build
Configuration on demand is an incubating feature.
> Task :buildSrc:compileJava NO-SOURCE
> Task :buildSrc:compileGroovy FROM-CACHE
> Task :buildSrc:pluginDescriptors UP-TO-DATE
> Task :buildSrc:processResources UP-TO-DATE
> Task :buildSrc:classes UP-TO-DATE
> Task :buildSrc:jar
> Task :buildSrc:assemble
> Task :buildSrc:spotlessGroovy UP-TO-DATE
> Task :buildSrc:spotlessGroovyCheck UP-TO-DATE
> Task :buildSrc:spotlessGroovyGradle UP-TO-DATE
> Task :buildSrc:spotlessGroovyGradleCheck UP-TO-DATE
> Task :buildSrc:spotlessCheck UP-TO-DATE
> Task :buildSrc:pluginUnderTestMetadata
> Task :buildSrc:compileTestJava NO-SOURCE
> Task :buildSrc:compileTestGroovy NO-SOURCE
> Task :buildSrc:processTestResources NO-SOURCE
> Task :buildSrc:testClasses UP-TO-DATE
> Task :buildSrc:test NO-SOURCE
> Task :buildSrc:validatePlugins FROM-CACHE
> Task :buildSrc:check UP-TO-DATE
> Task :buildSrc:build
> Task :runners:google-cloud-dataflow-java:validatesRunnerLegacyWorkerTest
org.apache.beam.sdk.schemas.AvroSchemaTest > testAvroPipelineGroupBy FAILED
java.lang.IllegalArgumentException at AvroSchemaTest.java:478
org.apache.beam.sdk.transforms.PerKeyOrderingTest > testMultipleStatefulOrderingWithShuffle FAILED
java.lang.IllegalArgumentException at PerKeyOrderingTest.java:254
org.apache.beam.sdk.transforms.ParDoSchemaTest > testReadAndWrite FAILED
java.lang.IllegalArgumentException at ParDoSchemaTest.java:135
org.apache.beam.sdk.transforms.ParDoSchemaTest > testSchemasPassedThrough FAILED
java.lang.IllegalArgumentException at ParDoSchemaTest.java:439
org.apache.beam.sdk.transforms.ParDoSchemaTest > testSchemaFieldSelectionNested FAILED
java.lang.IllegalArgumentException at ParDoSchemaTest.java:629
org.apache.beam.sdk.transforms.ParDoSchemaTest > testSchemaFieldSelectionUnboxing FAILED
java.lang.IllegalArgumentException at ParDoSchemaTest.java:538
org.apache.beam.sdk.transforms.ParDoSchemaTest > testSchemaFieldDescriptorSelectionUnboxing FAILED
java.lang.IllegalArgumentException at ParDoSchemaTest.java:578
org.apache.beam.sdk.transforms.ParDoSchemaTest > testInferredSchemaPipeline FAILED
java.lang.IllegalArgumentException at ParDoSchemaTest.java:417
org.apache.beam.sdk.transforms.ParDoSchemaTest > testFieldAccessSchemaPipeline FAILED
java.lang.IllegalArgumentException at ParDoSchemaTest.java:328
org.apache.beam.sdk.transforms.ParDoSchemaTest > testSimpleSchemaPipeline FAILED
java.lang.IllegalArgumentException at ParDoSchemaTest.java:101
org.apache.beam.sdk.transforms.ParDoSchemaTest > testSchemaConversionPipeline FAILED
java.lang.IllegalArgumentException at ParDoSchemaTest.java:465
org.apache.beam.sdk.transforms.ParDoSchemaTest > testReadAndWriteWithSchemaRegistry FAILED
java.lang.IllegalArgumentException at ParDoSchemaTest.java:291
org.apache.beam.sdk.transforms.ParDoSchemaTest > testReadAndWriteMultiOutput FAILED
java.lang.IllegalArgumentException at ParDoSchemaTest.java:195
org.apache.beam.sdk.transforms.ParDoSchemaTest > testNestedSchema FAILED
java.lang.IllegalArgumentException at ParDoSchemaTest.java:498
org.apache.beam.sdk.transforms.ParDoSchemaTest > testMapStateSchemaInference FAILED
java.lang.IllegalArgumentException at ParDoSchemaTest.java:879
org.apache.beam.sdk.transforms.PerKeyOrderingTest > testMultipleStatefulOrderingWithoutShuffle FAILED
java.lang.IllegalArgumentException at PerKeyOrderingTest.java:297
297 tests completed, 16 failed, 1 skipped
> Task :runners:google-cloud-dataflow-java:validatesRunnerLegacyWorkerTest FAILED
FAILURE: Build failed with an exception.
* What went wrong:
Execution failed for task ':runners:google-cloud-dataflow-java:validatesRunnerLegacyWorkerTest'.
> There were failing tests. See the report at: file://<https://ci-beam.apache.org/job/beam_PostCommit_Java_ValidatesRunner_Dataflow_Java17/ws/src/runners/google-cloud-dataflow-java/build/reports/tests/validatesRunnerLegacyWorkerTest/index.html>
* Try:
> Run with --stacktrace option to get the stack trace.
> Run with --info or --debug option to get more log output.
* Get more help at https://help.gradle.org
Deprecated Gradle features were used in this build, making it incompatible with Gradle 8.0.
You can use '--warning-mode all' to show the individual deprecation warnings and determine if they come from your own scripts or plugins.
See https://docs.gradle.org/7.5.1/userguide/command_line_interface.html#sec:command_line_warnings
BUILD FAILED in 5h 6m 3s
11 actionable tasks: 3 executed, 2 from cache, 6 up-to-date
Publishing build scan...
https://gradle.com/s/axh2xahjfifga
Build step 'Invoke Gradle script' changed build result to FAILURE
Build step 'Invoke Gradle script' marked build as failure
---------------------------------------------------------------------
To unsubscribe, e-mail: builds-unsubscribe@beam.apache.org
For additional commands, e-mail: builds-help@beam.apache.org
Build failed in Jenkins: beam_PostCommit_Java_ValidatesRunner_Dataflow_Java17 #1641
Posted by Apache Jenkins Server <je...@builds.apache.org>.
See <https://ci-beam.apache.org/job/beam_PostCommit_Java_ValidatesRunner_Dataflow_Java17/1641/display/redirect>
Changes:
------------------------------------------
[...truncated 21.88 KB...]
> Task :sdks:java:core:processResources
> Task :runners:google-cloud-dataflow-java:processTestResources NO-SOURCE
> Task :sdks:java:extensions:protobuf:processTestResources
> Task :sdks:java:io:common:jar
> Task :sdks:java:core:generateTestAvroProtocol NO-SOURCE
> Task :sdks:java:io:common:processTestResources NO-SOURCE
> Task :model:fn-execution:processResources
> Task :sdks:java:io:google-cloud-platform:processTestResources
> Task :sdks:java:core:generateTestAvroJava
> Task :sdks:java:core:generateTestGrammarSource NO-SOURCE
> Task :sdks:java:core:processTestResources
> Task :model:pipeline:extractIncludeProto
> Task :runners:google-cloud-dataflow-java:worker:windmill:extractIncludeProto
> Task :model:pipeline:extractProto
> Task :runners:google-cloud-dataflow-java:worker:windmill:extractProto
> Task :runners:google-cloud-dataflow-java:worker:windmill:generateProto FROM-CACHE
> Task :model:pipeline:generateProto FROM-CACHE
> Task :runners:google-cloud-dataflow-java:worker:windmill:compileJava FROM-CACHE
> Task :runners:google-cloud-dataflow-java:worker:windmill:processResources
> Task :runners:google-cloud-dataflow-java:worker:windmill:classes
> Task :runners:google-cloud-dataflow-java:worker:windmill:shadowJar FROM-CACHE
> Task :model:pipeline:compileJava FROM-CACHE
> Task :model:pipeline:processResources
> Task :model:pipeline:classes
> Task :model:pipeline:jar
> Task :model:pipeline:shadowJar FROM-CACHE
> Task :model:fn-execution:extractIncludeProto
> Task :model:job-management:extractIncludeProto
> Task :model:fn-execution:generateProto FROM-CACHE
> Task :model:job-management:generateProto FROM-CACHE
> Task :model:job-management:compileJava FROM-CACHE
> Task :model:job-management:classes
> Task :model:fn-execution:compileJava FROM-CACHE
> Task :model:fn-execution:classes
> Task :model:job-management:shadowJar FROM-CACHE
> Task :model:fn-execution:shadowJar FROM-CACHE
> Task :sdks:java:core:compileJava FROM-CACHE
> Task :sdks:java:core:classes
> Task :sdks:java:core:shadowJar FROM-CACHE
> Task :runners:local-java:compileJava FROM-CACHE
> Task :runners:local-java:classes UP-TO-DATE
> Task :sdks:java:core:jar
> Task :runners:local-java:jar
> Task :sdks:java:io:common:compileTestJava FROM-CACHE
> Task :sdks:java:testing:test-utils:compileJava FROM-CACHE
> Task :sdks:java:testing:test-utils:classes UP-TO-DATE
> Task :sdks:java:io:common:testClasses UP-TO-DATE
> Task :sdks:java:extensions:arrow:compileJava FROM-CACHE
> Task :sdks:java:extensions:arrow:classes UP-TO-DATE
> Task :sdks:java:testing:test-utils:jar
> Task :sdks:java:extensions:arrow:jar
> Task :sdks:java:testing:test-utils:compileTestJava FROM-CACHE
> Task :sdks:java:testing:test-utils:testClasses UP-TO-DATE
> Task :sdks:java:testing:test-utils:testJar
> Task :sdks:java:io:common:testJar
> Task :sdks:java:fn-execution:compileJava FROM-CACHE
> Task :sdks:java:fn-execution:classes UP-TO-DATE
> Task :sdks:java:fn-execution:jar
> Task :sdks:java:extensions:protobuf:extractIncludeProto
> Task :sdks:java:extensions:protobuf:generateProto NO-SOURCE
> Task :runners:core-construction-java:compileJava FROM-CACHE
> Task :runners:core-construction-java:classes UP-TO-DATE
> Task :sdks:java:extensions:protobuf:compileJava FROM-CACHE
> Task :sdks:java:extensions:protobuf:classes UP-TO-DATE
> Task :sdks:java:extensions:protobuf:jar
> Task :runners:core-construction-java:jar
> Task :sdks:java:extensions:python:compileJava FROM-CACHE
> Task :sdks:java:extensions:python:classes
> Task :sdks:java:extensions:python:jar
> Task :runners:core-java:compileJava FROM-CACHE
> Task :runners:core-java:classes UP-TO-DATE
> Task :runners:core-java:jar
> Task :sdks:java:extensions:google-cloud-platform-core:compileJava FROM-CACHE
> Task :sdks:java:extensions:google-cloud-platform-core:classes UP-TO-DATE
> Task :sdks:java:harness:compileJava FROM-CACHE
> Task :sdks:java:harness:classes UP-TO-DATE
> Task :sdks:java:extensions:google-cloud-platform-core:jar
> Task :sdks:java:harness:jar
> Task :runners:java-fn-execution:compileJava FROM-CACHE
> Task :runners:java-fn-execution:classes UP-TO-DATE
> Task :runners:java-fn-execution:jar
> Task :sdks:java:expansion-service:compileJava FROM-CACHE
> Task :sdks:java:expansion-service:classes UP-TO-DATE
> Task :sdks:java:expansion-service:jar
> Task :sdks:java:core:compileTestJava FROM-CACHE
> Task :sdks:java:core:testClasses
> Task :runners:direct-java:compileJava FROM-CACHE
> Task :runners:direct-java:classes UP-TO-DATE
> Task :sdks:java:io:kafka:compileJava FROM-CACHE
> Task :sdks:java:io:kafka:classes UP-TO-DATE
> Task :sdks:java:core:shadowTestJar FROM-CACHE
> Task :sdks:java:io:kafka:jar
> Task :runners:direct-java:shadowJar FROM-CACHE
> Task :sdks:java:extensions:google-cloud-platform-core:compileTestJava FROM-CACHE
> Task :sdks:java:extensions:google-cloud-platform-core:testClasses UP-TO-DATE
> Task :sdks:java:extensions:google-cloud-platform-core:testJar
> Task :runners:core-java:compileTestJava FROM-CACHE
> Task :runners:core-java:testClasses UP-TO-DATE
> Task :runners:core-construction-java:compileTestJava FROM-CACHE
> Task :runners:core-construction-java:testClasses UP-TO-DATE
> Task :sdks:java:io:google-cloud-platform:compileJava FROM-CACHE
> Task :sdks:java:io:google-cloud-platform:classes UP-TO-DATE
> Task :runners:core-java:testJar
> Task :runners:core-construction-java:testJar
> Task :sdks:java:extensions:python:compileTestJava FROM-CACHE
> Task :sdks:java:extensions:python:testClasses UP-TO-DATE
> Task :sdks:java:extensions:python:testJar
> Task :runners:direct-java:compileTestJava FROM-CACHE
> Task :runners:direct-java:testClasses UP-TO-DATE
> Task :sdks:java:io:google-cloud-platform:jar
> Task :runners:direct-java:shadowTestJar FROM-CACHE
> Task :runners:google-cloud-dataflow-java:compileJava FROM-CACHE
> Task :runners:google-cloud-dataflow-java:classes
> Task :runners:google-cloud-dataflow-java:jar
> Task :sdks:java:extensions:protobuf:extractIncludeTestProto
> Task :sdks:java:extensions:protobuf:generateTestProto FROM-CACHE
> Task :runners:google-cloud-dataflow-java:worker:compileJava FROM-CACHE
> Task :runners:google-cloud-dataflow-java:worker:classes
> Task :sdks:java:extensions:protobuf:compileTestJava FROM-CACHE
> Task :sdks:java:extensions:protobuf:testClasses
> Task :sdks:java:extensions:protobuf:testJar
> Task :runners:google-cloud-dataflow-java:worker:shadowJar FROM-CACHE
> Task :sdks:java:io:google-cloud-platform:compileTestJava FROM-CACHE
> Task :sdks:java:io:google-cloud-platform:testClasses
> Task :sdks:java:io:google-cloud-platform:testJar
> Task :runners:google-cloud-dataflow-java:compileTestJava FROM-CACHE
> Task :runners:google-cloud-dataflow-java:testClasses UP-TO-DATE
> Task :runners:google-cloud-dataflow-java:testJar
Deprecated Gradle features were used in this build, making it incompatible with Gradle 8.0.
You can use '--warning-mode all' to show the individual deprecation warnings and determine if they come from your own scripts or plugins.
See https://docs.gradle.org/7.5.1/userguide/command_line_interface.html#sec:command_line_warnings
BUILD SUCCESSFUL in 29s
132 actionable tasks: 78 executed, 52 from cache, 2 up-to-date
Publishing build scan...
https://gradle.com/s/koiqpe3bsdacc
Build step 'Invoke Gradle script' changed build result to SUCCESS
[Gradle] - Launching build.
[src] $ <https://ci-beam.apache.org/job/beam_PostCommit_Java_ValidatesRunner_Dataflow_Java17/ws/src/gradlew> -x shadowJar -x shadowTestJar -x compileJava -x compileTestJava -x jar -x testJar -x classes -x testClasses -Dorg.gradle.java.home=/usr/lib/jvm/java-17-openjdk-amd64 --continue --max-workers=12 -Dorg.gradle.jvmargs=-Xms2g -Dorg.gradle.jvmargs=-Xmx6g -Dorg.gradle.vfs.watch=false -Pdocker-pull-licenses :runners:google-cloud-dataflow-java:validatesRunner
To honour the JVM settings for this build a single-use Daemon process will be forked. See https://docs.gradle.org/7.5.1/userguide/gradle_daemon.html#sec:disabling_the_daemon.
Daemon will be stopped at the end of the build
Configuration on demand is an incubating feature.
> Task :buildSrc:compileJava NO-SOURCE
> Task :buildSrc:compileGroovy FROM-CACHE
> Task :buildSrc:pluginDescriptors UP-TO-DATE
> Task :buildSrc:processResources UP-TO-DATE
> Task :buildSrc:classes UP-TO-DATE
> Task :buildSrc:jar
> Task :buildSrc:assemble
> Task :buildSrc:spotlessGroovy UP-TO-DATE
> Task :buildSrc:spotlessGroovyCheck UP-TO-DATE
> Task :buildSrc:spotlessGroovyGradle UP-TO-DATE
> Task :buildSrc:spotlessGroovyGradleCheck UP-TO-DATE
> Task :buildSrc:spotlessCheck UP-TO-DATE
> Task :buildSrc:pluginUnderTestMetadata
> Task :buildSrc:compileTestJava NO-SOURCE
> Task :buildSrc:compileTestGroovy NO-SOURCE
> Task :buildSrc:processTestResources NO-SOURCE
> Task :buildSrc:testClasses UP-TO-DATE
> Task :buildSrc:test NO-SOURCE
> Task :buildSrc:validatePlugins FROM-CACHE
> Task :buildSrc:check UP-TO-DATE
> Task :buildSrc:build
> Task :runners:google-cloud-dataflow-java:validatesRunnerLegacyWorkerTest
org.apache.beam.sdk.schemas.AvroSchemaTest > testAvroPipelineGroupBy FAILED
java.lang.IllegalArgumentException at AvroSchemaTest.java:478
org.apache.beam.sdk.transforms.PerKeyOrderingTest > testMultipleStatefulOrderingWithShuffle FAILED
java.lang.IllegalArgumentException at PerKeyOrderingTest.java:254
org.apache.beam.sdk.transforms.ParDoSchemaTest > testReadAndWrite FAILED
java.lang.IllegalArgumentException at ParDoSchemaTest.java:135
org.apache.beam.sdk.transforms.ParDoSchemaTest > testSchemasPassedThrough FAILED
java.lang.IllegalArgumentException at ParDoSchemaTest.java:439
org.apache.beam.sdk.transforms.ParDoSchemaTest > testSchemaFieldSelectionNested FAILED
java.lang.IllegalArgumentException at ParDoSchemaTest.java:629
org.apache.beam.sdk.transforms.ParDoSchemaTest > testSchemaFieldSelectionUnboxing FAILED
java.lang.IllegalArgumentException at ParDoSchemaTest.java:538
org.apache.beam.sdk.transforms.ParDoSchemaTest > testSchemaFieldDescriptorSelectionUnboxing FAILED
java.lang.IllegalArgumentException at ParDoSchemaTest.java:578
org.apache.beam.sdk.transforms.ParDoSchemaTest > testInferredSchemaPipeline FAILED
java.lang.IllegalArgumentException at ParDoSchemaTest.java:417
org.apache.beam.sdk.transforms.ParDoSchemaTest > testFieldAccessSchemaPipeline FAILED
java.lang.IllegalArgumentException at ParDoSchemaTest.java:328
org.apache.beam.sdk.transforms.ParDoSchemaTest > testSimpleSchemaPipeline FAILED
java.lang.IllegalArgumentException at ParDoSchemaTest.java:101
org.apache.beam.sdk.transforms.ParDoSchemaTest > testSchemaConversionPipeline FAILED
java.lang.IllegalArgumentException at ParDoSchemaTest.java:465
org.apache.beam.sdk.transforms.ParDoSchemaTest > testReadAndWriteWithSchemaRegistry FAILED
java.lang.IllegalArgumentException at ParDoSchemaTest.java:291
org.apache.beam.sdk.transforms.ParDoSchemaTest > testReadAndWriteMultiOutput FAILED
java.lang.IllegalArgumentException at ParDoSchemaTest.java:195
org.apache.beam.sdk.transforms.ParDoSchemaTest > testNestedSchema FAILED
java.lang.IllegalArgumentException at ParDoSchemaTest.java:498
org.apache.beam.sdk.transforms.ParDoSchemaTest > testMapStateSchemaInference FAILED
java.lang.IllegalArgumentException at ParDoSchemaTest.java:879
org.apache.beam.sdk.transforms.PerKeyOrderingTest > testMultipleStatefulOrderingWithoutShuffle FAILED
java.lang.IllegalArgumentException at PerKeyOrderingTest.java:297
297 tests completed, 16 failed, 1 skipped
> Task :runners:google-cloud-dataflow-java:validatesRunnerLegacyWorkerTest FAILED
FAILURE: Build failed with an exception.
* What went wrong:
Execution failed for task ':runners:google-cloud-dataflow-java:validatesRunnerLegacyWorkerTest'.
> There were failing tests. See the report at: file://<https://ci-beam.apache.org/job/beam_PostCommit_Java_ValidatesRunner_Dataflow_Java17/ws/src/runners/google-cloud-dataflow-java/build/reports/tests/validatesRunnerLegacyWorkerTest/index.html>
* Try:
> Run with --stacktrace option to get the stack trace.
> Run with --info or --debug option to get more log output.
* Get more help at https://help.gradle.org
Deprecated Gradle features were used in this build, making it incompatible with Gradle 8.0.
You can use '--warning-mode all' to show the individual deprecation warnings and determine if they come from your own scripts or plugins.
See https://docs.gradle.org/7.5.1/userguide/command_line_interface.html#sec:command_line_warnings
BUILD FAILED in 5h 8m 36s
11 actionable tasks: 3 executed, 2 from cache, 6 up-to-date
Publishing build scan...
https://gradle.com/s/ecbof3wyb7xfk
Build step 'Invoke Gradle script' changed build result to FAILURE
Build step 'Invoke Gradle script' marked build as failure
---------------------------------------------------------------------
To unsubscribe, e-mail: builds-unsubscribe@beam.apache.org
For additional commands, e-mail: builds-help@beam.apache.org