You are viewing a plain text version of this content. The canonical link for it is here.
Posted to builds@beam.apache.org by Apache Jenkins Server <je...@builds.apache.org> on 2021/08/01 12:18:02 UTC

Build failed in Jenkins: beam_PostCommit_Java_VR_Dataflow_V2_Streaming #1051

See <https://ci-beam.apache.org/job/beam_PostCommit_Java_VR_Dataflow_V2_Streaming/1051/display/redirect>

Changes:


------------------------------------------
[...truncated 106.40 KB...]
ERROR:root:Invalid url for org.jacoco.core-0.8.6: https://www.eclipse.org/legal/epl-2.0/. Retrying...
Traceback (most recent call last):
  File "<https://ci-beam.apache.org/job/beam_PostCommit_Java_VR_Dataflow_V2_Streaming/ws/src/sdks/java/container/license_scripts/pull_licenses_java.py",> line 53, in pull_from_url
    url_read = urlopen(url)
  File "/usr/lib/python3.5/urllib/request.py", line 163, in urlopen
    return opener.open(url, data, timeout)
  File "/usr/lib/python3.5/urllib/request.py", line 472, in open
    response = meth(req, response)
  File "/usr/lib/python3.5/urllib/request.py", line 582, in http_response
    'http', request, response, code, msg, hdrs)
  File "/usr/lib/python3.5/urllib/request.py", line 510, in error
    return self._call_chain(*args)
  File "/usr/lib/python3.5/urllib/request.py", line 444, in _call_chain
    result = func(*args)
  File "/usr/lib/python3.5/urllib/request.py", line 590, in http_error_default
    raise HTTPError(req.full_url, code, msg, hdrs, fp)
urllib.error.HTTPError: HTTP Error 404: Not Found
ERROR:root:Invalid url for org.jacoco.core-0.8.6: https://www.eclipse.org/legal/epl-2.0/. Retrying...
Traceback (most recent call last):
  File "<https://ci-beam.apache.org/job/beam_PostCommit_Java_VR_Dataflow_V2_Streaming/ws/src/sdks/java/container/license_scripts/pull_licenses_java.py",> line 53, in pull_from_url
    url_read = urlopen(url)
  File "/usr/lib/python3.5/urllib/request.py", line 163, in urlopen
    return opener.open(url, data, timeout)
  File "/usr/lib/python3.5/urllib/request.py", line 472, in open
    response = meth(req, response)
  File "/usr/lib/python3.5/urllib/request.py", line 582, in http_response
    'http', request, response, code, msg, hdrs)
  File "/usr/lib/python3.5/urllib/request.py", line 510, in error
    return self._call_chain(*args)
  File "/usr/lib/python3.5/urllib/request.py", line 444, in _call_chain
    result = func(*args)
  File "/usr/lib/python3.5/urllib/request.py", line 590, in http_error_default
    raise HTTPError(req.full_url, code, msg, hdrs, fp)
urllib.error.HTTPError: HTTP Error 404: Not Found
ERROR:root:Invalid url for org.jacoco.core-0.8.6: https://www.eclipse.org/legal/epl-2.0/. Retrying...
Traceback (most recent call last):
  File "<https://ci-beam.apache.org/job/beam_PostCommit_Java_VR_Dataflow_V2_Streaming/ws/src/sdks/java/container/license_scripts/pull_licenses_java.py",> line 53, in pull_from_url
    url_read = urlopen(url)
  File "/usr/lib/python3.5/urllib/request.py", line 163, in urlopen
    return opener.open(url, data, timeout)
  File "/usr/lib/python3.5/urllib/request.py", line 472, in open
    response = meth(req, response)
  File "/usr/lib/python3.5/urllib/request.py", line 582, in http_response
    'http', request, response, code, msg, hdrs)
  File "/usr/lib/python3.5/urllib/request.py", line 510, in error
    return self._call_chain(*args)
  File "/usr/lib/python3.5/urllib/request.py", line 444, in _call_chain
    result = func(*args)
  File "/usr/lib/python3.5/urllib/request.py", line 590, in http_error_default
    raise HTTPError(req.full_url, code, msg, hdrs, fp)
urllib.error.HTTPError: HTTP Error 404: Not Found
ERROR:root:Invalid url for org.jacoco.core-0.8.6: https://www.eclipse.org/legal/epl-2.0/. Retrying...
Traceback (most recent call last):
  File "<https://ci-beam.apache.org/job/beam_PostCommit_Java_VR_Dataflow_V2_Streaming/ws/src/sdks/java/container/license_scripts/pull_licenses_java.py",> line 53, in pull_from_url
    url_read = urlopen(url)
  File "/usr/lib/python3.5/urllib/request.py", line 163, in urlopen
    return opener.open(url, data, timeout)
  File "/usr/lib/python3.5/urllib/request.py", line 472, in open
    response = meth(req, response)
  File "/usr/lib/python3.5/urllib/request.py", line 582, in http_response
    'http', request, response, code, msg, hdrs)
  File "/usr/lib/python3.5/urllib/request.py", line 510, in error
    return self._call_chain(*args)
  File "/usr/lib/python3.5/urllib/request.py", line 444, in _call_chain
    result = func(*args)
  File "/usr/lib/python3.5/urllib/request.py", line 590, in http_error_default
    raise HTTPError(req.full_url, code, msg, hdrs, fp)
urllib.error.HTTPError: HTTP Error 404: Not Found
ERROR:root:Invalid url for org.jacoco.core-0.8.6: https://www.eclipse.org/legal/epl-2.0/ after 9 retries.
Traceback (most recent call last):
  File "<https://ci-beam.apache.org/job/beam_PostCommit_Java_VR_Dataflow_V2_Streaming/ws/src/sdks/java/container/license_scripts/pull_licenses_java.py",> line 53, in pull_from_url
    url_read = urlopen(url)
  File "/usr/lib/python3.5/urllib/request.py", line 163, in urlopen
    return opener.open(url, data, timeout)
  File "/usr/lib/python3.5/urllib/request.py", line 472, in open
    response = meth(req, response)
  File "/usr/lib/python3.5/urllib/request.py", line 582, in http_response
    'http', request, response, code, msg, hdrs)
  File "/usr/lib/python3.5/urllib/request.py", line 510, in error
    return self._call_chain(*args)
  File "/usr/lib/python3.5/urllib/request.py", line 444, in _call_chain
    result = func(*args)
  File "/usr/lib/python3.5/urllib/request.py", line 590, in http_error_default
    raise HTTPError(req.full_url, code, msg, hdrs, fp)
urllib.error.HTTPError: HTTP Error 404: Not Found
ERROR:root:Invalid url for junit-4.13.1: http://www.eclipse.org/legal/epl-v10.html. Retrying...

> Task :sdks:go:resolveBuildDependencies
Resolving google.golang.org/api: commit='0324d5e90dc7753607860272666845fad9ceb97e', urls=[https://code.googlesource.com/google-api-go-client]
Resolving google.golang.org/genproto: commit='4d944d34d83c502a5f761500a14d8842648415c3', urls=[https://github.com/google/go-genproto]
Resolving google.golang.org/grpc: commit='5e8f83304c0563d1ba74db05fee83d9c18ab9a58', urls=[https://github.com/grpc/grpc-go]

> Task :sdks:java:container:pullLicenses
Traceback (most recent call last):
  File "<https://ci-beam.apache.org/job/beam_PostCommit_Java_VR_Dataflow_V2_Streaming/ws/src/sdks/java/container/license_scripts/pull_licenses_java.py",> line 53, in pull_from_url
    url_read = urlopen(url)
  File "/usr/lib/python3.5/urllib/request.py", line 163, in urlopen
    return opener.open(url, data, timeout)
  File "/usr/lib/python3.5/urllib/request.py", line 472, in open
    response = meth(req, response)
  File "/usr/lib/python3.5/urllib/request.py", line 582, in http_response
    'http', request, response, code, msg, hdrs)
  File "/usr/lib/python3.5/urllib/request.py", line 510, in error
    return self._call_chain(*args)
  File "/usr/lib/python3.5/urllib/request.py", line 444, in _call_chain
    result = func(*args)
  File "/usr/lib/python3.5/urllib/request.py", line 590, in http_error_default
    raise HTTPError(req.full_url, code, msg, hdrs, fp)
urllib.error.HTTPError: HTTP Error 404: Not Found
ERROR:root:Invalid url for junit-4.13.1: http://www.eclipse.org/legal/epl-v10.html. Retrying...

> Task :sdks:go:resolveBuildDependencies
Resolving google.golang.org/protobuf: commit='d165be301fb1e13390ad453281ded24385fd8ebc', urls=[https://go.googlesource.com/protobuf]
Resolving cached github.com/etcd-io/etcd: commit='11214aa33bf5a47d3d9d8dafe0f6b97237dfe921', urls=[https://github.com/etcd-io/etcd.git, git@github.com:etcd-io/etcd.git]
Resolving cached github.com/etcd-io/etcd: commit='11214aa33bf5a47d3d9d8dafe0f6b97237dfe921', urls=[https://github.com/etcd-io/etcd.git, git@github.com:etcd-io/etcd.git]

> Task :sdks:java:container:pullLicenses
Traceback (most recent call last):
  File "<https://ci-beam.apache.org/job/beam_PostCommit_Java_VR_Dataflow_V2_Streaming/ws/src/sdks/java/container/license_scripts/pull_licenses_java.py",> line 53, in pull_from_url
    url_read = urlopen(url)
  File "/usr/lib/python3.5/urllib/request.py", line 163, in urlopen
    return opener.open(url, data, timeout)
  File "/usr/lib/python3.5/urllib/request.py", line 472, in open
    response = meth(req, response)
  File "/usr/lib/python3.5/urllib/request.py", line 582, in http_response
    'http', request, response, code, msg, hdrs)
  File "/usr/lib/python3.5/urllib/request.py", line 510, in error
    return self._call_chain(*args)
  File "/usr/lib/python3.5/urllib/request.py", line 444, in _call_chain
    result = func(*args)
  File "/usr/lib/python3.5/urllib/request.py", line 590, in http_error_default
    raise HTTPError(req.full_url, code, msg, hdrs, fp)
urllib.error.HTTPError: HTTP Error 404: Not Found
ERROR:root:Invalid url for junit-4.13.1: http://www.eclipse.org/legal/epl-v10.html. Retrying...

> Task :sdks:go:installDependencies
> Task :sdks:go:buildLinuxAmd64
> Task :sdks:go:goBuild

> Task :sdks:java:container:pullLicenses
Traceback (most recent call last):
  File "<https://ci-beam.apache.org/job/beam_PostCommit_Java_VR_Dataflow_V2_Streaming/ws/src/sdks/java/container/license_scripts/pull_licenses_java.py",> line 53, in pull_from_url
    url_read = urlopen(url)
  File "/usr/lib/python3.5/urllib/request.py", line 163, in urlopen
    return opener.open(url, data, timeout)
  File "/usr/lib/python3.5/urllib/request.py", line 472, in open
    response = meth(req, response)
  File "/usr/lib/python3.5/urllib/request.py", line 582, in http_response
    'http', request, response, code, msg, hdrs)
  File "/usr/lib/python3.5/urllib/request.py", line 510, in error
    return self._call_chain(*args)
  File "/usr/lib/python3.5/urllib/request.py", line 444, in _call_chain
    result = func(*args)
  File "/usr/lib/python3.5/urllib/request.py", line 590, in http_error_default
    raise HTTPError(req.full_url, code, msg, hdrs, fp)
urllib.error.HTTPError: HTTP Error 404: Not Found
ERROR:root:Invalid url for junit-4.13.1: http://www.eclipse.org/legal/epl-v10.html. Retrying...
Traceback (most recent call last):
  File "<https://ci-beam.apache.org/job/beam_PostCommit_Java_VR_Dataflow_V2_Streaming/ws/src/sdks/java/container/license_scripts/pull_licenses_java.py",> line 53, in pull_from_url
    url_read = urlopen(url)
  File "/usr/lib/python3.5/urllib/request.py", line 163, in urlopen
    return opener.open(url, data, timeout)
  File "/usr/lib/python3.5/urllib/request.py", line 472, in open
    response = meth(req, response)
  File "/usr/lib/python3.5/urllib/request.py", line 582, in http_response
    'http', request, response, code, msg, hdrs)
  File "/usr/lib/python3.5/urllib/request.py", line 510, in error
    return self._call_chain(*args)
  File "/usr/lib/python3.5/urllib/request.py", line 444, in _call_chain
    result = func(*args)
  File "/usr/lib/python3.5/urllib/request.py", line 590, in http_error_default
    raise HTTPError(req.full_url, code, msg, hdrs, fp)
urllib.error.HTTPError: HTTP Error 404: Not Found
ERROR:root:Invalid url for junit-4.13.1: http://www.eclipse.org/legal/epl-v10.html. Retrying...
Traceback (most recent call last):
  File "<https://ci-beam.apache.org/job/beam_PostCommit_Java_VR_Dataflow_V2_Streaming/ws/src/sdks/java/container/license_scripts/pull_licenses_java.py",> line 53, in pull_from_url
    url_read = urlopen(url)
  File "/usr/lib/python3.5/urllib/request.py", line 163, in urlopen
    return opener.open(url, data, timeout)
  File "/usr/lib/python3.5/urllib/request.py", line 472, in open
    response = meth(req, response)
  File "/usr/lib/python3.5/urllib/request.py", line 582, in http_response
    'http', request, response, code, msg, hdrs)
  File "/usr/lib/python3.5/urllib/request.py", line 510, in error
    return self._call_chain(*args)
  File "/usr/lib/python3.5/urllib/request.py", line 444, in _call_chain
    result = func(*args)
  File "/usr/lib/python3.5/urllib/request.py", line 590, in http_error_default
    raise HTTPError(req.full_url, code, msg, hdrs, fp)
urllib.error.HTTPError: HTTP Error 404: Not Found
ERROR:root:Invalid url for junit-4.13.1: http://www.eclipse.org/legal/epl-v10.html. Retrying...
Traceback (most recent call last):
  File "<https://ci-beam.apache.org/job/beam_PostCommit_Java_VR_Dataflow_V2_Streaming/ws/src/sdks/java/container/license_scripts/pull_licenses_java.py",> line 53, in pull_from_url
    url_read = urlopen(url)
  File "/usr/lib/python3.5/urllib/request.py", line 163, in urlopen
    return opener.open(url, data, timeout)
  File "/usr/lib/python3.5/urllib/request.py", line 472, in open
    response = meth(req, response)
  File "/usr/lib/python3.5/urllib/request.py", line 582, in http_response
    'http', request, response, code, msg, hdrs)
  File "/usr/lib/python3.5/urllib/request.py", line 510, in error
    return self._call_chain(*args)
  File "/usr/lib/python3.5/urllib/request.py", line 444, in _call_chain
    result = func(*args)
  File "/usr/lib/python3.5/urllib/request.py", line 590, in http_error_default
    raise HTTPError(req.full_url, code, msg, hdrs, fp)
urllib.error.HTTPError: HTTP Error 404: Not Found
ERROR:root:Invalid url for junit-4.13.1: http://www.eclipse.org/legal/epl-v10.html after 9 retries.
ERROR:root:['org.jacoco.agent-0.8.6', 'org.jacoco.report-0.8.6', 'org.jacoco.ant-0.8.6', 'org.jacoco.core-0.8.6', 'junit-4.13.1']
ERROR:root:**************************************** Licenses were not able to be pulled automatically for some dependencies. Please search source code of the dependencies on the internet and add "license" and "notice" (if available) field to <https://ci-beam.apache.org/job/beam_PostCommit_Java_VR_Dataflow_V2_Streaming/ws/src/sdks/java/container/license_scripts/dep_urls_java.yaml> for each missing license. Dependency List: [junit-4.13.1,org.jacoco.agent-0.8.6,org.jacoco.ant-0.8.6,org.jacoco.core-0.8.6,org.jacoco.report-0.8.6]
INFO:root:pull_licenses_java.py failed. It took 983.663117 seconds with 16 threads.
Traceback (most recent call last):
  File "<https://ci-beam.apache.org/job/beam_PostCommit_Java_VR_Dataflow_V2_Streaming/ws/src/sdks/java/container/license_scripts/pull_licenses_java.py",> line 315, in <module>
    error_msg)
RuntimeError: ('1 error(s) occurred.', ['**************************************** Licenses were not able to be pulled automatically for some dependencies. Please search source code of the dependencies on the internet and add "license" and "notice" (if available) field to <https://ci-beam.apache.org/job/beam_PostCommit_Java_VR_Dataflow_V2_Streaming/ws/src/sdks/java/container/license_scripts/dep_urls_java.yaml> for each missing license. Dependency List: [junit-4.13.1,org.jacoco.agent-0.8.6,org.jacoco.ant-0.8.6,org.jacoco.core-0.8.6,org.jacoco.report-0.8.6]'])

> Task :sdks:java:container:pullLicenses FAILED

> Task :sdks:java:container:resolveBuildDependencies
Resolving ./github.com/apache/beam/sdks/go@<https://ci-beam.apache.org/job/beam_PostCommit_Java_VR_Dataflow_V2_Streaming/ws/src/sdks/go>

> Task :sdks:java:container:installDependencies
> Task :sdks:java:container:buildLinuxAmd64
> Task :sdks:java:container:goBuild
> Task :sdks:java:container:java8:copySdkHarnessLauncher

FAILURE: Build failed with an exception.

* What went wrong:
Execution failed for task ':sdks:java:container:pullLicenses'.
> Process 'command './license_scripts/license_script.sh'' finished with non-zero exit value 1

* Try:
Run with --stacktrace option to get the stack trace. Run with --info or --debug option to get more log output. Run with --scan to get full insights.

* Get more help at https://help.gradle.org

Deprecated Gradle features were used in this build, making it incompatible with Gradle 7.0.
Use '--warning-mode all' to show the individual deprecation warnings.
See https://docs.gradle.org/6.8.3/userguide/command_line_interface.html#sec:command_line_warnings

BUILD FAILED in 17m 33s
125 actionable tasks: 84 executed, 39 from cache, 2 up-to-date

Publishing build scan...
https://gradle.com/s/srzzvag374rse

Build step 'Invoke Gradle script' changed build result to FAILURE
Build step 'Invoke Gradle script' marked build as failure

---------------------------------------------------------------------
To unsubscribe, e-mail: builds-unsubscribe@beam.apache.org
For additional commands, e-mail: builds-help@beam.apache.org


Jenkins build is back to normal : beam_PostCommit_Java_VR_Dataflow_V2_Streaming #1102

Posted by Apache Jenkins Server <je...@builds.apache.org>.
See <https://ci-beam.apache.org/job/beam_PostCommit_Java_VR_Dataflow_V2_Streaming/1102/display/redirect?page=changes>


---------------------------------------------------------------------
To unsubscribe, e-mail: builds-unsubscribe@beam.apache.org
For additional commands, e-mail: builds-help@beam.apache.org


Build failed in Jenkins: beam_PostCommit_Java_VR_Dataflow_V2_Streaming #1101

Posted by Apache Jenkins Server <je...@builds.apache.org>.
See <https://ci-beam.apache.org/job/beam_PostCommit_Java_VR_Dataflow_V2_Streaming/1101/display/redirect?page=changes>

Changes:

[Luke Cwik] [BEAM-12619] Swap LinkedBlockingQueue to ArrayBlockingQueue for minor

[Luke Cwik] fixup! Fix spotbugs warning

[Jeremy Quinn] Add AWS services as a runtime dependency to support S3

[Andrew Pilloud] [BEAM-12759] ORDER BY then SELECT

[noreply] [BEAM-7745] Avoid uncached state fetches for streaming side-inputs


------------------------------------------
[...truncated 40.06 KB...]
> Task :runners:core-construction-java:testClasses UP-TO-DATE
> Task :runners:core-construction-java:testJar
> Task :sdks:java:testing:test-utils:classes UP-TO-DATE
> Task :sdks:java:testing:test-utils:jar
> Task :sdks:java:testing:test-utils:compileTestJava FROM-CACHE
> Task :sdks:java:testing:test-utils:testClasses UP-TO-DATE
> Task :sdks:java:testing:test-utils:testJar
> Task :sdks:java:extensions:protobuf:extractIncludeTestProto
> Task :sdks:java:extensions:protobuf:generateTestProto FROM-CACHE
> Task :sdks:java:extensions:protobuf:compileTestJava FROM-CACHE
> Task :sdks:java:extensions:protobuf:testClasses
> Task :sdks:java:extensions:protobuf:testJar
> Task :sdks:java:harness:shadowJar FROM-CACHE

> Task :sdks:go:resolveBuildDependencies
Resolving cloud.google.com/go: commit='03869a08dc16b35ad4968e92d34c5a2a2961b205', urls=[https://code.googlesource.com/gocloud]
Resolving github.com/Shopify/sarama: commit='541689b9f4212043471eb537fa72da507025d3ea', urls=[https://github.com/Shopify/sarama.git, git@github.com:Shopify/sarama.git]
Resolving github.com/armon/consul-api: commit='eb2c6b5be1b66bab83016e0b05f01b8d5496ffbd', urls=[https://github.com/armon/consul-api.git, git@github.com:armon/consul-api.git]
Resolving github.com/etcd-io/etcd: commit='11214aa33bf5a47d3d9d8dafe0f6b97237dfe921', urls=[https://github.com/etcd-io/etcd.git, git@github.com:etcd-io/etcd.git]
Resolving cached github.com/etcd-io/etcd: commit='11214aa33bf5a47d3d9d8dafe0f6b97237dfe921', urls=[https://github.com/etcd-io/etcd.git, git@github.com:etcd-io/etcd.git]
Resolving cached github.com/etcd-io/etcd: commit='11214aa33bf5a47d3d9d8dafe0f6b97237dfe921', urls=[https://github.com/etcd-io/etcd.git, git@github.com:etcd-io/etcd.git]
Resolving cached github.com/etcd-io/etcd: commit='11214aa33bf5a47d3d9d8dafe0f6b97237dfe921', urls=[https://github.com/etcd-io/etcd.git, git@github.com:etcd-io/etcd.git]
Resolving cached github.com/etcd-io/etcd: commit='11214aa33bf5a47d3d9d8dafe0f6b97237dfe921', urls=[https://github.com/etcd-io/etcd.git, git@github.com:etcd-io/etcd.git]
Resolving cached github.com/etcd-io/etcd: commit='11214aa33bf5a47d3d9d8dafe0f6b97237dfe921', urls=[https://github.com/etcd-io/etcd.git, git@github.com:etcd-io/etcd.git]
Resolving github.com/cpuguy83/go-md2man: commit='dc9f53734905c233adfc09fd4f063dce63ce3daf', urls=[https://github.com/cpuguy83/go-md2man.git, git@github.com:cpuguy83/go-md2man.git]
Resolving github.com/davecgh/go-spew: commit='87df7c60d5820d0f8ae11afede5aa52325c09717', urls=[https://github.com/davecgh/go-spew.git, git@github.com:davecgh/go-spew.git]
Resolving cached github.com/etcd-io/etcd: commit='11214aa33bf5a47d3d9d8dafe0f6b97237dfe921', urls=[https://github.com/etcd-io/etcd.git, git@github.com:etcd-io/etcd.git]
Resolving cached github.com/etcd-io/etcd: commit='11214aa33bf5a47d3d9d8dafe0f6b97237dfe921', urls=[https://github.com/etcd-io/etcd.git, git@github.com:etcd-io/etcd.git]
Resolving github.com/eapache/go-resiliency: commit='ef9aaa7ea8bd2448429af1a77cf41b2b3b34bdd6', urls=[https://github.com/eapache/go-resiliency.git, git@github.com:eapache/go-resiliency.git]
Resolving github.com/eapache/go-xerial-snappy: commit='bb955e01b9346ac19dc29eb16586c90ded99a98c', urls=[https://github.com/eapache/go-xerial-snappy.git, git@github.com:eapache/go-xerial-snappy.git]
Resolving github.com/eapache/queue: commit='44cc805cf13205b55f69e14bcb69867d1ae92f98', urls=[https://github.com/eapache/queue.git, git@github.com:eapache/queue.git]
Resolving github.com/etcd-io/etcd: commit='11214aa33bf5a47d3d9d8dafe0f6b97237dfe921', urls=[https://github.com/etcd-io/etcd.git, git@github.com:etcd-io/etcd.git]
Resolving github.com/fsnotify/fsnotify: commit='c2828203cd70a50dcccfb2761f8b1f8ceef9a8e9', urls=[https://github.com/fsnotify/fsnotify.git, git@github.com:fsnotify/fsnotify.git]
Resolving cached github.com/etcd-io/etcd: commit='11214aa33bf5a47d3d9d8dafe0f6b97237dfe921', urls=[https://github.com/etcd-io/etcd.git, git@github.com:etcd-io/etcd.git]
Resolving cached github.com/etcd-io/etcd: commit='11214aa33bf5a47d3d9d8dafe0f6b97237dfe921', urls=[https://github.com/etcd-io/etcd.git, git@github.com:etcd-io/etcd.git]
Resolving github.com/golang/glog: commit='23def4e6c14b4da8ac2ed8007337bc5eb5007998', urls=[https://github.com/golang/glog.git, git@github.com:golang/glog.git]
Resolving cached github.com/etcd-io/etcd: commit='11214aa33bf5a47d3d9d8dafe0f6b97237dfe921', urls=[https://github.com/etcd-io/etcd.git, git@github.com:etcd-io/etcd.git]
Resolving github.com/golang/mock: commit='b3e60bcdc577185fce3cf625fc96b62857ce5574', urls=[https://github.com/golang/mock.git, git@github.com:golang/mock.git]
Resolving github.com/golang/protobuf: commit='d04d7b157bb510b1e0c10132224b616ac0e26b17', urls=[https://github.com/golang/protobuf.git, git@github.com:golang/protobuf.git]
Resolving github.com/golang/snappy: commit='553a641470496b2327abcac10b36396bd98e45c9', urls=[https://github.com/golang/snappy.git, git@github.com:golang/snappy.git]
Resolving cached github.com/etcd-io/etcd: commit='11214aa33bf5a47d3d9d8dafe0f6b97237dfe921', urls=[https://github.com/etcd-io/etcd.git, git@github.com:etcd-io/etcd.git]
Resolving github.com/google/go-cmp: commit='9680bfaf28748393e28e00238d94070fb9972fd8', urls=[https://github.com/google/go-cmp.git, git@github.com:google/go-cmp.git]
Resolving github.com/google/pprof: commit='a8f279b7952b27edbcb72e5a6c69ee9be4c8ad93', urls=[https://github.com/google/pprof.git, git@github.com:google/pprof.git]
Resolving github.com/google/uuid: commit='bfb86fa49a73e4194d93bea18d7acfe3694438ce', urls=[https://github.com/google/uuid.git, git@github.com:google/uuid.git]
Resolving github.com/googleapis/gax-go: commit='bd5b16380fd03dc758d11cef74ba2e3bc8b0e8c2', urls=[https://github.com/googleapis/gax-go.git, git@github.com:googleapis/gax-go.git]
Resolving cached github.com/etcd-io/etcd: commit='11214aa33bf5a47d3d9d8dafe0f6b97237dfe921', urls=[https://github.com/etcd-io/etcd.git, git@github.com:etcd-io/etcd.git]
Resolving cached github.com/etcd-io/etcd: commit='11214aa33bf5a47d3d9d8dafe0f6b97237dfe921', urls=[https://github.com/etcd-io/etcd.git, git@github.com:etcd-io/etcd.git]
Resolving cached github.com/etcd-io/etcd: commit='11214aa33bf5a47d3d9d8dafe0f6b97237dfe921', urls=[https://github.com/etcd-io/etcd.git, git@github.com:etcd-io/etcd.git]
Resolving github.com/hashicorp/hcl: commit='23c074d0eceb2b8a5bfdbb271ab780cde70f05a8', urls=[https://github.com/hashicorp/hcl.git, git@github.com:hashicorp/hcl.git]

> Task :runners:java-fn-execution:compileJava FROM-CACHE
> Task :runners:java-fn-execution:classes UP-TO-DATE
> Task :runners:java-fn-execution:jar

> Task :sdks:java:container:pullLicenses
done.
DEPRECATION: Python 3.5 reached the end of its life on September 13th, 2020. Please upgrade your Python as Python 3.5 is no longer maintained. pip 21.0 will drop support for Python 3.5 in January 2021. pip 21.0 will remove support for this functionality.
Collecting beautifulsoup4<5.0,>=4.9.0
  Using cached beautifulsoup4-4.9.3-py3-none-any.whl (115 kB)
Collecting future<1.0.0,>=0.16.0
  Using cached future-0.18.2-py3-none-any.whl
Collecting pyyaml<6.0.0,>=3.12
  Using cached PyYAML-5.3.1-cp35-cp35m-linux_x86_64.whl
Collecting tenacity<6.0,>=5.0.2
  Using cached tenacity-5.1.5-py2.py3-none-any.whl (34 kB)
Collecting soupsieve>1.2
  Using cached soupsieve-2.1-py3-none-any.whl (32 kB)
Collecting six>=1.9.0
  Using cached six-1.16.0-py2.py3-none-any.whl (11 kB)
Installing collected packages: soupsieve, six, tenacity, pyyaml, future, beautifulsoup4
Successfully installed beautifulsoup4-4.9.3 future-0.18.2 pyyaml-5.3.1 six-1.16.0 soupsieve-2.1 tenacity-5.1.5

> Task :sdks:java:expansion-service:compileJava FROM-CACHE
> Task :sdks:java:expansion-service:classes UP-TO-DATE
> Task :sdks:java:expansion-service:jar
> Task :runners:direct-java:compileJava FROM-CACHE
> Task :runners:direct-java:classes UP-TO-DATE
> Task :sdks:java:io:kafka:compileJava FROM-CACHE
> Task :sdks:java:io:kafka:classes UP-TO-DATE
> Task :sdks:java:io:kafka:jar
> Task :runners:direct-java:shadowJar FROM-CACHE

> Task :release:go-licenses:java:dockerRun
+ rm -rf '/output/*'
+ export GO111MODULE=off
+ GO111MODULE=off
+ go get github.com/apache/beam/sdks/java/container

> Task :sdks:java:io:google-cloud-platform:compileJava FROM-CACHE
> Task :sdks:java:io:google-cloud-platform:classes UP-TO-DATE
> Task :sdks:java:io:google-cloud-platform:jar
> Task :runners:google-cloud-dataflow-java:compileJava FROM-CACHE
> Task :runners:google-cloud-dataflow-java:classes
> Task :runners:google-cloud-dataflow-java:jar
> Task :sdks:java:container:java8:copyDockerfileDependencies
> Task :sdks:java:io:google-cloud-platform:compileTestJava FROM-CACHE
> Task :sdks:java:io:google-cloud-platform:testClasses
> Task :sdks:java:io:google-cloud-platform:testJar
> Task :runners:google-cloud-dataflow-java:compileTestJava FROM-CACHE
> Task :runners:google-cloud-dataflow-java:testClasses UP-TO-DATE
> Task :runners:google-cloud-dataflow-java:testJar

> Task :sdks:go:resolveBuildDependencies
Resolving github.com/ianlancetaylor/demangle: commit='4883227f66371e02c4948937d3e2be1664d9be38', urls=[https://github.com/ianlancetaylor/demangle.git, git@github.com:ianlancetaylor/demangle.git]
Resolving cached github.com/etcd-io/etcd: commit='11214aa33bf5a47d3d9d8dafe0f6b97237dfe921', urls=[https://github.com/etcd-io/etcd.git, git@github.com:etcd-io/etcd.git]
Resolving cached github.com/etcd-io/etcd: commit='11214aa33bf5a47d3d9d8dafe0f6b97237dfe921', urls=[https://github.com/etcd-io/etcd.git, git@github.com:etcd-io/etcd.git]
Resolving github.com/kr/fs: commit='2788f0dbd16903de03cb8186e5c7d97b69ad387b', urls=[https://github.com/kr/fs.git, git@github.com:kr/fs.git]
Resolving cached github.com/etcd-io/etcd: commit='11214aa33bf5a47d3d9d8dafe0f6b97237dfe921', urls=[https://github.com/etcd-io/etcd.git, git@github.com:etcd-io/etcd.git]
Resolving github.com/linkedin/goavro: commit='94a7a9db615f35a39dd2b82089398b92fabad2ba', urls=[https://github.com/linkedin/goavro.git, git@github.com:linkedin/goavro.git]
Resolving github.com/magiconair/properties: commit='49d762b9817ba1c2e9d0c69183c2b4a8b8f1d934', urls=[https://github.com/magiconair/properties.git, git@github.com:magiconair/properties.git]
Resolving cached github.com/etcd-io/etcd: commit='11214aa33bf5a47d3d9d8dafe0f6b97237dfe921', urls=[https://github.com/etcd-io/etcd.git, git@github.com:etcd-io/etcd.git]
Resolving cached github.com/etcd-io/etcd: commit='11214aa33bf5a47d3d9d8dafe0f6b97237dfe921', urls=[https://github.com/etcd-io/etcd.git, git@github.com:etcd-io/etcd.git]
Resolving github.com/mitchellh/go-homedir: commit='b8bc1bf767474819792c23f32d8286a45736f1c6', urls=[https://github.com/mitchellh/go-homedir.git, git@github.com:mitchellh/go-homedir.git]
Resolving github.com/mitchellh/mapstructure: commit='a4e142e9c047c904fa2f1e144d9a84e6133024bc', urls=[https://github.com/mitchellh/mapstructure.git, git@github.com:mitchellh/mapstructure.git]
Resolving github.com/nightlyone/lockfile: commit='0ad87eef1443f64d3d8c50da647e2b1552851124', urls=[https://github.com/nightlyone/lockfile, git@github.com:nightlyone/lockfile.git]
Resolving cached github.com/etcd-io/etcd: commit='11214aa33bf5a47d3d9d8dafe0f6b97237dfe921', urls=[https://github.com/etcd-io/etcd.git, git@github.com:etcd-io/etcd.git]
Resolving github.com/openzipkin/zipkin-go: commit='3741243b287094fda649c7f0fa74bd51f37dc122', urls=[https://github.com/openzipkin/zipkin-go.git, git@github.com:openzipkin/zipkin-go.git]
Resolving github.com/pelletier/go-toml: commit='acdc4509485b587f5e675510c4f2c63e90ff68a8', urls=[https://github.com/pelletier/go-toml.git, git@github.com:pelletier/go-toml.git]
Resolving cached github.com/etcd-io/etcd: commit='11214aa33bf5a47d3d9d8dafe0f6b97237dfe921', urls=[https://github.com/etcd-io/etcd.git, git@github.com:etcd-io/etcd.git]
Resolving github.com/pierrec/lz4: commit='ed8d4cc3b461464e69798080a0092bd028910298', urls=[https://github.com/pierrec/lz4.git, git@github.com:pierrec/lz4.git]
Resolving github.com/pierrec/xxHash: commit='a0006b13c722f7f12368c00a3d3c2ae8a999a0c6', urls=[https://github.com/pierrec/xxHash.git, git@github.com:pierrec/xxHash.git]
Resolving github.com/pkg/errors: commit='30136e27e2ac8d167177e8a583aa4c3fea5be833', urls=[https://github.com/pkg/errors.git, git@github.com:pkg/errors.git]
Resolving github.com/pkg/sftp: commit='22e9c1ccc02fc1b9fa3264572e49109b68a86947', urls=[https://github.com/pkg/sftp.git, git@github.com:pkg/sftp.git]
Resolving github.com/prometheus/client_golang: commit='9bb6ab929dcbe1c8393cd9ef70387cb69811bd1c', urls=[https://github.com/prometheus/client_golang.git, git@github.com:prometheus/client_golang.git]
Resolving cached github.com/etcd-io/etcd: commit='11214aa33bf5a47d3d9d8dafe0f6b97237dfe921', urls=[https://github.com/etcd-io/etcd.git, git@github.com:etcd-io/etcd.git]
Resolving cached github.com/etcd-io/etcd: commit='11214aa33bf5a47d3d9d8dafe0f6b97237dfe921', urls=[https://github.com/etcd-io/etcd.git, git@github.com:etcd-io/etcd.git]
Resolving github.com/prometheus/procfs: commit='cb4147076ac75738c9a7d279075a253c0cc5acbd', urls=[https://github.com/prometheus/procfs.git, git@github.com:prometheus/procfs.git]
Resolving github.com/rcrowley/go-metrics: commit='8732c616f52954686704c8645fe1a9d59e9df7c1', urls=[https://github.com/rcrowley/go-metrics.git, git@github.com:rcrowley/go-metrics.git]
Resolving github.com/cpuguy83/go-md2man: commit='dc9f53734905c233adfc09fd4f063dce63ce3daf', urls=[https://github.com/cpuguy83/go-md2man.git, git@github.com:cpuguy83/go-md2man.git]
Resolving cached github.com/cpuguy83/go-md2man: commit='dc9f53734905c233adfc09fd4f063dce63ce3daf', urls=[https://github.com/cpuguy83/go-md2man.git, git@github.com:cpuguy83/go-md2man.git]
Resolving cached github.com/etcd-io/etcd: commit='11214aa33bf5a47d3d9d8dafe0f6b97237dfe921', urls=[https://github.com/etcd-io/etcd.git, git@github.com:etcd-io/etcd.git]
Resolving cached github.com/etcd-io/etcd: commit='11214aa33bf5a47d3d9d8dafe0f6b97237dfe921', urls=[https://github.com/etcd-io/etcd.git, git@github.com:etcd-io/etcd.git]
Resolving github.com/spf13/afero: commit='bb8f1927f2a9d3ab41c9340aa034f6b803f4359c', urls=[https://github.com/spf13/afero.git, git@github.com:spf13/afero.git]
Resolving github.com/spf13/cast: commit='acbeb36b902d72a7a4c18e8f3241075e7ab763e4', urls=[https://github.com/spf13/cast.git, git@github.com:spf13/cast.git]
Resolving github.com/spf13/cobra: commit='93959269ad99e80983c9ba742a7e01203a4c0e4f', urls=[https://github.com/spf13/cobra.git, git@github.com:spf13/cobra.git]
Resolving github.com/spf13/jwalterweatherman: commit='7c0cea34c8ece3fbeb2b27ab9b59511d360fb394', urls=[https://github.com/spf13/jwalterweatherman.git, git@github.com:spf13/jwalterweatherman.git]
Resolving cached github.com/etcd-io/etcd: commit='11214aa33bf5a47d3d9d8dafe0f6b97237dfe921', urls=[https://github.com/etcd-io/etcd.git, git@github.com:etcd-io/etcd.git]
Resolving github.com/spf13/viper: commit='aafc9e6bc7b7bb53ddaa75a5ef49a17d6e654be5', urls=[https://github.com/spf13/viper.git, git@github.com:spf13/viper.git]
Resolving github.com/stathat/go: commit='74669b9f388d9d788c97399a0824adbfee78400e', urls=[https://github.com/stathat/go.git, git@github.com:stathat/go.git]
Resolving cached github.com/etcd-io/etcd: commit='11214aa33bf5a47d3d9d8dafe0f6b97237dfe921', urls=[https://github.com/etcd-io/etcd.git, git@github.com:etcd-io/etcd.git]
Resolving cached github.com/etcd-io/etcd: commit='11214aa33bf5a47d3d9d8dafe0f6b97237dfe921', urls=[https://github.com/etcd-io/etcd.git, git@github.com:etcd-io/etcd.git]
Resolving cached github.com/etcd-io/etcd: commit='11214aa33bf5a47d3d9d8dafe0f6b97237dfe921', urls=[https://github.com/etcd-io/etcd.git, git@github.com:etcd-io/etcd.git]
Resolving cached github.com/etcd-io/etcd: commit='11214aa33bf5a47d3d9d8dafe0f6b97237dfe921', urls=[https://github.com/etcd-io/etcd.git, git@github.com:etcd-io/etcd.git]
Resolving github.com/xordataexchange/crypt: commit='b2862e3d0a775f18c7cfe02273500ae307b61218', urls=[https://github.com/xordataexchange/crypt.git, git@github.com:xordataexchange/crypt.git]
Resolving go.opencensus.io: commit='3fb168f674736c026e623310bfccb0691e6dec8a', urls=[https://github.com/census-instrumentation/opencensus-go]

> Task :sdks:java:container:pullLicenses
Executing <https://ci-beam.apache.org/job/beam_PostCommit_Java_VR_Dataflow_V2_Streaming/ws/src/sdks/java/container/build/virtualenv/bin/python> <https://ci-beam.apache.org/job/beam_PostCommit_Java_VR_Dataflow_V2_Streaming/ws/src/sdks/java/container/license_scripts/pull_licenses_java.py> --license_index=<https://ci-beam.apache.org/job/beam_PostCommit_Java_VR_Dataflow_V2_Streaming/ws/src/sdks/java/container/build/reports/dependency-license/index.json>        --output_dir=<https://ci-beam.apache.org/job/beam_PostCommit_Java_VR_Dataflow_V2_Streaming/ws/src/sdks/java/container/build/target/java_third_party_licenses>        --dep_url_yaml=<https://ci-beam.apache.org/job/beam_PostCommit_Java_VR_Dataflow_V2_Streaming/ws/src/sdks/java/container/license_scripts/dep_urls_java.yaml> 
INFO:root:Pulling license for 207 dependencies using 16 threads.
INFO:root:pull_licenses_java.py succeed. It took 1.94364 seconds with 16 threads.
Copying licenses from <https://ci-beam.apache.org/job/beam_PostCommit_Java_VR_Dataflow_V2_Streaming/ws/src/sdks/java/container/build/target/java_third_party_licenses> to <https://ci-beam.apache.org/job/beam_PostCommit_Java_VR_Dataflow_V2_Streaming/ws/src/sdks/java/container/build/target/third_party_licenses.>
Finished license_scripts.sh

> Task :sdks:java:container:java8:copyJavaThirdPartyLicenses NO-SOURCE

> Task :sdks:go:resolveBuildDependencies
Resolving golang.org/x/crypto: commit='d9133f5469342136e669e85192a26056b587f503', urls=[https://go.googlesource.com/crypto]
Resolving golang.org/x/debug: commit='95515998a8a4bd7448134b2cb5971dbeb12e0b77', urls=[https://go.googlesource.com/debug]
Resolving golang.org/x/net: commit='2fb46b16b8dda405028c50f7c7f0f9dd1fa6bfb1', urls=[https://go.googlesource.com/net]
Resolving golang.org/x/oauth2: commit='5d25da1a8d43b66f2898c444f899c7bcfd6a407e', urls=[https://go.googlesource.com/oauth2]
Resolving golang.org/x/sync: commit='fd80eb99c8f653c847d294a001bdf2a3a6f768f5', urls=[https://go.googlesource.com/sync]
Resolving golang.org/x/sys: commit='fde4db37ae7ad8191b03d30d27f258b5291ae4e3', urls=[https://go.googlesource.com/sys]
Resolving golang.org/x/text: commit='23ae387dee1f90d29a23c0e87ee0b46038fbed0e', urls=[https://go.googlesource.com/text]
Resolving cached github.com/etcd-io/etcd: commit='11214aa33bf5a47d3d9d8dafe0f6b97237dfe921', urls=[https://github.com/etcd-io/etcd.git, git@github.com:etcd-io/etcd.git]

> Task :release:go-licenses:java:dockerRun
+ go-licenses save github.com/apache/beam/sdks/java/container --save_path=/output/licenses
+ go-licenses csv github.com/apache/beam/sdks/java/container
+ tee /output/licenses/list.csv
+ chmod -R a+w /output/licenses

> Task :release:go-licenses:java:createLicenses
> Task :sdks:java:container:java8:copyGolangLicenses

> Task :sdks:go:resolveBuildDependencies
Resolving google.golang.org/api: commit='0324d5e90dc7753607860272666845fad9ceb97e', urls=[https://code.googlesource.com/google-api-go-client]
Resolving google.golang.org/genproto: commit='4d944d34d83c502a5f761500a14d8842648415c3', urls=[https://github.com/google/go-genproto]
Resolving google.golang.org/grpc: commit='5e8f83304c0563d1ba74db05fee83d9c18ab9a58', urls=[https://github.com/grpc/grpc-go]
Resolving google.golang.org/protobuf: commit='d165be301fb1e13390ad453281ded24385fd8ebc', urls=[https://go.googlesource.com/protobuf]
Resolving cached github.com/etcd-io/etcd: commit='11214aa33bf5a47d3d9d8dafe0f6b97237dfe921', urls=[https://github.com/etcd-io/etcd.git, git@github.com:etcd-io/etcd.git]
Resolving cached github.com/etcd-io/etcd: commit='11214aa33bf5a47d3d9d8dafe0f6b97237dfe921', urls=[https://github.com/etcd-io/etcd.git, git@github.com:etcd-io/etcd.git]

> Task :sdks:go:installDependencies
> Task :sdks:go:buildLinuxAmd64
> Task :sdks:go:goBuild

> Task :sdks:java:container:resolveBuildDependencies
Resolving ./github.com/apache/beam/sdks/go@<https://ci-beam.apache.org/job/beam_PostCommit_Java_VR_Dataflow_V2_Streaming/ws/src/sdks/go>

> Task :sdks:java:container:installDependencies
> Task :sdks:java:container:buildLinuxAmd64
> Task :sdks:java:container:goBuild
> Task :sdks:java:container:java8:copySdkHarnessLauncher
> Task :sdks:java:container:java8:dockerPrepare
> Task :sdks:java:container:java8:docker

> Task :runners:google-cloud-dataflow-java:buildAndPushDockerContainer
WARNING: `gcloud docker` will not be supported for Docker client versions above 18.03.

As an alternative, use `gcloud auth configure-docker` to configure `docker` to
use `gcloud` as a credential helper, then use `docker` as you would for non-GCR
registries, e.g. `docker pull gcr.io/project-id/my-image`. Add
`--verbosity=error` to silence this warning: `gcloud docker
--verbosity=error -- pull gcr.io/project-id/my-image`.

See: https://cloud.google.com/container-registry/docs/support/deprecation-notices#gcloud-docker


> Task :runners:google-cloud-dataflow-java:validatesRunnerV2TestStreaming

org.apache.beam.sdk.transforms.ParDoTest$TimerTests > testTwoTimersSettingEachOtherWithCreateAsInputUnbounded FAILED
    java.lang.RuntimeException at ParDoTest.java:4502

241 tests completed, 1 failed, 3 skipped

> Task :runners:google-cloud-dataflow-java:validatesRunnerV2TestStreaming FAILED

> Task :runners:google-cloud-dataflow-java:cleanUpDockerImages
Tag: [us.gcr.io/apache-beam-testing/java-postcommit-it/java:20210816202859]
- referencing digest: [us.gcr.io/apache-beam-testing/java-postcommit-it/java@sha256:237292730845c8545cc0a16d6356c20c880f0fa40132c2e2288f72393ff867ca]

Deleted [[us.gcr.io/apache-beam-testing/java-postcommit-it/java:20210816202859] (referencing [us.gcr.io/apache-beam-testing/java-postcommit-it/java@sha256:237292730845c8545cc0a16d6356c20c880f0fa40132c2e2288f72393ff867ca])].
Digests:
- us.gcr.io/apache-beam-testing/java-postcommit-it/java@sha256:237292730845c8545cc0a16d6356c20c880f0fa40132c2e2288f72393ff867ca
Deleted [us.gcr.io/apache-beam-testing/java-postcommit-it/java@sha256:237292730845c8545cc0a16d6356c20c880f0fa40132c2e2288f72393ff867ca].

FAILURE: Build failed with an exception.

* What went wrong:
Execution failed for task ':runners:google-cloud-dataflow-java:validatesRunnerV2TestStreaming'.
> There were failing tests. See the report at: file://<https://ci-beam.apache.org/job/beam_PostCommit_Java_VR_Dataflow_V2_Streaming/ws/src/runners/google-cloud-dataflow-java/build/reports/tests/validatesRunnerV2TestStreaming/index.html>

* Try:
Run with --stacktrace option to get the stack trace. Run with --info or --debug option to get more log output. Run with --scan to get full insights.

* Get more help at https://help.gradle.org

Deprecated Gradle features were used in this build, making it incompatible with Gradle 7.0.
Use '--warning-mode all' to show the individual deprecation warnings.
See https://docs.gradle.org/6.8.3/userguide/command_line_interface.html#sec:command_line_warnings

BUILD FAILED in 5h 36m 24s
130 actionable tasks: 89 executed, 39 from cache, 2 up-to-date

Publishing build scan...
https://gradle.com/s/jratg2triivr4

Build step 'Invoke Gradle script' changed build result to FAILURE
Build step 'Invoke Gradle script' marked build as failure

---------------------------------------------------------------------
To unsubscribe, e-mail: builds-unsubscribe@beam.apache.org
For additional commands, e-mail: builds-help@beam.apache.org


Build failed in Jenkins: beam_PostCommit_Java_VR_Dataflow_V2_Streaming #1100

Posted by Apache Jenkins Server <je...@builds.apache.org>.
See <https://ci-beam.apache.org/job/beam_PostCommit_Java_VR_Dataflow_V2_Streaming/1100/display/redirect>

Changes:


------------------------------------------
[...truncated 68.46 KB...]
google.golang.org/grpc,https://github.com/grpc/grpc-go/blob/master/LICENSE,Apache-2.0
golang.org/x/net,https://go.googlesource.com/net/+/refs/heads/master/LICENSE,BSD-3-Clause
github.com/apache/beam/sdks/java/container,https://github.com/apache/beam/blob/master/LICENSE,Apache-2.0
google.golang.org/protobuf,https://go.googlesource.com/protobuf/+/refs/heads/master/LICENSE,BSD-3-Clause
google.golang.org/genproto/googleapis/rpc/status,https://github.com/googleapis/go-genproto/blob/master/LICENSE,Apache-2.0
golang.org/x/sys,https://go.googlesource.com/sys/+/refs/heads/master/LICENSE,BSD-3-Clause
golang.org/x/text,https://go.googlesource.com/text/+/refs/heads/master/LICENSE,BSD-3-Clause
+ chmod -R a+w /output/licenses

> Task :release:go-licenses:java:createLicenses
> Task :sdks:java:container:java8:copyGolangLicenses

> Task :sdks:go:resolveBuildDependencies
Resolving google.golang.org/api: commit='0324d5e90dc7753607860272666845fad9ceb97e', urls=[https://code.googlesource.com/google-api-go-client]
Resolving google.golang.org/genproto: commit='4d944d34d83c502a5f761500a14d8842648415c3', urls=[https://github.com/google/go-genproto]
Resolving google.golang.org/grpc: commit='5e8f83304c0563d1ba74db05fee83d9c18ab9a58', urls=[https://github.com/grpc/grpc-go]
Resolving google.golang.org/protobuf: commit='d165be301fb1e13390ad453281ded24385fd8ebc', urls=[https://go.googlesource.com/protobuf]
Resolving cached github.com/etcd-io/etcd: commit='11214aa33bf5a47d3d9d8dafe0f6b97237dfe921', urls=[https://github.com/etcd-io/etcd.git, git@github.com:etcd-io/etcd.git]
Resolving cached github.com/etcd-io/etcd: commit='11214aa33bf5a47d3d9d8dafe0f6b97237dfe921', urls=[https://github.com/etcd-io/etcd.git, git@github.com:etcd-io/etcd.git]

> Task :sdks:go:installDependencies
> Task :sdks:go:buildLinuxAmd64
> Task :sdks:go:goBuild

> Task :sdks:java:container:resolveBuildDependencies
Resolving ./github.com/apache/beam/sdks/go@<https://ci-beam.apache.org/job/beam_PostCommit_Java_VR_Dataflow_V2_Streaming/ws/src/sdks/go>

> Task :sdks:java:container:installDependencies
> Task :sdks:java:container:buildLinuxAmd64
> Task :sdks:java:container:goBuild
> Task :sdks:java:container:java8:copySdkHarnessLauncher
> Task :sdks:java:container:java8:dockerPrepare
> Task :sdks:java:container:java8:docker

> Task :runners:google-cloud-dataflow-java:buildAndPushDockerContainer
WARNING: `gcloud docker` will not be supported for Docker client versions above 18.03.

As an alternative, use `gcloud auth configure-docker` to configure `docker` to
use `gcloud` as a credential helper, then use `docker` as you would for non-GCR
registries, e.g. `docker pull gcr.io/project-id/my-image`. Add
`--verbosity=error` to silence this warning: `gcloud docker
--verbosity=error -- pull gcr.io/project-id/my-image`.

See: https://cloud.google.com/container-registry/docs/support/deprecation-notices#gcloud-docker


> Task :runners:google-cloud-dataflow-java:validatesRunnerV2TestStreaming

org.apache.beam.sdk.PipelineTest > testTupleInjectionTransform FAILED
    java.lang.RuntimeException at PipelineTest.java:368

org.apache.beam.sdk.transforms.ParDoTest$StateTests > testBagState FAILED
    java.lang.RuntimeException at ParDoTest.java:2329

org.apache.beam.sdk.testing.PAssertTest > testAssertionSiteIsCapturedWithMessage FAILED
    java.lang.AssertionError at PAssertTest.java:533

org.apache.beam.sdk.transforms.KvSwapTest > testKvSwap FAILED
    java.lang.RuntimeException at KvSwapTest.java:80

org.apache.beam.sdk.schemas.AvroSchemaTest > testAvroPipelineGroupBy FAILED
    java.lang.RuntimeException at AvroSchemaTest.java:497

org.apache.beam.sdk.transforms.ParDoTest$StateCoderInferenceTests > testCombiningStateCoderInference FAILED
    java.lang.RuntimeException at ParDoTest.java:3390

org.apache.beam.sdk.PipelineTest > testIdentityTransform FAILED
    java.lang.RuntimeException at PipelineTest.java:318

org.apache.beam.sdk.transforms.ParDoTest$StateTests > testCombiningState FAILED
    java.lang.RuntimeException at ParDoTest.java:2673

org.apache.beam.sdk.testing.PAssertTest > testEmptyFalse FAILED
    java.lang.AssertionError at PAssertTest.java:493

org.apache.beam.sdk.transforms.ImpulseTest > testImpulse FAILED
    java.lang.RuntimeException at ImpulseTest.java:47

org.apache.beam.sdk.transforms.CombineFnsTest > testComposedCombineNullValues FAILED
    java.lang.RuntimeException at CombineFnsTest.java:251

org.apache.beam.sdk.transforms.ParDoTest$StateCoderInferenceTests > testBagStateCoderInference FAILED
    java.lang.RuntimeException at ParDoTest.java:3089

org.apache.beam.sdk.PipelineTest > testTupleProjectionTransform FAILED
    java.lang.RuntimeException at PipelineTest.java:340

org.apache.beam.sdk.transforms.ParDoTest$StateTests > testValueStateSameId FAILED
    java.lang.RuntimeException at ParDoTest.java:2230

org.apache.beam.sdk.testing.PAssertTest > testIsEqualTo FAILED
    java.lang.RuntimeException at PAssertTest.java:315

org.apache.beam.sdk.transforms.CombineTest$WindowingTests > testGlobalCombineWithDefaultsAndTriggers FAILED
    java.lang.RuntimeException at CombineTest.java:1239

org.apache.beam.sdk.transforms.CombineFnsTest > testComposedCombine FAILED
    java.lang.RuntimeException at CombineFnsTest.java:147

org.apache.beam.sdk.transforms.ViewTest > testMapAsEntrySetSideInput FAILED
    java.lang.RuntimeException at ViewTest.java:1019

org.apache.beam.sdk.PipelineTest > testMultipleApply FAILED
    java.lang.RuntimeException at PipelineTest.java:252

org.apache.beam.sdk.transforms.ParDoTest$StateTests > testValueStateSimple FAILED
    java.lang.RuntimeException at ParDoTest.java:1994

org.apache.beam.sdk.transforms.ViewTest > testMultimapSideInput FAILED
    java.lang.RuntimeException at ViewTest.java:585

org.apache.beam.sdk.transforms.CombineTest$WindowingTests > testCombineGloballyLambda FAILED
    java.lang.RuntimeException at CombineTest.java:1421

org.apache.beam.sdk.transforms.FlattenTest > testFlattenIterablesCollections FAILED
    java.lang.RuntimeException at FlattenTest.java:302

org.apache.beam.sdk.testing.PAssertTest > testEmpty FAILED
    java.lang.RuntimeException at PAssertTest.java:458

org.apache.beam.sdk.transforms.ParDoTest$StateTests > testValueStateTaggedOutput FAILED
    java.lang.RuntimeException at ParDoTest.java:2281

org.apache.beam.sdk.values.PCollectionTupleTest > testComposePCollectionTuple FAILED
    java.lang.RuntimeException at PCollectionTupleTest.java:106

org.apache.beam.sdk.transforms.CombineTest$WindowingTests > testCombineGloballyAsSingletonView FAILED
    java.lang.RuntimeException at CombineTest.java:1356

org.apache.beam.sdk.transforms.FlattenTest > testFlattenIterablesEmpty FAILED
    java.lang.RuntimeException at FlattenTest.java:317

org.apache.beam.sdk.testing.PAssertTest > testWindowedContainsInAnyOrder FAILED
    java.lang.RuntimeException at PAssertTest.java:448

org.apache.beam.sdk.transforms.ViewTest > testEmptyIterableSideInput FAILED
    java.lang.RuntimeException at ViewTest.java:512

org.apache.beam.sdk.transforms.ParDoTest$StateTests > testStateSideInput FAILED
    java.lang.RuntimeException at ParDoTest.java:2781

org.apache.beam.sdk.transforms.FlattenTest > testFlattenIterablesLists FAILED
    java.lang.RuntimeException at FlattenTest.java:270

org.apache.beam.sdk.transforms.ParDoTest$TimerTests > testOutputTimestampDefaultBounded FAILED
    java.lang.RuntimeException at ParDoTest.java:3905

org.apache.beam.sdk.testing.PAssertTest > testPAssertThatListSatisfiesOneMatcher FAILED
    java.lang.RuntimeException at PAssertTest.java:652

org.apache.beam.sdk.transforms.CombineTest$WindowingTests > testWindowedCombineEmpty FAILED
    java.lang.RuntimeException at CombineTest.java:1330

org.apache.beam.sdk.transforms.ViewTest > testSideInputWithNestedIterables FAILED
    java.lang.RuntimeException at ViewTest.java:1582

org.apache.beam.sdk.transforms.ParDoTest$StateTests > testBagStateSideInput FAILED
    java.lang.RuntimeException at ParDoTest.java:2759

org.apache.beam.sdk.transforms.FlattenTest > testFlattenWithDifferentInputAndOutputCoders2 FAILED
    java.lang.RuntimeException at FlattenTest.java:397

org.apache.beam.sdk.transforms.ParDoTest$TimerTests > testTwoTimersSettingEachOtherWithCreateAsInputUnbounded FAILED
    java.lang.RuntimeException at ParDoTest.java:4502

org.apache.beam.sdk.transforms.ViewTest > testListSideInput FAILED
    java.lang.RuntimeException at ViewTest.java:283

org.apache.beam.sdk.testing.PAssertTest > testPAssertThatFlattened FAILED
    java.lang.RuntimeException at PAssertTest.java:613

org.apache.beam.sdk.transforms.CombineTest$WindowingTests > testSlidingWindowsCombine FAILED
    java.lang.RuntimeException at CombineTest.java:1161

org.apache.beam.sdk.transforms.ParDoTest$StateTests > testCombiningStateParameterSuperclass FAILED
    java.lang.RuntimeException at ParDoTest.java:2709

org.apache.beam.sdk.transforms.FlattenTest > testFlattenInputMultipleCopies FAILED
    java.lang.RuntimeException at FlattenTest.java:167

org.apache.beam.sdk.transforms.ParDoTest$TimerTests > testEventTimeTimerAbsolute FAILED
    java.lang.RuntimeException at ParDoTest.java:3707

org.apache.beam.sdk.transforms.ViewTest > testMapSideInput FAILED
    java.lang.RuntimeException at ViewTest.java:987

org.apache.beam.sdk.testing.PAssertTest > testPAssertThatListSatisfiesMultipleMatchers FAILED
    java.lang.RuntimeException at PAssertTest.java:707

org.apache.beam.sdk.transforms.CombineTest$WindowingTests > testSessionsCombine FAILED
    java.lang.RuntimeException at CombineTest.java:1265

org.apache.beam.sdk.transforms.ParDoTest$StateTests > testCoderInferenceOfList FAILED
    java.lang.RuntimeException at ParDoTest.java:2131

org.apache.beam.sdk.transforms.FlattenTest > testFlattenPCollectionsSingletonList FAILED
    java.lang.RuntimeException at FlattenTest.java:109

org.apache.beam.sdk.transforms.ParDoTest$TimerTests > testTimerReceivedInOriginalWindow FAILED
    java.lang.RuntimeException at ParDoTest.java:3673

org.apache.beam.sdk.transforms.ViewTest > testWindowedSideInputFixedToFixedWithDefault FAILED
    java.lang.RuntimeException at ViewTest.java:1498

org.apache.beam.sdk.testing.PAssertTest > testPAssertThatListSatisfiesOneMatcherFalse FAILED
    java.lang.AssertionError at PAssertTest.java:679

org.apache.beam.sdk.transforms.CombineTest$WindowingTests > testWindowedCombineGloballyAsSingletonView FAILED
    java.lang.RuntimeException at CombineTest.java:1399

org.apache.beam.sdk.transforms.ParDoTest$TimerTests > testTwoTimersSettingEachOtherWithCreateAsInputBounded FAILED
    java.lang.RuntimeException at ParDoTest.java:4502

241 tests completed, 55 failed, 3 skipped

> Task :runners:google-cloud-dataflow-java:validatesRunnerV2TestStreaming FAILED

> Task :runners:google-cloud-dataflow-java:cleanUpDockerImages
Tag: [us.gcr.io/apache-beam-testing/java-postcommit-it/java:20210816141243]
- referencing digest: [us.gcr.io/apache-beam-testing/java-postcommit-it/java@sha256:11c1b0cc77a11aadcf129c70a2888d30b9d665ce170e111487b52015dd42d8ad]

Deleted [[us.gcr.io/apache-beam-testing/java-postcommit-it/java:20210816141243] (referencing [us.gcr.io/apache-beam-testing/java-postcommit-it/java@sha256:11c1b0cc77a11aadcf129c70a2888d30b9d665ce170e111487b52015dd42d8ad])].
Digests:
- us.gcr.io/apache-beam-testing/java-postcommit-it/java@sha256:11c1b0cc77a11aadcf129c70a2888d30b9d665ce170e111487b52015dd42d8ad
Deleted [us.gcr.io/apache-beam-testing/java-postcommit-it/java@sha256:11c1b0cc77a11aadcf129c70a2888d30b9d665ce170e111487b52015dd42d8ad].

FAILURE: Build failed with an exception.

* What went wrong:
Execution failed for task ':runners:google-cloud-dataflow-java:validatesRunnerV2TestStreaming'.
> There were failing tests. See the report at: file://<https://ci-beam.apache.org/job/beam_PostCommit_Java_VR_Dataflow_V2_Streaming/ws/src/runners/google-cloud-dataflow-java/build/reports/tests/validatesRunnerV2TestStreaming/index.html>

* Try:
Run with --stacktrace option to get the stack trace. Run with --info or --debug option to get more log output. Run with --scan to get full insights.

* Get more help at https://help.gradle.org

Deprecated Gradle features were used in this build, making it incompatible with Gradle 7.0.
Use '--warning-mode all' to show the individual deprecation warnings.
See https://docs.gradle.org/6.8.3/userguide/command_line_interface.html#sec:command_line_warnings

BUILD FAILED in 6h 15m 51s
130 actionable tasks: 89 executed, 39 from cache, 2 up-to-date

Publishing build scan...
https://gradle.com/s/e3eeg2onmokg4

Build step 'Invoke Gradle script' changed build result to FAILURE
Build step 'Invoke Gradle script' marked build as failure

---------------------------------------------------------------------
To unsubscribe, e-mail: builds-unsubscribe@beam.apache.org
For additional commands, e-mail: builds-help@beam.apache.org


beam_PostCommit_Java_VR_Dataflow_V2_Streaming - Build # 1099 - Aborted!

Posted by Apache Jenkins Server <je...@builds.apache.org>.
beam_PostCommit_Java_VR_Dataflow_V2_Streaming - Build # 1099 - Aborted:

Check console output at https://ci-beam.apache.org/job/beam_PostCommit_Java_VR_Dataflow_V2_Streaming/1099/ to view the results.

beam_PostCommit_Java_VR_Dataflow_V2_Streaming - Build # 1098 - Aborted!

Posted by Apache Jenkins Server <je...@builds.apache.org>.
beam_PostCommit_Java_VR_Dataflow_V2_Streaming - Build # 1098 - Aborted:

Check console output at https://ci-beam.apache.org/job/beam_PostCommit_Java_VR_Dataflow_V2_Streaming/1098/ to view the results.

beam_PostCommit_Java_VR_Dataflow_V2_Streaming - Build # 1097 - Aborted!

Posted by Apache Jenkins Server <je...@builds.apache.org>.
beam_PostCommit_Java_VR_Dataflow_V2_Streaming - Build # 1097 - Aborted:

Check console output at https://ci-beam.apache.org/job/beam_PostCommit_Java_VR_Dataflow_V2_Streaming/1097/ to view the results.

beam_PostCommit_Java_VR_Dataflow_V2_Streaming - Build # 1096 - Aborted!

Posted by Apache Jenkins Server <je...@builds.apache.org>.
beam_PostCommit_Java_VR_Dataflow_V2_Streaming - Build # 1096 - Aborted:

Check console output at https://ci-beam.apache.org/job/beam_PostCommit_Java_VR_Dataflow_V2_Streaming/1096/ to view the results.

beam_PostCommit_Java_VR_Dataflow_V2_Streaming - Build # 1095 - Aborted!

Posted by Apache Jenkins Server <je...@builds.apache.org>.
beam_PostCommit_Java_VR_Dataflow_V2_Streaming - Build # 1095 - Aborted:

Check console output at https://ci-beam.apache.org/job/beam_PostCommit_Java_VR_Dataflow_V2_Streaming/1095/ to view the results.

beam_PostCommit_Java_VR_Dataflow_V2_Streaming - Build # 1094 - Aborted!

Posted by Apache Jenkins Server <je...@builds.apache.org>.
beam_PostCommit_Java_VR_Dataflow_V2_Streaming - Build # 1094 - Aborted:

Check console output at https://ci-beam.apache.org/job/beam_PostCommit_Java_VR_Dataflow_V2_Streaming/1094/ to view the results.

beam_PostCommit_Java_VR_Dataflow_V2_Streaming - Build # 1093 - Aborted!

Posted by Apache Jenkins Server <je...@builds.apache.org>.
beam_PostCommit_Java_VR_Dataflow_V2_Streaming - Build # 1093 - Aborted:

Check console output at https://ci-beam.apache.org/job/beam_PostCommit_Java_VR_Dataflow_V2_Streaming/1093/ to view the results.

beam_PostCommit_Java_VR_Dataflow_V2_Streaming - Build # 1092 - Aborted!

Posted by Apache Jenkins Server <je...@builds.apache.org>.
beam_PostCommit_Java_VR_Dataflow_V2_Streaming - Build # 1092 - Aborted:

Check console output at https://ci-beam.apache.org/job/beam_PostCommit_Java_VR_Dataflow_V2_Streaming/1092/ to view the results.

beam_PostCommit_Java_VR_Dataflow_V2_Streaming - Build # 1091 - Aborted!

Posted by Apache Jenkins Server <je...@builds.apache.org>.
beam_PostCommit_Java_VR_Dataflow_V2_Streaming - Build # 1091 - Aborted:

Check console output at https://ci-beam.apache.org/job/beam_PostCommit_Java_VR_Dataflow_V2_Streaming/1091/ to view the results.

beam_PostCommit_Java_VR_Dataflow_V2_Streaming - Build # 1090 - Aborted!

Posted by Apache Jenkins Server <je...@builds.apache.org>.
beam_PostCommit_Java_VR_Dataflow_V2_Streaming - Build # 1090 - Aborted:

Check console output at https://ci-beam.apache.org/job/beam_PostCommit_Java_VR_Dataflow_V2_Streaming/1090/ to view the results.

beam_PostCommit_Java_VR_Dataflow_V2_Streaming - Build # 1089 - Aborted!

Posted by Apache Jenkins Server <je...@builds.apache.org>.
beam_PostCommit_Java_VR_Dataflow_V2_Streaming - Build # 1089 - Aborted:

Check console output at https://ci-beam.apache.org/job/beam_PostCommit_Java_VR_Dataflow_V2_Streaming/1089/ to view the results.

beam_PostCommit_Java_VR_Dataflow_V2_Streaming - Build # 1088 - Aborted!

Posted by Apache Jenkins Server <je...@builds.apache.org>.
beam_PostCommit_Java_VR_Dataflow_V2_Streaming - Build # 1088 - Aborted:

Check console output at https://ci-beam.apache.org/job/beam_PostCommit_Java_VR_Dataflow_V2_Streaming/1088/ to view the results.

beam_PostCommit_Java_VR_Dataflow_V2_Streaming - Build # 1087 - Aborted!

Posted by Apache Jenkins Server <je...@builds.apache.org>.
beam_PostCommit_Java_VR_Dataflow_V2_Streaming - Build # 1087 - Aborted:

Check console output at https://ci-beam.apache.org/job/beam_PostCommit_Java_VR_Dataflow_V2_Streaming/1087/ to view the results.

beam_PostCommit_Java_VR_Dataflow_V2_Streaming - Build # 1086 - Aborted!

Posted by Apache Jenkins Server <je...@builds.apache.org>.
beam_PostCommit_Java_VR_Dataflow_V2_Streaming - Build # 1086 - Aborted:

Check console output at https://ci-beam.apache.org/job/beam_PostCommit_Java_VR_Dataflow_V2_Streaming/1086/ to view the results.

beam_PostCommit_Java_VR_Dataflow_V2_Streaming - Build # 1085 - Aborted!

Posted by Apache Jenkins Server <je...@builds.apache.org>.
beam_PostCommit_Java_VR_Dataflow_V2_Streaming - Build # 1085 - Aborted:

Check console output at https://ci-beam.apache.org/job/beam_PostCommit_Java_VR_Dataflow_V2_Streaming/1085/ to view the results.

beam_PostCommit_Java_VR_Dataflow_V2_Streaming - Build # 1084 - Aborted!

Posted by Apache Jenkins Server <je...@builds.apache.org>.
beam_PostCommit_Java_VR_Dataflow_V2_Streaming - Build # 1084 - Aborted:

Check console output at https://ci-beam.apache.org/job/beam_PostCommit_Java_VR_Dataflow_V2_Streaming/1084/ to view the results.

beam_PostCommit_Java_VR_Dataflow_V2_Streaming - Build # 1083 - Aborted!

Posted by Apache Jenkins Server <je...@builds.apache.org>.
beam_PostCommit_Java_VR_Dataflow_V2_Streaming - Build # 1083 - Aborted:

Check console output at https://ci-beam.apache.org/job/beam_PostCommit_Java_VR_Dataflow_V2_Streaming/1083/ to view the results.

beam_PostCommit_Java_VR_Dataflow_V2_Streaming - Build # 1082 - Aborted!

Posted by Apache Jenkins Server <je...@builds.apache.org>.
beam_PostCommit_Java_VR_Dataflow_V2_Streaming - Build # 1082 - Aborted:

Check console output at https://ci-beam.apache.org/job/beam_PostCommit_Java_VR_Dataflow_V2_Streaming/1082/ to view the results.

beam_PostCommit_Java_VR_Dataflow_V2_Streaming - Build # 1081 - Aborted!

Posted by Apache Jenkins Server <je...@builds.apache.org>.
beam_PostCommit_Java_VR_Dataflow_V2_Streaming - Build # 1081 - Aborted:

Check console output at https://ci-beam.apache.org/job/beam_PostCommit_Java_VR_Dataflow_V2_Streaming/1081/ to view the results.

beam_PostCommit_Java_VR_Dataflow_V2_Streaming - Build # 1080 - Aborted!

Posted by Apache Jenkins Server <je...@builds.apache.org>.
beam_PostCommit_Java_VR_Dataflow_V2_Streaming - Build # 1080 - Aborted:

Check console output at https://ci-beam.apache.org/job/beam_PostCommit_Java_VR_Dataflow_V2_Streaming/1080/ to view the results.

beam_PostCommit_Java_VR_Dataflow_V2_Streaming - Build # 1079 - Aborted!

Posted by Apache Jenkins Server <je...@builds.apache.org>.
beam_PostCommit_Java_VR_Dataflow_V2_Streaming - Build # 1079 - Aborted:

Check console output at https://ci-beam.apache.org/job/beam_PostCommit_Java_VR_Dataflow_V2_Streaming/1079/ to view the results.

beam_PostCommit_Java_VR_Dataflow_V2_Streaming - Build # 1078 - Aborted!

Posted by Apache Jenkins Server <je...@builds.apache.org>.
beam_PostCommit_Java_VR_Dataflow_V2_Streaming - Build # 1078 - Aborted:

Check console output at https://ci-beam.apache.org/job/beam_PostCommit_Java_VR_Dataflow_V2_Streaming/1078/ to view the results.

beam_PostCommit_Java_VR_Dataflow_V2_Streaming - Build # 1077 - Aborted!

Posted by Apache Jenkins Server <je...@builds.apache.org>.
beam_PostCommit_Java_VR_Dataflow_V2_Streaming - Build # 1077 - Aborted:

Check console output at https://ci-beam.apache.org/job/beam_PostCommit_Java_VR_Dataflow_V2_Streaming/1077/ to view the results.

beam_PostCommit_Java_VR_Dataflow_V2_Streaming - Build # 1076 - Aborted!

Posted by Apache Jenkins Server <je...@builds.apache.org>.
beam_PostCommit_Java_VR_Dataflow_V2_Streaming - Build # 1076 - Aborted:

Check console output at https://ci-beam.apache.org/job/beam_PostCommit_Java_VR_Dataflow_V2_Streaming/1076/ to view the results.

beam_PostCommit_Java_VR_Dataflow_V2_Streaming - Build # 1075 - Aborted!

Posted by Apache Jenkins Server <je...@builds.apache.org>.
beam_PostCommit_Java_VR_Dataflow_V2_Streaming - Build # 1075 - Aborted:

Check console output at https://ci-beam.apache.org/job/beam_PostCommit_Java_VR_Dataflow_V2_Streaming/1075/ to view the results.

beam_PostCommit_Java_VR_Dataflow_V2_Streaming - Build # 1074 - Aborted!

Posted by Apache Jenkins Server <je...@builds.apache.org>.
beam_PostCommit_Java_VR_Dataflow_V2_Streaming - Build # 1074 - Aborted:

Check console output at https://ci-beam.apache.org/job/beam_PostCommit_Java_VR_Dataflow_V2_Streaming/1074/ to view the results.

beam_PostCommit_Java_VR_Dataflow_V2_Streaming - Build # 1073 - Aborted!

Posted by Apache Jenkins Server <je...@builds.apache.org>.
beam_PostCommit_Java_VR_Dataflow_V2_Streaming - Build # 1073 - Aborted:

Check console output at https://ci-beam.apache.org/job/beam_PostCommit_Java_VR_Dataflow_V2_Streaming/1073/ to view the results.

beam_PostCommit_Java_VR_Dataflow_V2_Streaming - Build # 1072 - Aborted!

Posted by Apache Jenkins Server <je...@builds.apache.org>.
beam_PostCommit_Java_VR_Dataflow_V2_Streaming - Build # 1072 - Aborted:

Check console output at https://ci-beam.apache.org/job/beam_PostCommit_Java_VR_Dataflow_V2_Streaming/1072/ to view the results.

beam_PostCommit_Java_VR_Dataflow_V2_Streaming - Build # 1071 - Aborted!

Posted by Apache Jenkins Server <je...@builds.apache.org>.
beam_PostCommit_Java_VR_Dataflow_V2_Streaming - Build # 1071 - Aborted:

Check console output at https://ci-beam.apache.org/job/beam_PostCommit_Java_VR_Dataflow_V2_Streaming/1071/ to view the results.

beam_PostCommit_Java_VR_Dataflow_V2_Streaming - Build # 1070 - Aborted!

Posted by Apache Jenkins Server <je...@builds.apache.org>.
beam_PostCommit_Java_VR_Dataflow_V2_Streaming - Build # 1070 - Aborted:

Check console output at https://ci-beam.apache.org/job/beam_PostCommit_Java_VR_Dataflow_V2_Streaming/1070/ to view the results.

beam_PostCommit_Java_VR_Dataflow_V2_Streaming - Build # 1069 - Aborted!

Posted by Apache Jenkins Server <je...@builds.apache.org>.
beam_PostCommit_Java_VR_Dataflow_V2_Streaming - Build # 1069 - Aborted:

Check console output at https://ci-beam.apache.org/job/beam_PostCommit_Java_VR_Dataflow_V2_Streaming/1069/ to view the results.

beam_PostCommit_Java_VR_Dataflow_V2_Streaming - Build # 1068 - Aborted!

Posted by Apache Jenkins Server <je...@builds.apache.org>.
beam_PostCommit_Java_VR_Dataflow_V2_Streaming - Build # 1068 - Aborted:

Check console output at https://ci-beam.apache.org/job/beam_PostCommit_Java_VR_Dataflow_V2_Streaming/1068/ to view the results.

beam_PostCommit_Java_VR_Dataflow_V2_Streaming - Build # 1067 - Aborted!

Posted by Apache Jenkins Server <je...@builds.apache.org>.
beam_PostCommit_Java_VR_Dataflow_V2_Streaming - Build # 1067 - Aborted:

Check console output at https://ci-beam.apache.org/job/beam_PostCommit_Java_VR_Dataflow_V2_Streaming/1067/ to view the results.

beam_PostCommit_Java_VR_Dataflow_V2_Streaming - Build # 1066 - Aborted!

Posted by Apache Jenkins Server <je...@builds.apache.org>.
beam_PostCommit_Java_VR_Dataflow_V2_Streaming - Build # 1066 - Aborted:

Check console output at https://ci-beam.apache.org/job/beam_PostCommit_Java_VR_Dataflow_V2_Streaming/1066/ to view the results.

beam_PostCommit_Java_VR_Dataflow_V2_Streaming - Build # 1065 - Aborted!

Posted by Apache Jenkins Server <je...@builds.apache.org>.
beam_PostCommit_Java_VR_Dataflow_V2_Streaming - Build # 1065 - Aborted:

Check console output at https://ci-beam.apache.org/job/beam_PostCommit_Java_VR_Dataflow_V2_Streaming/1065/ to view the results.

beam_PostCommit_Java_VR_Dataflow_V2_Streaming - Build # 1064 - Aborted!

Posted by Apache Jenkins Server <je...@builds.apache.org>.
beam_PostCommit_Java_VR_Dataflow_V2_Streaming - Build # 1064 - Aborted:

Check console output at https://ci-beam.apache.org/job/beam_PostCommit_Java_VR_Dataflow_V2_Streaming/1064/ to view the results.

beam_PostCommit_Java_VR_Dataflow_V2_Streaming - Build # 1063 - Aborted!

Posted by Apache Jenkins Server <je...@builds.apache.org>.
beam_PostCommit_Java_VR_Dataflow_V2_Streaming - Build # 1063 - Aborted:

Check console output at https://ci-beam.apache.org/job/beam_PostCommit_Java_VR_Dataflow_V2_Streaming/1063/ to view the results.

beam_PostCommit_Java_VR_Dataflow_V2_Streaming - Build # 1062 - Aborted!

Posted by Apache Jenkins Server <je...@builds.apache.org>.
beam_PostCommit_Java_VR_Dataflow_V2_Streaming - Build # 1062 - Aborted:

Check console output at https://ci-beam.apache.org/job/beam_PostCommit_Java_VR_Dataflow_V2_Streaming/1062/ to view the results.

beam_PostCommit_Java_VR_Dataflow_V2_Streaming - Build # 1061 - Aborted!

Posted by Apache Jenkins Server <je...@builds.apache.org>.
beam_PostCommit_Java_VR_Dataflow_V2_Streaming - Build # 1061 - Aborted:

Check console output at https://ci-beam.apache.org/job/beam_PostCommit_Java_VR_Dataflow_V2_Streaming/1061/ to view the results.

beam_PostCommit_Java_VR_Dataflow_V2_Streaming - Build # 1060 - Aborted!

Posted by Apache Jenkins Server <je...@builds.apache.org>.
beam_PostCommit_Java_VR_Dataflow_V2_Streaming - Build # 1060 - Aborted:

Check console output at https://ci-beam.apache.org/job/beam_PostCommit_Java_VR_Dataflow_V2_Streaming/1060/ to view the results.

beam_PostCommit_Java_VR_Dataflow_V2_Streaming - Build # 1059 - Aborted!

Posted by Apache Jenkins Server <je...@builds.apache.org>.
beam_PostCommit_Java_VR_Dataflow_V2_Streaming - Build # 1059 - Aborted:

Check console output at https://ci-beam.apache.org/job/beam_PostCommit_Java_VR_Dataflow_V2_Streaming/1059/ to view the results.

beam_PostCommit_Java_VR_Dataflow_V2_Streaming - Build # 1058 - Aborted!

Posted by Apache Jenkins Server <je...@builds.apache.org>.
beam_PostCommit_Java_VR_Dataflow_V2_Streaming - Build # 1058 - Aborted:

Check console output at https://ci-beam.apache.org/job/beam_PostCommit_Java_VR_Dataflow_V2_Streaming/1058/ to view the results.

beam_PostCommit_Java_VR_Dataflow_V2_Streaming - Build # 1057 - Aborted!

Posted by Apache Jenkins Server <je...@builds.apache.org>.
beam_PostCommit_Java_VR_Dataflow_V2_Streaming - Build # 1057 - Aborted:

Check console output at https://ci-beam.apache.org/job/beam_PostCommit_Java_VR_Dataflow_V2_Streaming/1057/ to view the results.

beam_PostCommit_Java_VR_Dataflow_V2_Streaming - Build # 1056 - Aborted!

Posted by Apache Jenkins Server <je...@builds.apache.org>.
beam_PostCommit_Java_VR_Dataflow_V2_Streaming - Build # 1056 - Aborted:

Check console output at https://ci-beam.apache.org/job/beam_PostCommit_Java_VR_Dataflow_V2_Streaming/1056/ to view the results.

beam_PostCommit_Java_VR_Dataflow_V2_Streaming - Build # 1055 - Aborted!

Posted by Apache Jenkins Server <je...@builds.apache.org>.
beam_PostCommit_Java_VR_Dataflow_V2_Streaming - Build # 1055 - Aborted:

Check console output at https://ci-beam.apache.org/job/beam_PostCommit_Java_VR_Dataflow_V2_Streaming/1055/ to view the results.

Build failed in Jenkins: beam_PostCommit_Java_VR_Dataflow_V2_Streaming #1054

Posted by Apache Jenkins Server <je...@builds.apache.org>.
See <https://ci-beam.apache.org/job/beam_PostCommit_Java_VR_Dataflow_V2_Streaming/1054/display/redirect>

Changes:


------------------------------------------
[...truncated 96.50 KB...]
    java.lang.RuntimeException at CombineTest.java:934

org.apache.beam.sdk.transforms.ParDoTest$MultipleInputsAndOutputTests > testMultiOutputParDoWithSideInputsIsCumulative FAILED
    java.lang.RuntimeException at ParDoTest.java:1273

org.apache.beam.sdk.transforms.windowing.WindowTest > testNoWindowFnDoesNotReassignWindows FAILED
    java.lang.RuntimeException at WindowTest.java:437

org.apache.beam.sdk.transforms.GroupByKeyTest > org.apache.beam.sdk.transforms.GroupByKeyTest$WindowTests.testGroupByKeyMultipleWindows FAILED
    java.lang.RuntimeException at GroupByKeyTest.java:558

org.apache.beam.sdk.transforms.ViewTest > testEmptyListSideInput FAILED
    java.lang.RuntimeException at ViewTest.java:361

org.apache.beam.sdk.transforms.CombineTest$BasicTests > testBasicCombine FAILED
    java.lang.RuntimeException at CombineTest.java:675

org.apache.beam.sdk.transforms.ParDoTest$MultipleInputsAndOutputTests > testSideInputAnnotationWithMultipleSideInputs FAILED
    java.lang.RuntimeException at ParDoTest.java:1163

org.apache.beam.sdk.transforms.GroupByKeyTest > org.apache.beam.sdk.transforms.GroupByKeyTest$WindowTests.testGroupByKeyAndWindows FAILED
    java.lang.RuntimeException at GroupByKeyTest.java:528

org.apache.beam.sdk.transforms.SplittableDoFnTest > testAdditionalOutputUnbounded FAILED
    java.lang.RuntimeException at SplittableDoFnTest.java:642

org.apache.beam.sdk.transforms.ViewTest > testWindowedSideInputFixedToFixed FAILED
    java.lang.RuntimeException at ViewTest.java:1418

org.apache.beam.sdk.transforms.CombineTest$BasicTests > testCombinePerKeyLambda FAILED
    java.lang.RuntimeException at CombineTest.java:906

org.apache.beam.sdk.transforms.ParDoTest$MultipleInputsAndOutputTests > testSideInputAnnotation FAILED
    java.lang.RuntimeException at ParDoTest.java:1060

org.apache.beam.sdk.transforms.SplittableDoFnTest > testLifecycleMethodsUnbounded FAILED
    java.lang.RuntimeException at SplittableDoFnTest.java:770

org.apache.beam.sdk.transforms.ViewTest > testIterableSideInput FAILED
    java.lang.RuntimeException at ViewTest.java:438

org.apache.beam.sdk.transforms.GroupByKeyTest > org.apache.beam.sdk.transforms.GroupByKeyTest$BasicTests.testTimestampCombinerLatest FAILED
    java.lang.RuntimeException at GroupByKeyTest.java:396

org.apache.beam.sdk.transforms.CombineTest$BasicTests > testHotKeyCombining FAILED
    java.lang.RuntimeException at CombineTest.java:735

org.apache.beam.sdk.transforms.ParDoTest$MultipleInputsAndOutputTests > testParDoWithEmptyTaggedOutput FAILED
    java.lang.RuntimeException at ParDoTest.java:767

org.apache.beam.sdk.transforms.SplittableDoFnTest > testWindowedSideInputUnbounded FAILED
    java.lang.RuntimeException at SplittableDoFnTest.java:434

org.apache.beam.sdk.transforms.ViewTest > testEmptyMultimapSideInputWithNonDeterministicKeyCoder FAILED
    java.lang.RuntimeException at ViewTest.java:906

org.apache.beam.sdk.transforms.GroupByKeyTest > org.apache.beam.sdk.transforms.GroupByKeyTest$BasicTests.testGroupByKeyEmpty FAILED
    java.lang.RuntimeException at GroupByKeyTest.java:153

org.apache.beam.sdk.transforms.CombineTest$BasicTests > testSimpleCombineEmpty FAILED
    java.lang.RuntimeException at CombineTest.java:669

org.apache.beam.sdk.transforms.ViewTest > testEmptyMapSideInput FAILED
    java.lang.RuntimeException at ViewTest.java:1219

org.apache.beam.sdk.transforms.ParDoTest$MultipleInputsAndOutputTests > testParDoWithSideInputs FAILED
    java.lang.RuntimeException at ParDoTest.java:846

org.apache.beam.sdk.transforms.SplittableDoFnTest > testPairWithIndexWindowedTimestampedUnbounded FAILED
    java.lang.RuntimeException at SplittableDoFnTest.java:229

org.apache.beam.sdk.transforms.CombineTest$BasicTests > testSimpleCombine FAILED
    java.lang.RuntimeException at CombineTest.java:660

org.apache.beam.sdk.transforms.GroupByKeyTest > org.apache.beam.sdk.transforms.GroupByKeyTest$BasicTests.testTimestampCombinerEarliest FAILED
    java.lang.RuntimeException at GroupByKeyTest.java:376

org.apache.beam.sdk.transforms.SplittableDoFnTest > testWindowedSideInputWithCheckpointsUnbounded FAILED
    java.lang.RuntimeException at SplittableDoFnTest.java:569

org.apache.beam.sdk.transforms.ViewTest > testMapSideInputIsImmutable FAILED
    java.lang.RuntimeException at ViewTest.java:1344

org.apache.beam.sdk.transforms.ParDoTest$MultipleInputsAndOutputTests > testParDoWithSideInputsIsCumulative FAILED
    java.lang.RuntimeException at ParDoTest.java:1197

org.apache.beam.sdk.transforms.CombineTest$BasicTests > testBinaryCombinePerKeyLambda FAILED
    java.lang.RuntimeException at CombineTest.java:920

org.apache.beam.sdk.transforms.GroupByKeyTest > org.apache.beam.sdk.transforms.GroupByKeyTest$BasicTests.testGroupByKey FAILED
    java.lang.RuntimeException at GroupByKeyTest.java:136

org.apache.beam.sdk.transforms.SplittableDoFnTest > testSideInputUnbounded FAILED
    java.lang.RuntimeException at SplittableDoFnTest.java:382

org.apache.beam.sdk.transforms.ViewTest > testWindowedMapAsEntrySetSideInput FAILED
    java.lang.RuntimeException at ViewTest.java:1141

org.apache.beam.sdk.io.CountingSourceTest > testUnboundedSourceSplits FAILED
    java.lang.RuntimeException at CountingSourceTest.java:243

org.apache.beam.sdk.transforms.GroupByKeyTest > org.apache.beam.sdk.transforms.GroupByKeyTest$BasicTests.testGroupByKeyWithBadEqualsHashCode FAILED
    java.lang.RuntimeException at GroupByKeyTest.java:453

org.apache.beam.sdk.transforms.CombineTest$BasicTests > testHotKeyCombiningWithAccumulationMode FAILED
    java.lang.RuntimeException at CombineTest.java:760

org.apache.beam.sdk.transforms.ViewTest > testEmptyMapSideInputWithNonDeterministicKeyCoder FAILED
    java.lang.RuntimeException at ViewTest.java:1253

org.apache.beam.sdk.metrics.MetricsTest$AttemptedMetricTests > testAttemptedDistributionMetrics FAILED
    java.lang.RuntimeException at MetricsTest.java:377

org.apache.beam.sdk.metrics.MetricsTest$AttemptedMetricTests > testAttemptedCounterMetrics FAILED
    java.lang.RuntimeException at MetricsTest.java:369

org.apache.beam.sdk.transforms.CombineTest$BasicTests > testBasicCombineEmpty FAILED
    java.lang.RuntimeException at CombineTest.java:686

org.apache.beam.sdk.transforms.ParDoTest$KeyTests > testKeyInOnTimer FAILED
    java.lang.RuntimeException at ParDoTest.java:5824

org.apache.beam.sdk.transforms.ViewTest > testMultimapAsEntrySetSideInput FAILED
    java.lang.RuntimeException at ViewTest.java:623

org.apache.beam.sdk.transforms.ParDoTest$TimerFamilyTests > testTimerWithMultipleTimerFamilyUnbounded FAILED
    java.lang.RuntimeException at ParDoTest.java:5683

org.apache.beam.sdk.transforms.ParDoTest$KeyTests > testKeyInOnTimerWithGenericKey FAILED
    java.lang.RuntimeException at ParDoTest.java:5858

org.apache.beam.sdk.transforms.ViewTest > testSingletonSideInput FAILED
    java.lang.RuntimeException at ViewTest.java:114

org.apache.beam.sdk.transforms.ParDoTest$TimerFamilyTests > testTimerWithMultipleTimerFamilyBounded FAILED
    java.lang.RuntimeException at ParDoTest.java:5683

org.apache.beam.sdk.transforms.CombineTest$AccumulationTests > testAccumulatingCombine FAILED
    java.lang.RuntimeException at CombineTest.java:1443

org.apache.beam.sdk.transforms.ParDoTest$TimerFamilyTests > testTimerFamilyAndTimerBounded FAILED
    java.lang.RuntimeException at ParDoTest.java:5744

org.apache.beam.sdk.transforms.CombineTest$AccumulationTests > testAccumulatingCombineEmpty FAILED
    java.lang.RuntimeException at CombineTest.java:1452

org.apache.beam.sdk.transforms.ParDoTest$TimerFamilyTests > testTimerFamilyAndTimerUnbounded FAILED
    java.lang.RuntimeException at ParDoTest.java:5744

org.apache.beam.sdk.transforms.ParDoTest$TimerFamilyTests > testTimerFamilyEventTimeBounded FAILED
    java.lang.RuntimeException at ParDoTest.java:5621

org.apache.beam.sdk.transforms.ParDoTest$TimerFamilyTests > testTimerFamilyEventTimeUnbounded FAILED
    java.lang.RuntimeException at ParDoTest.java:5621

org.apache.beam.sdk.transforms.ParDoSchemaTest > testReadAndWrite FAILED
    java.lang.RuntimeException at ParDoSchemaTest.java:168

org.apache.beam.sdk.transforms.ParDoSchemaTest > testSchemasPassedThrough FAILED
    java.lang.RuntimeException at ParDoSchemaTest.java:438

org.apache.beam.sdk.transforms.ParDoSchemaTest > testSchemaFieldSelectionNested FAILED
    java.lang.RuntimeException at ParDoSchemaTest.java:651

org.apache.beam.sdk.transforms.ParDoSchemaTest > testSchemaFieldSelectionUnboxing FAILED
    java.lang.RuntimeException at ParDoSchemaTest.java:560

org.apache.beam.sdk.transforms.ParDoSchemaTest > testSchemaFieldDescriptorSelectionUnboxing FAILED
    java.lang.RuntimeException at ParDoSchemaTest.java:601

org.apache.beam.sdk.transforms.ParDoSchemaTest > testInferredSchemaPipeline FAILED
    java.lang.RuntimeException at ParDoSchemaTest.java:423

org.apache.beam.sdk.transforms.ParDoSchemaTest > testFieldAccessSchemaPipeline FAILED
    java.lang.RuntimeException at ParDoSchemaTest.java:345

org.apache.beam.sdk.transforms.ParDoSchemaTest > testSimpleSchemaPipeline FAILED
    java.lang.RuntimeException at ParDoSchemaTest.java:114

org.apache.beam.sdk.transforms.ParDoSchemaTest > testSchemaConversionPipeline FAILED
    java.lang.RuntimeException at ParDoSchemaTest.java:471

org.apache.beam.sdk.transforms.ParDoSchemaTest > testReadAndWriteWithSchemaRegistry FAILED
    java.lang.RuntimeException at ParDoSchemaTest.java:310

org.apache.beam.sdk.transforms.ParDoSchemaTest > testReadAndWriteMultiOutput FAILED
    java.lang.RuntimeException at ParDoSchemaTest.java:265

org.apache.beam.sdk.transforms.ParDoSchemaTest > testNestedSchema FAILED
    java.lang.RuntimeException at ParDoSchemaTest.java:510

org.apache.beam.sdk.transforms.ParDoTest$LifecycleTests > testWindowingInStartAndFinishBundle FAILED
    java.lang.RuntimeException at ParDoTest.java:1786

org.apache.beam.sdk.transforms.ParDoTest$LifecycleTests > testParDoWithErrorInStartBatch FAILED
    java.lang.AssertionError at MatcherAssert.java:18

org.apache.beam.sdk.transforms.ParDoTest$LifecycleTests > testParDoWithErrorInProcessElement FAILED
    java.lang.AssertionError at MatcherAssert.java:18

org.apache.beam.sdk.transforms.ParDoTest$LifecycleTests > testParDoWithErrorInFinishBatch FAILED
    java.lang.AssertionError at MatcherAssert.java:18

239 tests completed, 225 failed, 4 skipped

> Task :runners:google-cloud-dataflow-java:validatesRunnerV2TestStreaming FAILED

> Task :runners:google-cloud-dataflow-java:cleanUpDockerImages FAILED
ERROR: (gcloud.container.images.untag) Image could not be found: [us.gcr.io/apache-beam-testing/java-postcommit-it/java:20210802060103]

FAILURE: Build completed with 2 failures.

1: Task failed with an exception.
-----------
* What went wrong:
Execution failed for task ':runners:google-cloud-dataflow-java:validatesRunnerV2TestStreaming'.
> There were failing tests. See the report at: file://<https://ci-beam.apache.org/job/beam_PostCommit_Java_VR_Dataflow_V2_Streaming/ws/src/runners/google-cloud-dataflow-java/build/reports/tests/validatesRunnerV2TestStreaming/index.html>

* Try:
Run with --stacktrace option to get the stack trace. Run with --info or --debug option to get more log output. Run with --scan to get full insights.
==============================================================================

2: Task failed with an exception.
-----------
* Where:
Build file '<https://ci-beam.apache.org/job/beam_PostCommit_Java_VR_Dataflow_V2_Streaming/ws/src/runners/google-cloud-dataflow-java/build.gradle'> line: 281

* What went wrong:
Execution failed for task ':runners:google-cloud-dataflow-java:cleanUpDockerImages'.
> Process 'command 'gcloud'' finished with non-zero exit value 1

* Try:
Run with --stacktrace option to get the stack trace. Run with --info or --debug option to get more log output. Run with --scan to get full insights.
==============================================================================

* Get more help at https://help.gradle.org

Deprecated Gradle features were used in this build, making it incompatible with Gradle 7.0.
Use '--warning-mode all' to show the individual deprecation warnings.
See https://docs.gradle.org/6.8.3/userguide/command_line_interface.html#sec:command_line_warnings

BUILD FAILED in 4h 43m 18s
130 actionable tasks: 89 executed, 39 from cache, 2 up-to-date

Publishing build scan...
https://gradle.com/s/qosjby7nszrpm

Build step 'Invoke Gradle script' changed build result to FAILURE
Build step 'Invoke Gradle script' marked build as failure

---------------------------------------------------------------------
To unsubscribe, e-mail: builds-unsubscribe@beam.apache.org
For additional commands, e-mail: builds-help@beam.apache.org


Build failed in Jenkins: beam_PostCommit_Java_VR_Dataflow_V2_Streaming #1053

Posted by Apache Jenkins Server <je...@builds.apache.org>.
See <https://ci-beam.apache.org/job/beam_PostCommit_Java_VR_Dataflow_V2_Streaming/1053/display/redirect>

Changes:


------------------------------------------
[...truncated 96.69 KB...]
    'http', request, response, code, msg, hdrs)
  File "/usr/lib/python3.5/urllib/request.py", line 510, in error
    return self._call_chain(*args)
  File "/usr/lib/python3.5/urllib/request.py", line 444, in _call_chain
    result = func(*args)
  File "/usr/lib/python3.5/urllib/request.py", line 590, in http_error_default
    raise HTTPError(req.full_url, code, msg, hdrs, fp)
urllib.error.HTTPError: HTTP Error 500: Internal Server Error
ERROR:root:Invalid url for org.jacoco.ant-0.8.6: https://www.eclipse.org/legal/epl-2.0/. Retrying...
Traceback (most recent call last):
  File "<https://ci-beam.apache.org/job/beam_PostCommit_Java_VR_Dataflow_V2_Streaming/ws/src/sdks/java/container/license_scripts/pull_licenses_java.py",> line 53, in pull_from_url
    url_read = urlopen(url)
  File "/usr/lib/python3.5/urllib/request.py", line 163, in urlopen
    return opener.open(url, data, timeout)
  File "/usr/lib/python3.5/urllib/request.py", line 472, in open
    response = meth(req, response)
  File "/usr/lib/python3.5/urllib/request.py", line 582, in http_response
    'http', request, response, code, msg, hdrs)
  File "/usr/lib/python3.5/urllib/request.py", line 510, in error
    return self._call_chain(*args)
  File "/usr/lib/python3.5/urllib/request.py", line 444, in _call_chain
    result = func(*args)
  File "/usr/lib/python3.5/urllib/request.py", line 590, in http_error_default
    raise HTTPError(req.full_url, code, msg, hdrs, fp)
urllib.error.HTTPError: HTTP Error 500: Internal Server Error
ERROR:root:Invalid url for org.jacoco.ant-0.8.6: https://www.eclipse.org/legal/epl-2.0/ after 9 retries.
Traceback (most recent call last):
  File "<https://ci-beam.apache.org/job/beam_PostCommit_Java_VR_Dataflow_V2_Streaming/ws/src/sdks/java/container/license_scripts/pull_licenses_java.py",> line 53, in pull_from_url
    url_read = urlopen(url)
  File "/usr/lib/python3.5/urllib/request.py", line 163, in urlopen
    return opener.open(url, data, timeout)
  File "/usr/lib/python3.5/urllib/request.py", line 472, in open
    response = meth(req, response)
  File "/usr/lib/python3.5/urllib/request.py", line 582, in http_response
    'http', request, response, code, msg, hdrs)
  File "/usr/lib/python3.5/urllib/request.py", line 510, in error
    return self._call_chain(*args)
  File "/usr/lib/python3.5/urllib/request.py", line 444, in _call_chain
    result = func(*args)
  File "/usr/lib/python3.5/urllib/request.py", line 590, in http_error_default
    raise HTTPError(req.full_url, code, msg, hdrs, fp)
urllib.error.HTTPError: HTTP Error 500: Internal Server Error
ERROR:root:Invalid url for org.jacoco.core-0.8.6: https://www.eclipse.org/legal/epl-2.0/. Retrying...
Traceback (most recent call last):
  File "<https://ci-beam.apache.org/job/beam_PostCommit_Java_VR_Dataflow_V2_Streaming/ws/src/sdks/java/container/license_scripts/pull_licenses_java.py",> line 53, in pull_from_url
    url_read = urlopen(url)
  File "/usr/lib/python3.5/urllib/request.py", line 163, in urlopen
    return opener.open(url, data, timeout)
  File "/usr/lib/python3.5/urllib/request.py", line 472, in open
    response = meth(req, response)
  File "/usr/lib/python3.5/urllib/request.py", line 582, in http_response
    'http', request, response, code, msg, hdrs)
  File "/usr/lib/python3.5/urllib/request.py", line 510, in error
    return self._call_chain(*args)
  File "/usr/lib/python3.5/urllib/request.py", line 444, in _call_chain
    result = func(*args)
  File "/usr/lib/python3.5/urllib/request.py", line 590, in http_error_default
    raise HTTPError(req.full_url, code, msg, hdrs, fp)
urllib.error.HTTPError: HTTP Error 500: Internal Server Error
ERROR:root:Invalid url for org.jacoco.core-0.8.6: https://www.eclipse.org/legal/epl-2.0/. Retrying...

> Task :release:go-licenses:java:dockerRun
golang.org/x/sys,https://go.googlesource.com/sys/+/refs/heads/master/LICENSE,BSD-3-Clause
github.com/apache/beam/sdks/java/container,https://github.com/apache/beam/blob/master/LICENSE,Apache-2.0
github.com/golang/protobuf,https://github.com/golang/protobuf/blob/master/LICENSE,BSD-3-Clause
google.golang.org/protobuf,https://go.googlesource.com/protobuf/+/refs/heads/master/LICENSE,BSD-3-Clause
google.golang.org/genproto/googleapis/rpc/status,https://github.com/googleapis/go-genproto/blob/master/LICENSE,Apache-2.0
golang.org/x/text,https://go.googlesource.com/text/+/refs/heads/master/LICENSE,BSD-3-Clause
github.com/apache/beam/sdks/go/pkg/beam,https://github.com/apache/beam/blob/master/sdks/go/README.md,Apache-2.0
google.golang.org/grpc,https://github.com/grpc/grpc-go/blob/master/LICENSE,Apache-2.0
golang.org/x/net,https://go.googlesource.com/net/+/refs/heads/master/LICENSE,BSD-3-Clause
+ chmod -R a+w /output/licenses

> Task :release:go-licenses:java:createLicenses
> Task :sdks:java:container:java8:copyGolangLicenses

> Task :sdks:java:container:pullLicenses
Traceback (most recent call last):
  File "<https://ci-beam.apache.org/job/beam_PostCommit_Java_VR_Dataflow_V2_Streaming/ws/src/sdks/java/container/license_scripts/pull_licenses_java.py",> line 53, in pull_from_url
    url_read = urlopen(url)
  File "/usr/lib/python3.5/urllib/request.py", line 163, in urlopen
    return opener.open(url, data, timeout)
  File "/usr/lib/python3.5/urllib/request.py", line 472, in open
    response = meth(req, response)
  File "/usr/lib/python3.5/urllib/request.py", line 582, in http_response
    'http', request, response, code, msg, hdrs)
  File "/usr/lib/python3.5/urllib/request.py", line 510, in error
    return self._call_chain(*args)
  File "/usr/lib/python3.5/urllib/request.py", line 444, in _call_chain
    result = func(*args)
  File "/usr/lib/python3.5/urllib/request.py", line 590, in http_error_default
    raise HTTPError(req.full_url, code, msg, hdrs, fp)
urllib.error.HTTPError: HTTP Error 500: Internal Server Error
ERROR:root:Invalid url for org.jacoco.core-0.8.6: https://www.eclipse.org/legal/epl-2.0/. Retrying...
Traceback (most recent call last):
  File "<https://ci-beam.apache.org/job/beam_PostCommit_Java_VR_Dataflow_V2_Streaming/ws/src/sdks/java/container/license_scripts/pull_licenses_java.py",> line 53, in pull_from_url
    url_read = urlopen(url)
  File "/usr/lib/python3.5/urllib/request.py", line 163, in urlopen
    return opener.open(url, data, timeout)
  File "/usr/lib/python3.5/urllib/request.py", line 472, in open
    response = meth(req, response)
  File "/usr/lib/python3.5/urllib/request.py", line 582, in http_response
    'http', request, response, code, msg, hdrs)
  File "/usr/lib/python3.5/urllib/request.py", line 510, in error
    return self._call_chain(*args)
  File "/usr/lib/python3.5/urllib/request.py", line 444, in _call_chain
    result = func(*args)
  File "/usr/lib/python3.5/urllib/request.py", line 590, in http_error_default
    raise HTTPError(req.full_url, code, msg, hdrs, fp)
urllib.error.HTTPError: HTTP Error 500: Internal Server Error
ERROR:root:Invalid url for org.jacoco.core-0.8.6: https://www.eclipse.org/legal/epl-2.0/. Retrying...
Traceback (most recent call last):
  File "<https://ci-beam.apache.org/job/beam_PostCommit_Java_VR_Dataflow_V2_Streaming/ws/src/sdks/java/container/license_scripts/pull_licenses_java.py",> line 53, in pull_from_url
    url_read = urlopen(url)
  File "/usr/lib/python3.5/urllib/request.py", line 163, in urlopen
    return opener.open(url, data, timeout)
  File "/usr/lib/python3.5/urllib/request.py", line 472, in open
    response = meth(req, response)
  File "/usr/lib/python3.5/urllib/request.py", line 582, in http_response
    'http', request, response, code, msg, hdrs)
  File "/usr/lib/python3.5/urllib/request.py", line 510, in error
    return self._call_chain(*args)
  File "/usr/lib/python3.5/urllib/request.py", line 444, in _call_chain
    result = func(*args)
  File "/usr/lib/python3.5/urllib/request.py", line 590, in http_error_default
    raise HTTPError(req.full_url, code, msg, hdrs, fp)
urllib.error.HTTPError: HTTP Error 500: Internal Server Error
ERROR:root:Invalid url for org.jacoco.core-0.8.6: https://www.eclipse.org/legal/epl-2.0/. Retrying...
Traceback (most recent call last):
  File "<https://ci-beam.apache.org/job/beam_PostCommit_Java_VR_Dataflow_V2_Streaming/ws/src/sdks/java/container/license_scripts/pull_licenses_java.py",> line 53, in pull_from_url
    url_read = urlopen(url)
  File "/usr/lib/python3.5/urllib/request.py", line 163, in urlopen
    return opener.open(url, data, timeout)
  File "/usr/lib/python3.5/urllib/request.py", line 472, in open
    response = meth(req, response)
  File "/usr/lib/python3.5/urllib/request.py", line 582, in http_response
    'http', request, response, code, msg, hdrs)
  File "/usr/lib/python3.5/urllib/request.py", line 510, in error
    return self._call_chain(*args)
  File "/usr/lib/python3.5/urllib/request.py", line 444, in _call_chain
    result = func(*args)
  File "/usr/lib/python3.5/urllib/request.py", line 590, in http_error_default
    raise HTTPError(req.full_url, code, msg, hdrs, fp)
urllib.error.HTTPError: HTTP Error 500: Internal Server Error
ERROR:root:Invalid url for org.jacoco.core-0.8.6: https://www.eclipse.org/legal/epl-2.0/. Retrying...
Traceback (most recent call last):
  File "<https://ci-beam.apache.org/job/beam_PostCommit_Java_VR_Dataflow_V2_Streaming/ws/src/sdks/java/container/license_scripts/pull_licenses_java.py",> line 53, in pull_from_url
    url_read = urlopen(url)
  File "/usr/lib/python3.5/urllib/request.py", line 163, in urlopen
    return opener.open(url, data, timeout)
  File "/usr/lib/python3.5/urllib/request.py", line 472, in open
    response = meth(req, response)
  File "/usr/lib/python3.5/urllib/request.py", line 582, in http_response
    'http', request, response, code, msg, hdrs)
  File "/usr/lib/python3.5/urllib/request.py", line 510, in error
    return self._call_chain(*args)
  File "/usr/lib/python3.5/urllib/request.py", line 444, in _call_chain
    result = func(*args)
  File "/usr/lib/python3.5/urllib/request.py", line 590, in http_error_default
    raise HTTPError(req.full_url, code, msg, hdrs, fp)
urllib.error.HTTPError: HTTP Error 500: Internal Server Error
ERROR:root:Invalid url for org.jacoco.core-0.8.6: https://www.eclipse.org/legal/epl-2.0/. Retrying...
Traceback (most recent call last):
  File "<https://ci-beam.apache.org/job/beam_PostCommit_Java_VR_Dataflow_V2_Streaming/ws/src/sdks/java/container/license_scripts/pull_licenses_java.py",> line 53, in pull_from_url
    url_read = urlopen(url)
  File "/usr/lib/python3.5/urllib/request.py", line 163, in urlopen
    return opener.open(url, data, timeout)
  File "/usr/lib/python3.5/urllib/request.py", line 472, in open
    response = meth(req, response)
  File "/usr/lib/python3.5/urllib/request.py", line 582, in http_response
    'http', request, response, code, msg, hdrs)
  File "/usr/lib/python3.5/urllib/request.py", line 510, in error
    return self._call_chain(*args)
  File "/usr/lib/python3.5/urllib/request.py", line 444, in _call_chain
    result = func(*args)
  File "/usr/lib/python3.5/urllib/request.py", line 590, in http_error_default
    raise HTTPError(req.full_url, code, msg, hdrs, fp)
urllib.error.HTTPError: HTTP Error 500: Internal Server Error
ERROR:root:Invalid url for org.jacoco.core-0.8.6: https://www.eclipse.org/legal/epl-2.0/. Retrying...
Traceback (most recent call last):
  File "<https://ci-beam.apache.org/job/beam_PostCommit_Java_VR_Dataflow_V2_Streaming/ws/src/sdks/java/container/license_scripts/pull_licenses_java.py",> line 53, in pull_from_url
    url_read = urlopen(url)
  File "/usr/lib/python3.5/urllib/request.py", line 163, in urlopen
    return opener.open(url, data, timeout)
  File "/usr/lib/python3.5/urllib/request.py", line 472, in open
    response = meth(req, response)
  File "/usr/lib/python3.5/urllib/request.py", line 582, in http_response
    'http', request, response, code, msg, hdrs)
  File "/usr/lib/python3.5/urllib/request.py", line 510, in error
    return self._call_chain(*args)
  File "/usr/lib/python3.5/urllib/request.py", line 444, in _call_chain
    result = func(*args)
  File "/usr/lib/python3.5/urllib/request.py", line 590, in http_error_default
    raise HTTPError(req.full_url, code, msg, hdrs, fp)
urllib.error.HTTPError: HTTP Error 500: Internal Server Error
ERROR:root:Invalid url for org.jacoco.core-0.8.6: https://www.eclipse.org/legal/epl-2.0/ after 9 retries.
ERROR:root:['org.jacoco.report-0.8.6', 'org.jacoco.agent-0.8.6', 'org.jacoco.ant-0.8.6', 'org.jacoco.core-0.8.6']
ERROR:root:**************************************** Licenses were not able to be pulled automatically for some dependencies. Please search source code of the dependencies on the internet and add "license" and "notice" (if available) field to <https://ci-beam.apache.org/job/beam_PostCommit_Java_VR_Dataflow_V2_Streaming/ws/src/sdks/java/container/license_scripts/dep_urls_java.yaml> for each missing license. Dependency List: [org.jacoco.agent-0.8.6,org.jacoco.ant-0.8.6,org.jacoco.core-0.8.6,org.jacoco.report-0.8.6]
INFO:root:pull_licenses_java.py failed. It took 130.572729 seconds with 16 threads.
Traceback (most recent call last):
  File "<https://ci-beam.apache.org/job/beam_PostCommit_Java_VR_Dataflow_V2_Streaming/ws/src/sdks/java/container/license_scripts/pull_licenses_java.py",> line 315, in <module>
    error_msg)
RuntimeError: ('1 error(s) occurred.', ['**************************************** Licenses were not able to be pulled automatically for some dependencies. Please search source code of the dependencies on the internet and add "license" and "notice" (if available) field to <https://ci-beam.apache.org/job/beam_PostCommit_Java_VR_Dataflow_V2_Streaming/ws/src/sdks/java/container/license_scripts/dep_urls_java.yaml> for each missing license. Dependency List: [org.jacoco.agent-0.8.6,org.jacoco.ant-0.8.6,org.jacoco.core-0.8.6,org.jacoco.report-0.8.6]'])

> Task :sdks:java:container:pullLicenses FAILED

> Task :sdks:go:resolveBuildDependencies
Resolving google.golang.org/api: commit='0324d5e90dc7753607860272666845fad9ceb97e', urls=[https://code.googlesource.com/google-api-go-client]
Resolving google.golang.org/genproto: commit='4d944d34d83c502a5f761500a14d8842648415c3', urls=[https://github.com/google/go-genproto]
Resolving google.golang.org/grpc: commit='5e8f83304c0563d1ba74db05fee83d9c18ab9a58', urls=[https://github.com/grpc/grpc-go]
Resolving google.golang.org/protobuf: commit='d165be301fb1e13390ad453281ded24385fd8ebc', urls=[https://go.googlesource.com/protobuf]
Resolving cached github.com/etcd-io/etcd: commit='11214aa33bf5a47d3d9d8dafe0f6b97237dfe921', urls=[https://github.com/etcd-io/etcd.git, git@github.com:etcd-io/etcd.git]
Resolving cached github.com/etcd-io/etcd: commit='11214aa33bf5a47d3d9d8dafe0f6b97237dfe921', urls=[https://github.com/etcd-io/etcd.git, git@github.com:etcd-io/etcd.git]

> Task :sdks:go:installDependencies
> Task :sdks:go:buildLinuxAmd64
> Task :sdks:go:goBuild

> Task :sdks:java:container:resolveBuildDependencies
Resolving ./github.com/apache/beam/sdks/go@<https://ci-beam.apache.org/job/beam_PostCommit_Java_VR_Dataflow_V2_Streaming/ws/src/sdks/go>

> Task :sdks:java:container:installDependencies
> Task :sdks:java:container:buildLinuxAmd64
> Task :sdks:java:container:goBuild
> Task :sdks:java:container:java8:copySdkHarnessLauncher

FAILURE: Build failed with an exception.

* What went wrong:
Execution failed for task ':sdks:java:container:pullLicenses'.
> Process 'command './license_scripts/license_script.sh'' finished with non-zero exit value 1

* Try:
Run with --stacktrace option to get the stack trace. Run with --info or --debug option to get more log output. Run with --scan to get full insights.

* Get more help at https://help.gradle.org

Deprecated Gradle features were used in this build, making it incompatible with Gradle 7.0.
Use '--warning-mode all' to show the individual deprecation warnings.
See https://docs.gradle.org/6.8.3/userguide/command_line_interface.html#sec:command_line_warnings

BUILD FAILED in 7m 18s
125 actionable tasks: 84 executed, 39 from cache, 2 up-to-date

Publishing build scan...
https://gradle.com/s/axpbmvxeiyrks

Build step 'Invoke Gradle script' changed build result to FAILURE
Build step 'Invoke Gradle script' marked build as failure

---------------------------------------------------------------------
To unsubscribe, e-mail: builds-unsubscribe@beam.apache.org
For additional commands, e-mail: builds-help@beam.apache.org


Build failed in Jenkins: beam_PostCommit_Java_VR_Dataflow_V2_Streaming #1052

Posted by Apache Jenkins Server <je...@builds.apache.org>.
See <https://ci-beam.apache.org/job/beam_PostCommit_Java_VR_Dataflow_V2_Streaming/1052/display/redirect>

Changes:


------------------------------------------
[...truncated 106.10 KB...]
    result = func(*args)
  File "/usr/lib/python3.5/urllib/request.py", line 590, in http_error_default
    raise HTTPError(req.full_url, code, msg, hdrs, fp)
urllib.error.HTTPError: HTTP Error 404: Not Found
ERROR:root:Invalid url for org.jacoco.core-0.8.6: https://www.eclipse.org/legal/epl-2.0/. Retrying...
Traceback (most recent call last):
  File "<https://ci-beam.apache.org/job/beam_PostCommit_Java_VR_Dataflow_V2_Streaming/ws/src/sdks/java/container/license_scripts/pull_licenses_java.py",> line 53, in pull_from_url
    url_read = urlopen(url)
  File "/usr/lib/python3.5/urllib/request.py", line 163, in urlopen
    return opener.open(url, data, timeout)
  File "/usr/lib/python3.5/urllib/request.py", line 472, in open
    response = meth(req, response)
  File "/usr/lib/python3.5/urllib/request.py", line 582, in http_response
    'http', request, response, code, msg, hdrs)
  File "/usr/lib/python3.5/urllib/request.py", line 510, in error
    return self._call_chain(*args)
  File "/usr/lib/python3.5/urllib/request.py", line 444, in _call_chain
    result = func(*args)
  File "/usr/lib/python3.5/urllib/request.py", line 590, in http_error_default
    raise HTTPError(req.full_url, code, msg, hdrs, fp)
urllib.error.HTTPError: HTTP Error 404: Not Found
ERROR:root:Invalid url for org.jacoco.core-0.8.6: https://www.eclipse.org/legal/epl-2.0/. Retrying...
Traceback (most recent call last):
  File "<https://ci-beam.apache.org/job/beam_PostCommit_Java_VR_Dataflow_V2_Streaming/ws/src/sdks/java/container/license_scripts/pull_licenses_java.py",> line 53, in pull_from_url
    url_read = urlopen(url)
  File "/usr/lib/python3.5/urllib/request.py", line 163, in urlopen
    return opener.open(url, data, timeout)
  File "/usr/lib/python3.5/urllib/request.py", line 472, in open
    response = meth(req, response)
  File "/usr/lib/python3.5/urllib/request.py", line 582, in http_response
    'http', request, response, code, msg, hdrs)
  File "/usr/lib/python3.5/urllib/request.py", line 510, in error
    return self._call_chain(*args)
  File "/usr/lib/python3.5/urllib/request.py", line 444, in _call_chain
    result = func(*args)
  File "/usr/lib/python3.5/urllib/request.py", line 590, in http_error_default
    raise HTTPError(req.full_url, code, msg, hdrs, fp)
urllib.error.HTTPError: HTTP Error 404: Not Found
ERROR:root:Invalid url for org.jacoco.core-0.8.6: https://www.eclipse.org/legal/epl-2.0/. Retrying...
Traceback (most recent call last):
  File "<https://ci-beam.apache.org/job/beam_PostCommit_Java_VR_Dataflow_V2_Streaming/ws/src/sdks/java/container/license_scripts/pull_licenses_java.py",> line 53, in pull_from_url
    url_read = urlopen(url)
  File "/usr/lib/python3.5/urllib/request.py", line 163, in urlopen
    return opener.open(url, data, timeout)
  File "/usr/lib/python3.5/urllib/request.py", line 472, in open
    response = meth(req, response)
  File "/usr/lib/python3.5/urllib/request.py", line 582, in http_response
    'http', request, response, code, msg, hdrs)
  File "/usr/lib/python3.5/urllib/request.py", line 510, in error
    return self._call_chain(*args)
  File "/usr/lib/python3.5/urllib/request.py", line 444, in _call_chain
    result = func(*args)
  File "/usr/lib/python3.5/urllib/request.py", line 590, in http_error_default
    raise HTTPError(req.full_url, code, msg, hdrs, fp)
urllib.error.HTTPError: HTTP Error 404: Not Found
ERROR:root:Invalid url for org.jacoco.core-0.8.6: https://www.eclipse.org/legal/epl-2.0/. Retrying...
Traceback (most recent call last):
  File "<https://ci-beam.apache.org/job/beam_PostCommit_Java_VR_Dataflow_V2_Streaming/ws/src/sdks/java/container/license_scripts/pull_licenses_java.py",> line 53, in pull_from_url
    url_read = urlopen(url)
  File "/usr/lib/python3.5/urllib/request.py", line 163, in urlopen
    return opener.open(url, data, timeout)
  File "/usr/lib/python3.5/urllib/request.py", line 472, in open
    response = meth(req, response)
  File "/usr/lib/python3.5/urllib/request.py", line 582, in http_response
    'http', request, response, code, msg, hdrs)
  File "/usr/lib/python3.5/urllib/request.py", line 510, in error
    return self._call_chain(*args)
  File "/usr/lib/python3.5/urllib/request.py", line 444, in _call_chain
    result = func(*args)
  File "/usr/lib/python3.5/urllib/request.py", line 590, in http_error_default
    raise HTTPError(req.full_url, code, msg, hdrs, fp)
urllib.error.HTTPError: HTTP Error 404: Not Found
ERROR:root:Invalid url for org.jacoco.core-0.8.6: https://www.eclipse.org/legal/epl-2.0/. Retrying...
Traceback (most recent call last):
  File "<https://ci-beam.apache.org/job/beam_PostCommit_Java_VR_Dataflow_V2_Streaming/ws/src/sdks/java/container/license_scripts/pull_licenses_java.py",> line 53, in pull_from_url
    url_read = urlopen(url)
  File "/usr/lib/python3.5/urllib/request.py", line 163, in urlopen
    return opener.open(url, data, timeout)
  File "/usr/lib/python3.5/urllib/request.py", line 472, in open
    response = meth(req, response)
  File "/usr/lib/python3.5/urllib/request.py", line 582, in http_response
    'http', request, response, code, msg, hdrs)
  File "/usr/lib/python3.5/urllib/request.py", line 510, in error
    return self._call_chain(*args)
  File "/usr/lib/python3.5/urllib/request.py", line 444, in _call_chain
    result = func(*args)
  File "/usr/lib/python3.5/urllib/request.py", line 590, in http_error_default
    raise HTTPError(req.full_url, code, msg, hdrs, fp)
urllib.error.HTTPError: HTTP Error 404: Not Found
ERROR:root:Invalid url for org.jacoco.core-0.8.6: https://www.eclipse.org/legal/epl-2.0/ after 9 retries.

> Task :sdks:go:resolveBuildDependencies
Resolving google.golang.org/api: commit='0324d5e90dc7753607860272666845fad9ceb97e', urls=[https://code.googlesource.com/google-api-go-client]

> Task :sdks:java:container:pullLicenses
Traceback (most recent call last):
  File "<https://ci-beam.apache.org/job/beam_PostCommit_Java_VR_Dataflow_V2_Streaming/ws/src/sdks/java/container/license_scripts/pull_licenses_java.py",> line 53, in pull_from_url
    url_read = urlopen(url)
  File "/usr/lib/python3.5/urllib/request.py", line 163, in urlopen
    return opener.open(url, data, timeout)
  File "/usr/lib/python3.5/urllib/request.py", line 472, in open
    response = meth(req, response)
  File "/usr/lib/python3.5/urllib/request.py", line 582, in http_response
    'http', request, response, code, msg, hdrs)
  File "/usr/lib/python3.5/urllib/request.py", line 510, in error
    return self._call_chain(*args)
  File "/usr/lib/python3.5/urllib/request.py", line 444, in _call_chain
    result = func(*args)
  File "/usr/lib/python3.5/urllib/request.py", line 590, in http_error_default
    raise HTTPError(req.full_url, code, msg, hdrs, fp)
urllib.error.HTTPError: HTTP Error 404: Not Found
ERROR:root:Invalid url for junit-4.13.1: http://www.eclipse.org/legal/epl-v10.html. Retrying...
Traceback (most recent call last):
  File "<https://ci-beam.apache.org/job/beam_PostCommit_Java_VR_Dataflow_V2_Streaming/ws/src/sdks/java/container/license_scripts/pull_licenses_java.py",> line 53, in pull_from_url
    url_read = urlopen(url)
  File "/usr/lib/python3.5/urllib/request.py", line 163, in urlopen
    return opener.open(url, data, timeout)
  File "/usr/lib/python3.5/urllib/request.py", line 472, in open
    response = meth(req, response)
  File "/usr/lib/python3.5/urllib/request.py", line 582, in http_response
    'http', request, response, code, msg, hdrs)
  File "/usr/lib/python3.5/urllib/request.py", line 510, in error
    return self._call_chain(*args)
  File "/usr/lib/python3.5/urllib/request.py", line 444, in _call_chain
    result = func(*args)
  File "/usr/lib/python3.5/urllib/request.py", line 590, in http_error_default
    raise HTTPError(req.full_url, code, msg, hdrs, fp)
urllib.error.HTTPError: HTTP Error 404: Not Found
ERROR:root:Invalid url for junit-4.13.1: http://www.eclipse.org/legal/epl-v10.html. Retrying...
Traceback (most recent call last):
  File "<https://ci-beam.apache.org/job/beam_PostCommit_Java_VR_Dataflow_V2_Streaming/ws/src/sdks/java/container/license_scripts/pull_licenses_java.py",> line 53, in pull_from_url
    url_read = urlopen(url)
  File "/usr/lib/python3.5/urllib/request.py", line 163, in urlopen
    return opener.open(url, data, timeout)
  File "/usr/lib/python3.5/urllib/request.py", line 472, in open
    response = meth(req, response)
  File "/usr/lib/python3.5/urllib/request.py", line 582, in http_response
    'http', request, response, code, msg, hdrs)
  File "/usr/lib/python3.5/urllib/request.py", line 510, in error
    return self._call_chain(*args)
  File "/usr/lib/python3.5/urllib/request.py", line 444, in _call_chain
    result = func(*args)
  File "/usr/lib/python3.5/urllib/request.py", line 590, in http_error_default
    raise HTTPError(req.full_url, code, msg, hdrs, fp)
urllib.error.HTTPError: HTTP Error 404: Not Found
ERROR:root:Invalid url for junit-4.13.1: http://www.eclipse.org/legal/epl-v10.html. Retrying...
Traceback (most recent call last):
  File "<https://ci-beam.apache.org/job/beam_PostCommit_Java_VR_Dataflow_V2_Streaming/ws/src/sdks/java/container/license_scripts/pull_licenses_java.py",> line 53, in pull_from_url
    url_read = urlopen(url)
  File "/usr/lib/python3.5/urllib/request.py", line 163, in urlopen
    return opener.open(url, data, timeout)
  File "/usr/lib/python3.5/urllib/request.py", line 472, in open
    response = meth(req, response)
  File "/usr/lib/python3.5/urllib/request.py", line 582, in http_response
    'http', request, response, code, msg, hdrs)
  File "/usr/lib/python3.5/urllib/request.py", line 510, in error
    return self._call_chain(*args)
  File "/usr/lib/python3.5/urllib/request.py", line 444, in _call_chain
    result = func(*args)
  File "/usr/lib/python3.5/urllib/request.py", line 590, in http_error_default
    raise HTTPError(req.full_url, code, msg, hdrs, fp)
urllib.error.HTTPError: HTTP Error 404: Not Found
ERROR:root:Invalid url for junit-4.13.1: http://www.eclipse.org/legal/epl-v10.html. Retrying...
Traceback (most recent call last):
  File "<https://ci-beam.apache.org/job/beam_PostCommit_Java_VR_Dataflow_V2_Streaming/ws/src/sdks/java/container/license_scripts/pull_licenses_java.py",> line 53, in pull_from_url
    url_read = urlopen(url)
  File "/usr/lib/python3.5/urllib/request.py", line 163, in urlopen
    return opener.open(url, data, timeout)
  File "/usr/lib/python3.5/urllib/request.py", line 472, in open
    response = meth(req, response)
  File "/usr/lib/python3.5/urllib/request.py", line 582, in http_response
    'http', request, response, code, msg, hdrs)
  File "/usr/lib/python3.5/urllib/request.py", line 510, in error
    return self._call_chain(*args)
  File "/usr/lib/python3.5/urllib/request.py", line 444, in _call_chain
    result = func(*args)
  File "/usr/lib/python3.5/urllib/request.py", line 590, in http_error_default
    raise HTTPError(req.full_url, code, msg, hdrs, fp)
urllib.error.HTTPError: HTTP Error 404: Not Found
ERROR:root:Invalid url for junit-4.13.1: http://www.eclipse.org/legal/epl-v10.html. Retrying...
Traceback (most recent call last):
  File "<https://ci-beam.apache.org/job/beam_PostCommit_Java_VR_Dataflow_V2_Streaming/ws/src/sdks/java/container/license_scripts/pull_licenses_java.py",> line 53, in pull_from_url
    url_read = urlopen(url)
  File "/usr/lib/python3.5/urllib/request.py", line 163, in urlopen
    return opener.open(url, data, timeout)
  File "/usr/lib/python3.5/urllib/request.py", line 472, in open
    response = meth(req, response)
  File "/usr/lib/python3.5/urllib/request.py", line 582, in http_response
    'http', request, response, code, msg, hdrs)
  File "/usr/lib/python3.5/urllib/request.py", line 510, in error
    return self._call_chain(*args)
  File "/usr/lib/python3.5/urllib/request.py", line 444, in _call_chain
    result = func(*args)
  File "/usr/lib/python3.5/urllib/request.py", line 590, in http_error_default
    raise HTTPError(req.full_url, code, msg, hdrs, fp)
urllib.error.HTTPError: HTTP Error 404: Not Found
ERROR:root:Invalid url for junit-4.13.1: http://www.eclipse.org/legal/epl-v10.html after 9 retries.
ERROR:root:['org.jacoco.report-0.8.6', 'org.jacoco.agent-0.8.6', 'org.jacoco.ant-0.8.6', 'org.jacoco.core-0.8.6', 'junit-4.13.1']
ERROR:root:**************************************** Licenses were not able to be pulled automatically for some dependencies. Please search source code of the dependencies on the internet and add "license" and "notice" (if available) field to <https://ci-beam.apache.org/job/beam_PostCommit_Java_VR_Dataflow_V2_Streaming/ws/src/sdks/java/container/license_scripts/dep_urls_java.yaml> for each missing license. Dependency List: [junit-4.13.1,org.jacoco.agent-0.8.6,org.jacoco.ant-0.8.6,org.jacoco.core-0.8.6,org.jacoco.report-0.8.6]
INFO:root:pull_licenses_java.py failed. It took 267.085093 seconds with 16 threads.
Traceback (most recent call last):
  File "<https://ci-beam.apache.org/job/beam_PostCommit_Java_VR_Dataflow_V2_Streaming/ws/src/sdks/java/container/license_scripts/pull_licenses_java.py",> line 315, in <module>
    error_msg)
RuntimeError: ('1 error(s) occurred.', ['**************************************** Licenses were not able to be pulled automatically for some dependencies. Please search source code of the dependencies on the internet and add "license" and "notice" (if available) field to <https://ci-beam.apache.org/job/beam_PostCommit_Java_VR_Dataflow_V2_Streaming/ws/src/sdks/java/container/license_scripts/dep_urls_java.yaml> for each missing license. Dependency List: [junit-4.13.1,org.jacoco.agent-0.8.6,org.jacoco.ant-0.8.6,org.jacoco.core-0.8.6,org.jacoco.report-0.8.6]'])

> Task :sdks:java:container:pullLicenses FAILED

> Task :sdks:go:resolveBuildDependencies
Resolving google.golang.org/genproto: commit='4d944d34d83c502a5f761500a14d8842648415c3', urls=[https://github.com/google/go-genproto]
Resolving google.golang.org/grpc: commit='5e8f83304c0563d1ba74db05fee83d9c18ab9a58', urls=[https://github.com/grpc/grpc-go]
Resolving google.golang.org/protobuf: commit='d165be301fb1e13390ad453281ded24385fd8ebc', urls=[https://go.googlesource.com/protobuf]
Resolving cached github.com/etcd-io/etcd: commit='11214aa33bf5a47d3d9d8dafe0f6b97237dfe921', urls=[https://github.com/etcd-io/etcd.git, git@github.com:etcd-io/etcd.git]
Resolving cached github.com/etcd-io/etcd: commit='11214aa33bf5a47d3d9d8dafe0f6b97237dfe921', urls=[https://github.com/etcd-io/etcd.git, git@github.com:etcd-io/etcd.git]

> Task :sdks:go:installDependencies
> Task :sdks:go:buildLinuxAmd64
> Task :sdks:go:goBuild

> Task :sdks:java:container:resolveBuildDependencies
Resolving ./github.com/apache/beam/sdks/go@<https://ci-beam.apache.org/job/beam_PostCommit_Java_VR_Dataflow_V2_Streaming/ws/src/sdks/go>

> Task :sdks:java:container:installDependencies
> Task :sdks:java:container:buildLinuxAmd64
> Task :sdks:java:container:goBuild
> Task :sdks:java:container:java8:copySdkHarnessLauncher

FAILURE: Build failed with an exception.

* What went wrong:
Execution failed for task ':sdks:java:container:pullLicenses'.
> Process 'command './license_scripts/license_script.sh'' finished with non-zero exit value 1

* Try:
Run with --stacktrace option to get the stack trace. Run with --info or --debug option to get more log output. Run with --scan to get full insights.

* Get more help at https://help.gradle.org

Deprecated Gradle features were used in this build, making it incompatible with Gradle 7.0.
Use '--warning-mode all' to show the individual deprecation warnings.
See https://docs.gradle.org/6.8.3/userguide/command_line_interface.html#sec:command_line_warnings

BUILD FAILED in 10m 18s
125 actionable tasks: 84 executed, 39 from cache, 2 up-to-date

Publishing build scan...
https://gradle.com/s/7ciqt5oirr2xw

Build step 'Invoke Gradle script' changed build result to FAILURE
Build step 'Invoke Gradle script' marked build as failure

---------------------------------------------------------------------
To unsubscribe, e-mail: builds-unsubscribe@beam.apache.org
For additional commands, e-mail: builds-help@beam.apache.org