You are viewing a plain text version of this content. The canonical link for it is here.
Posted to dev@zookeeper.apache.org by Apache Jenkins Server <je...@builds.apache.org> on 2016/06/08 10:05:34 UTC
ZooKeeper_branch35_openjdk7 - Build # 110 - Still Failing
See https://builds.apache.org/job/ZooKeeper_branch35_openjdk7/110/
###################################################################################
########################## LAST 60 LINES OF THE CONSOLE ###########################
[...truncated 391959 lines...]
[junit] 2016-06-08 10:05:12,799 [myid:] - INFO [QuorumPeer[myid=5](plain=/127.0.0.1:27521)(secure=disabled):MBeanRegistry@128] - Unregister MBean [org.apache.ZooKeeperService:name0=ReplicatedServer_id5,name1=replica.4]
[junit] 2016-06-08 10:05:12,800 [myid:] - INFO [main:FourLetterWordMain@85] - connecting to 127.0.0.1 27509
[junit] 2016-06-08 10:05:12,800 [myid:] - INFO [main:QuorumUtil@243] - 127.0.0.1:27509 is no longer accepting client connections
[junit] 2016-06-08 10:05:12,800 [myid:] - INFO [main:FourLetterWordMain@85] - connecting to 127.0.0.1 27512
[junit] 2016-06-08 10:05:12,801 [myid:] - INFO [main:QuorumUtil@243] - 127.0.0.1:27512 is no longer accepting client connections
[junit] 2016-06-08 10:05:12,801 [myid:] - INFO [main:FourLetterWordMain@85] - connecting to 127.0.0.1 27515
[junit] 2016-06-08 10:05:12,801 [myid:] - INFO [main:QuorumUtil@243] - 127.0.0.1:27515 is no longer accepting client connections
[junit] 2016-06-08 10:05:12,801 [myid:] - INFO [main:FourLetterWordMain@85] - connecting to 127.0.0.1 27518
[junit] 2016-06-08 10:05:12,801 [myid:] - INFO [main:QuorumUtil@243] - 127.0.0.1:27518 is no longer accepting client connections
[junit] 2016-06-08 10:05:12,802 [myid:] - INFO [main:FourLetterWordMain@85] - connecting to 127.0.0.1 27521
[junit] 2016-06-08 10:05:12,802 [myid:] - INFO [main:QuorumUtil@243] - 127.0.0.1:27521 is no longer accepting client connections
[junit] 2016-06-08 10:05:12,803 [myid:] - INFO [main:ZKTestCase$1@65] - SUCCEEDED testRemoveOneAsynchronous
[junit] 2016-06-08 10:05:12,803 [myid:] - INFO [main:ZKTestCase$1@60] - FINISHED testRemoveOneAsynchronous
[junit] Tests run: 11, Failures: 0, Errors: 0, Skipped: 0, Time elapsed: 126.971 sec, Thread: 7, Class: org.apache.zookeeper.test.ReconfigTest
[junit] 2016-06-08 10:05:34,094 [myid:] - INFO [main:JUnit4ZKTestRunner$LoggedInvokeMethod@82] - Memory used 29316
[junit] 2016-06-08 10:05:34,095 [myid:] - INFO [main:JUnit4ZKTestRunner$LoggedInvokeMethod@87] - Number of threads 55
[junit] 2016-06-08 10:05:34,095 [myid:] - INFO [main:JUnit4ZKTestRunner$LoggedInvokeMethod@102] - FINISHED TEST METHOD testManyChildWatchersAutoReset
[junit] 2016-06-08 10:05:34,095 [myid:] - INFO [main:ClientBase@537] - tearDown starting
[junit] 2016-06-08 10:05:34,095 [myid:] - INFO [ProcessThread(sid:0 cport:16611)::PrepRequestProcessor@647] - Processed session termination for sessionid: 0x10088a9476e0000
[junit] 2016-06-08 10:05:34,103 [myid:] - INFO [main-EventThread:ClientCnxn$EventThread@513] - EventThread shut down for session: 0x10088a9476e0000
[junit] 2016-06-08 10:05:34,103 [myid:] - INFO [NIOWorkerThread-24:MBeanRegistry@128] - Unregister MBean [org.apache.ZooKeeperService:name0=StandaloneServer_port16611,name1=Connections,name2=127.0.0.1,name3=0x10088a9476e0000]
[junit] 2016-06-08 10:05:34,103 [myid:] - INFO [main:ZooKeeper@1313] - Session: 0x10088a9476e0000 closed
[junit] 2016-06-08 10:05:34,104 [myid:] - INFO [NIOWorkerThread-24:NIOServerCnxn@607] - Closed socket connection for client /127.0.0.1:52372 which had sessionid 0x10088a9476e0000
[junit] 2016-06-08 10:05:34,105 [myid:] - INFO [ProcessThread(sid:0 cport:16611)::PrepRequestProcessor@647] - Processed session termination for sessionid: 0x10088a9476e0001
[junit] 2016-06-08 10:05:34,111 [myid:] - INFO [main:ZooKeeper@1313] - Session: 0x10088a9476e0001 closed
[junit] 2016-06-08 10:05:34,111 [myid:] - INFO [main:ClientBase@507] - STOPPING server
[junit] 2016-06-08 10:05:34,111 [myid:] - INFO [NIOWorkerThread-25:MBeanRegistry@128] - Unregister MBean [org.apache.ZooKeeperService:name0=StandaloneServer_port16611,name1=Connections,name2=127.0.0.1,name3=0x10088a9476e0001]
[junit] 2016-06-08 10:05:34,112 [myid:] - INFO [ConnnectionExpirer:NIOServerCnxnFactory$ConnectionExpirerThread@583] - ConnnectionExpirerThread interrupted
[junit] 2016-06-08 10:05:34,111 [myid:] - INFO [main-EventThread:ClientCnxn$EventThread@513] - EventThread shut down for session: 0x10088a9476e0001
[junit] 2016-06-08 10:05:34,112 [myid:] - INFO [NIOWorkerThread-25:NIOServerCnxn@607] - Closed socket connection for client /127.0.0.1:52407 which had sessionid 0x10088a9476e0001
[junit] 2016-06-08 10:05:34,114 [myid:] - INFO [NIOServerCxnFactory.AcceptThread:0.0.0.0/0.0.0.0:16611:NIOServerCnxnFactory$AcceptThread@219] - accept thread exitted run method
[junit] 2016-06-08 10:05:34,115 [myid:] - INFO [NIOServerCxnFactory.SelectorThread-1:NIOServerCnxnFactory$SelectorThread@420] - selector thread exitted run method
[junit] 2016-06-08 10:05:34,115 [myid:] - INFO [NIOServerCxnFactory.SelectorThread-0:NIOServerCnxnFactory$SelectorThread@420] - selector thread exitted run method
[junit] 2016-06-08 10:05:34,116 [myid:] - INFO [main:ZooKeeperServer@498] - shutting down
[junit] 2016-06-08 10:05:34,116 [myid:] - INFO [main:SessionTrackerImpl@232] - Shutting down
[junit] 2016-06-08 10:05:34,116 [myid:] - INFO [main:PrepRequestProcessor@965] - Shutting down
[junit] 2016-06-08 10:05:34,116 [myid:] - INFO [main:SyncRequestProcessor@191] - Shutting down
[junit] 2016-06-08 10:05:34,116 [myid:] - INFO [ProcessThread(sid:0 cport:16611)::PrepRequestProcessor@154] - PrepRequestProcessor exited loop!
[junit] 2016-06-08 10:05:34,116 [myid:] - INFO [SyncThread:0:SyncRequestProcessor@169] - SyncRequestProcessor exited!
[junit] 2016-06-08 10:05:34,116 [myid:] - INFO [main:FinalRequestProcessor@479] - shutdown of request processor complete
[junit] 2016-06-08 10:05:34,117 [myid:] - INFO [main:MBeanRegistry@128] - Unregister MBean [org.apache.ZooKeeperService:name0=StandaloneServer_port16611,name1=InMemoryDataTree]
[junit] 2016-06-08 10:05:34,117 [myid:] - INFO [main:MBeanRegistry@128] - Unregister MBean [org.apache.ZooKeeperService:name0=StandaloneServer_port16611]
[junit] 2016-06-08 10:05:34,117 [myid:] - INFO [main:FourLetterWordMain@85] - connecting to 127.0.0.1 16611
[junit] 2016-06-08 10:05:34,118 [myid:] - INFO [main:JMXEnv@146] - ensureOnly:[]
[junit] 2016-06-08 10:05:34,123 [myid:] - INFO [main:ClientBase@562] - fdcount after test is: 57 at start it was 57
[junit] 2016-06-08 10:05:34,123 [myid:] - INFO [main:ZKTestCase$1@65] - SUCCEEDED testManyChildWatchersAutoReset
[junit] 2016-06-08 10:05:34,123 [myid:] - INFO [main:ZKTestCase$1@60] - FINISHED testManyChildWatchersAutoReset
[junit] Tests run: 4, Failures: 0, Errors: 0, Skipped: 0, Time elapsed: 371.955 sec, Thread: 3, Class: org.apache.zookeeper.test.DisconnectedWatcherTest
BUILD FAILED
/home/jenkins/jenkins-slave/workspace/ZooKeeper_branch35_openjdk7/branch-3.5/build.xml:1322: The following error occurred while executing this line:
/home/jenkins/jenkins-slave/workspace/ZooKeeper_branch35_openjdk7/branch-3.5/build.xml:1207: Tests failed!
Total time: 9 minutes 8 seconds
Build step 'Invoke Ant' marked build as failure
Archiving artifacts
Recording test results
Email was triggered for: Failure - Any
Sending email for trigger: Failure - Any
###################################################################################
############################## FAILED TESTS (if any) ##############################
3 tests failed.
FAILED: org.apache.zookeeper.test.FollowerResyncConcurrencyTest.testResyncBySnapThenDiffAfterFollowerCrashes
Error Message:
unable to create new native thread
Stack Trace:
java.lang.OutOfMemoryError: unable to create new native thread
at java.lang.Thread.start0(Native Method)
at java.lang.Thread.start(Thread.java:714)
at org.apache.zookeeper.server.NIOServerCnxnFactory.start(NIOServerCnxnFactory.java:735)
at org.apache.zookeeper.server.quorum.QuorumPeer.startServerCnxnFactory(QuorumPeer.java:1588)
at org.apache.zookeeper.server.quorum.QuorumPeer.start(QuorumPeer.java:751)
at org.apache.zookeeper.test.QuorumUtil.start(QuorumUtil.java:211)
at org.apache.zookeeper.test.QuorumUtil.restart(QuorumUtil.java:215)
at org.apache.zookeeper.test.FollowerResyncConcurrencyTest.followerResyncCrashTest(FollowerResyncConcurrencyTest.java:313)
at org.apache.zookeeper.test.FollowerResyncConcurrencyTest.testResyncBySnapThenDiffAfterFollowerCrashes(FollowerResyncConcurrencyTest.java:176)
at org.apache.zookeeper.JUnit4ZKTestRunner$LoggedInvokeMethod.evaluate(JUnit4ZKTestRunner.java:79)
FAILED: org.apache.zookeeper.test.FollowerResyncConcurrencyTest.testFollowerWatcherResync
Error Message:
java.rmi.ServerError: Error occurred in server thread; nested exception is:
java.lang.OutOfMemoryError: unable to create new native thread
Stack Trace:
java.lang.RuntimeException: java.rmi.ServerError: Error occurred in server thread; nested exception is:
java.lang.OutOfMemoryError: unable to create new native thread
at org.apache.zookeeper.test.QuorumUtil.<init>(QuorumUtil.java:122)
at org.apache.zookeeper.test.QuorumUtil.<init>(QuorumUtil.java:127)
at org.apache.zookeeper.test.FollowerResyncConcurrencyTest.testFollowerWatcherResync(FollowerResyncConcurrencyTest.java:713)
at org.apache.zookeeper.JUnit4ZKTestRunner$LoggedInvokeMethod.evaluate(JUnit4ZKTestRunner.java:79)
Caused by: java.rmi.ServerError: Error occurred in server thread; nested exception is:
java.lang.OutOfMemoryError: unable to create new native thread
at sun.rmi.server.UnicastServerRef.dispatch(UnicastServerRef.java:350)
at sun.rmi.transport.Transport$1.run(Transport.java:177)
at sun.rmi.transport.Transport$1.run(Transport.java:174)
at java.security.AccessController.doPrivileged(Native Method)
at sun.rmi.transport.Transport.serviceCall(Transport.java:173)
at sun.rmi.transport.tcp.TCPTransport.handleMessages(TCPTransport.java:556)
at sun.rmi.transport.tcp.TCPTransport$ConnectionHandler.run0(TCPTransport.java:811)
at sun.rmi.transport.tcp.TCPTransport$ConnectionHandler.run(TCPTransport.java:670)
at java.util.concurrent.ThreadPoolExecutor.runWorker(ThreadPoolExecutor.java:1145)
at java.util.concurrent.ThreadPoolExecutor$Worker.run(ThreadPoolExecutor.java:615)
at java.lang.Thread.run(Thread.java:745)
at sun.rmi.transport.StreamRemoteCall.exceptionReceivedFromServer(StreamRemoteCall.java:275)
at sun.rmi.transport.StreamRemoteCall.executeCall(StreamRemoteCall.java:252)
at sun.rmi.server.UnicastRef.invoke(UnicastRef.java:161)
at javax.management.remote.rmi.RMIServerImpl_Stub.newClient(Unknown Source)
at javax.management.remote.rmi.RMIConnector.getConnection(RMIConnector.java:2404)
at javax.management.remote.rmi.RMIConnector.connect(RMIConnector.java:308)
at javax.management.remote.JMXConnectorFactory.connect(JMXConnectorFactory.java:268)
at javax.management.remote.JMXConnectorFactory.connect(JMXConnectorFactory.java:227)
at org.apache.zookeeper.test.JMXEnv.setUp(JMXEnv.java:58)
at org.apache.zookeeper.test.QuorumUtil.<init>(QuorumUtil.java:90)
Caused by: java.lang.OutOfMemoryError: unable to create new native thread
at java.lang.Thread.start0(Native Method)
at java.lang.Thread.start(Thread.java:714)
at com.sun.jmx.remote.internal.ServerCommunicatorAdmin.<init>(ServerCommunicatorAdmin.java:50)
at javax.management.remote.rmi.RMIConnectionImpl$RMIServerCommunicatorAdmin.<init>(RMIConnectionImpl.java:1340)
at javax.management.remote.rmi.RMIConnectionImpl.<init>(RMIConnectionImpl.java:180)
at javax.management.remote.rmi.RMIJRMPServerImpl.makeClient(RMIJRMPServerImpl.java:172)
at javax.management.remote.rmi.RMIServerImpl.doNewClient(RMIServerImpl.java:250)
at javax.management.remote.rmi.RMIServerImpl.newClient(RMIServerImpl.java:199)
at sun.rmi.server.UnicastServerRef.dispatch(UnicastServerRef.java:322)
at sun.rmi.transport.Transport$1.run(Transport.java:177)
at sun.rmi.transport.Transport$1.run(Transport.java:174)
at java.security.AccessController.doPrivileged(Native Method)
at sun.rmi.transport.Transport.serviceCall(Transport.java:173)
at sun.rmi.transport.tcp.TCPTransport.handleMessages(TCPTransport.java:556)
at sun.rmi.transport.tcp.TCPTransport$ConnectionHandler.run0(TCPTransport.java:811)
at sun.rmi.transport.tcp.TCPTransport$ConnectionHandler.run(TCPTransport.java:670)
at java.util.concurrent.ThreadPoolExecutor.runWorker(ThreadPoolExecutor.java:1145)
at java.util.concurrent.ThreadPoolExecutor$Worker.run(ThreadPoolExecutor.java:615)
at java.lang.Thread.run(Thread.java:745)
FAILED: org.apache.zookeeper.test.ObserverTest.testObserver
Error Message:
waiting for server 2 being up
Stack Trace:
junit.framework.AssertionFailedError: waiting for server 2 being up
at org.apache.zookeeper.test.ObserverTest.testObserver(ObserverTest.java:147)
at org.apache.zookeeper.JUnit4ZKTestRunner$LoggedInvokeMethod.evaluate(JUnit4ZKTestRunner.java:79)
ZooKeeper_branch35_openjdk7 - Build # 113 - Still Failing
Posted by Apache Jenkins Server <je...@builds.apache.org>.
See https://builds.apache.org/job/ZooKeeper_branch35_openjdk7/113/
###################################################################################
########################## LAST 60 LINES OF THE CONSOLE ###########################
[...truncated 390584 lines...]
[exec] Log Message Received: [2016-06-11 10:05:53,426:24677(0x2ade0d98b540):ZOO_INFO@testLogCallbackInit@993: testLogCallbackInit #8]
[exec] Log Message Received: [2016-06-11 10:05:53,426:24677(0x2ade0d98b540):ZOO_INFO@testLogCallbackInit@993: testLogCallbackInit #9]
[exec] Log Message Received: [2016-06-11 10:05:53,426:24677(0x2ade0d98b540):ZOO_INFO@zookeeper_close@3257: Closing zookeeper sessionId=0x100988f2ed1000e to [127.0.0.1:22181]
[exec] ]
[exec] : elapsed 1001 : OK
[exec] Zookeeper_simpleSystem::testLogCallbackClearLog Message Received: [2016-06-11 10:05:53,427:24677(0x2ade0d98b540):ZOO_INFO@log_env@1027: Client environment:zookeeper.version=zookeeper C client 3.5.1]
[exec] Log Message Received: [2016-06-11 10:05:53,427:24677(0x2ade0d98b540):ZOO_INFO@log_env@1031: Client environment:host.name=penates.apache.org]
[exec] Log Message Received: [2016-06-11 10:05:53,427:24677(0x2ade0d98b540):ZOO_INFO@log_env@1038: Client environment:os.name=Linux]
[exec] Log Message Received: [2016-06-11 10:05:53,427:24677(0x2ade0d98b540):ZOO_INFO@log_env@1039: Client environment:os.arch=3.13.0-36-lowlatency]
[exec] Log Message Received: [2016-06-11 10:05:53,427:24677(0x2ade0d98b540):ZOO_INFO@log_env@1040: Client environment:os.version=#63-Ubuntu SMP PREEMPT Wed Sep 3 21:56:12 UTC 2014]
[exec] Log Message Received: [2016-06-11 10:05:53,427:24677(0x2ade0d98b540):ZOO_INFO@log_env@1048: Client environment:user.name=jenkins]
[exec] Log Message Received: [2016-06-11 10:05:53,427:24677(0x2ade0d98b540):ZOO_INFO@log_env@1056: Client environment:user.home=/home/jenkins]
[exec] Log Message Received: [2016-06-11 10:05:53,427:24677(0x2ade0d98b540):ZOO_INFO@log_env@1068: Client environment:user.dir=/home/jenkins/jenkins-slave/workspace/ZooKeeper_branch35_openjdk7/branch-3.5/build/test/test-cppunit]
[exec] Log Message Received: [2016-06-11 10:05:53,427:24677(0x2ade0d98b540):ZOO_INFO@zookeeper_init_internal@1111: Initiating client connection, host=127.0.0.1:22181 sessionTimeout=10000 watcher=0x45d2a0 sessionId=0 sessionPasswd=<null> context=0x7fff9c9e86f0 flags=0]
[exec] Log Message Received: [2016-06-11 10:05:53,427:24677(0x2ade0f9ea700):ZOO_INFO@check_events@2357: initiated connection to server [127.0.0.1:22181]]
[exec] Log Message Received: [2016-06-11 10:05:53,445:24677(0x2ade0f9ea700):ZOO_INFO@check_events@2409: session establishment complete on server [127.0.0.1:22181], sessionId=0x100988f2ed1000f, negotiated timeout=10000 ]
[exec] : elapsed 1001 : OK
[exec] Zookeeper_simpleSystem::testAsyncWatcherAutoReset ZooKeeper server started : elapsed 10543 : OK
[exec] Zookeeper_simpleSystem::testDeserializeString : elapsed 0 : OK
[exec] Zookeeper_simpleSystem::testFirstServerDown : elapsed 1000 : OK
[exec] Zookeeper_simpleSystem::testNullData : elapsed 1063 : OK
[exec] Zookeeper_simpleSystem::testIPV6 : elapsed 1011 : OK
[exec] Zookeeper_simpleSystem::testCreate : elapsed 1033 : OK
[exec] Zookeeper_simpleSystem::testPath : elapsed 1124 : OK
[exec] Zookeeper_simpleSystem::testPathValidation : elapsed 1525 : OK
[exec] Zookeeper_simpleSystem::testPing : elapsed 18200 : OK
[exec] Zookeeper_simpleSystem::testAcl : elapsed 1037 : OK
[exec] Zookeeper_simpleSystem::testChroot : elapsed 3102 : OK
[exec] Zookeeper_simpleSystem::testAuth ZooKeeper server started ZooKeeper server started : elapsed 31058 : OK
[exec] Zookeeper_simpleSystem::testHangingClient : elapsed 1043 : OK
[exec] Zookeeper_simpleSystem::testWatcherAutoResetWithGlobal ZooKeeper server started ZooKeeper server started ZooKeeper server started : elapsed 16326 : OK
[exec] Zookeeper_simpleSystem::testWatcherAutoResetWithLocal ZooKeeper server started ZooKeeper server started ZooKeeper server started : elapsed 16007 : OK
[exec] Zookeeper_simpleSystem::testGetChildren2 : elapsed 1096 : OK
[exec] Zookeeper_simpleSystem::testLastZxid : elapsed 4545 : OK
[exec] Zookeeper_simpleSystem::testRemoveWatchers ZooKeeper server started : elapsed 4618 : OK
[exec] Zookeeper_readOnly::testReadOnly : elapsed 4199 : OK
[exec] /home/jenkins/jenkins-slave/workspace/ZooKeeper_branch35_openjdk7/branch-3.5/src/c/tests/TestReconfig.cc:183: Assertion: equality assertion failed [Expected: 1, Actual : 0]
[exec] Failures !!!
[exec] Run: 72 Failure total: 1 Failures: 1 Errors: 0
[exec] FAIL: zktest-mt
[exec] ==========================================
[exec] 1 of 2 tests failed
[exec] Please report to user@zookeeper.apache.org
[exec] ==========================================
[exec] make[1]: Leaving directory `/home/jenkins/jenkins-slave/workspace/ZooKeeper_branch35_openjdk7/branch-3.5/build/test/test-cppunit'
[exec] make[1]: *** [check-TESTS] Error 1
[exec] make: *** [check-am] Error 2
BUILD FAILED
/home/jenkins/jenkins-slave/workspace/ZooKeeper_branch35_openjdk7/branch-3.5/build.xml:1322: The following error occurred while executing this line:
/home/jenkins/jenkins-slave/workspace/ZooKeeper_branch35_openjdk7/branch-3.5/build.xml:1282: The following error occurred while executing this line:
/home/jenkins/jenkins-slave/workspace/ZooKeeper_branch35_openjdk7/branch-3.5/build.xml:1292: exec returned: 2
Total time: 16 minutes 37 seconds
Build step 'Invoke Ant' marked build as failure
Archiving artifacts
Recording test results
Email was triggered for: Failure - Any
Sending email for trigger: Failure - Any
###################################################################################
############################## FAILED TESTS (if any) ##############################
All tests passed
ZooKeeper_branch35_openjdk7 - Build # 112 - Still Failing
Posted by Apache Jenkins Server <je...@builds.apache.org>.
See https://builds.apache.org/job/ZooKeeper_branch35_openjdk7/112/
###################################################################################
########################## LAST 60 LINES OF THE CONSOLE ###########################
[...truncated 363164 lines...]
[exec] Log Message Received: [2016-06-10 10:51:47,840:14750(0x2b69adc32540):ZOO_INFO@zookeeper_close@3257: Closing zookeeper sessionId=0x10000baab17000e to [127.0.0.1:22181]
[exec] ]
[exec] : elapsed 1001 : OK
[exec] Zookeeper_simpleSystem::testLogCallbackClearLog Message Received: [2016-06-10 10:51:47,840:14750(0x2b69adc32540):ZOO_INFO@log_env@1027: Client environment:zookeeper.version=zookeeper C client 3.5.1]
[exec] Log Message Received: [2016-06-10 10:51:47,840:14750(0x2b69adc32540):ZOO_INFO@log_env@1031: Client environment:host.name=jenkins-test-4b1]
[exec] Log Message Received: [2016-06-10 10:51:47,840:14750(0x2b69adc32540):ZOO_INFO@log_env@1038: Client environment:os.name=Linux]
[exec] Log Message Received: [2016-06-10 10:51:47,840:14750(0x2b69adc32540):ZOO_INFO@log_env@1039: Client environment:os.arch=3.13.0-30-generic]
[exec] Log Message Received: [2016-06-10 10:51:47,840:14750(0x2b69adc32540):ZOO_INFO@log_env@1040: Client environment:os.version=#54-Ubuntu SMP Mon Jun 9 22:45:01 UTC 2014]
[exec] Log Message Received: [2016-06-10 10:51:47,840:14750(0x2b69adc32540):ZOO_INFO@log_env@1048: Client environment:user.name=jenkins]
[exec] Log Message Received: [2016-06-10 10:51:47,841:14750(0x2b69adc32540):ZOO_INFO@log_env@1056: Client environment:user.home=/home/jenkins]
[exec] Log Message Received: [2016-06-10 10:51:47,841:14750(0x2b69adc32540):ZOO_INFO@log_env@1068: Client environment:user.dir=/home/jenkins/jenkins-slave/workspace/ZooKeeper_branch35_openjdk7/branch-3.5/build/test/test-cppunit]
[exec] Log Message Received: [2016-06-10 10:51:47,841:14750(0x2b69adc32540):ZOO_INFO@zookeeper_init_internal@1111: Initiating client connection, host=127.0.0.1:22181 sessionTimeout=10000 watcher=0x45d2a0 sessionId=0 sessionPasswd=<null> context=0x7fff2d25f440 flags=0]
[exec] Log Message Received: [2016-06-10 10:51:47,842:14750(0x2b69b02c0700):ZOO_INFO@check_events@2357: initiated connection to server [127.0.0.1:22181]]
[exec] Log Message Received: [2016-06-10 10:51:47,846:14750(0x2b69b02c0700):ZOO_INFO@check_events@2409: session establishment complete on server [127.0.0.1:22181], sessionId=0x10000baab17000f, negotiated timeout=10000 ]
[exec] : elapsed 1002 : OK
[exec] Zookeeper_simpleSystem::testAsyncWatcherAutoReset ZooKeeper server started : elapsed 11908 : OK
[exec] Zookeeper_simpleSystem::testDeserializeString : elapsed 0 : OK
[exec] Zookeeper_simpleSystem::testFirstServerDown : elapsed 1002 : OK
[exec] Zookeeper_simpleSystem::testNullData : elapsed 1044 : OK
[exec] Zookeeper_simpleSystem::testIPV6 : elapsed 1008 : OK
[exec] Zookeeper_simpleSystem::testCreate : elapsed 1013 : OK
[exec] Zookeeper_simpleSystem::testPath : elapsed 1025 : OK
[exec] Zookeeper_simpleSystem::testPathValidation : elapsed 1069 : OK
[exec] Zookeeper_simpleSystem::testPing : elapsed 17332 : OK
[exec] Zookeeper_simpleSystem::testAcl : elapsed 1024 : OK
[exec] Zookeeper_simpleSystem::testChroot : elapsed 3060 : OK
[exec] Zookeeper_simpleSystem::testAuth ZooKeeper server started ZooKeeper server started : elapsed 33227 : OK
[exec] Zookeeper_simpleSystem::testHangingClient : elapsed 1035 : OK
[exec] Zookeeper_simpleSystem::testWatcherAutoResetWithGlobal ZooKeeper server started ZooKeeper server started ZooKeeper server started : elapsed 19287 : OK
[exec] Zookeeper_simpleSystem::testWatcherAutoResetWithLocal ZooKeeper server started ZooKeeper server started ZooKeeper server started : elapsed 19433 : OK
[exec] Zookeeper_simpleSystem::testGetChildren2 : elapsed 1058 : OK
[exec] Zookeeper_simpleSystem::testLastZxid : elapsed 4524 : OK
[exec] Zookeeper_simpleSystem::testRemoveWatchers ZooKeeper server started : elapsed 5816 : OK
[exec] Zookeeper_readOnly::testReadOnly : elapsed 4450 : OK
[exec] /home/jenkins/jenkins-slave/workspace/ZooKeeper_branch35_openjdk7/branch-3.5/src/c/tests/TestReconfig.cc:183: Assertion: equality assertion failed [Expected: 1, Actual : 0]
[exec] Failures !!!
[exec] Run: 72 Failure total: 1 Failures: 1 Errors: 0
[exec] FAIL: zktest-mt
[exec] ==========================================
[exec] 1 of 2 tests failed
[exec] Please report to user@zookeeper.apache.org
[exec] ==========================================
[exec] make[1]: Leaving directory `/home/jenkins/jenkins-slave/workspace/ZooKeeper_branch35_openjdk7/branch-3.5/build/test/test-cppunit'
[exec] *** Error in `./zktest-mt': corrupted double-linked list: 0x000000000148c1b0 ***
[exec] /bin/bash: line 5: 14750 Aborted ZKROOT=/home/jenkins/jenkins-slave/workspace/ZooKeeper_branch35_openjdk7/branch-3.5/src/c/../.. CLASSPATH=$CLASSPATH:$CLOVER_HOME/lib/clover.jar ${dir}$tst
[exec] make[1]: *** [check-TESTS] Error 1
[exec] make: *** [check-am] Error 2
BUILD FAILED
/home/jenkins/jenkins-slave/workspace/ZooKeeper_branch35_openjdk7/branch-3.5/build.xml:1322: The following error occurred while executing this line:
/home/jenkins/jenkins-slave/workspace/ZooKeeper_branch35_openjdk7/branch-3.5/build.xml:1282: The following error occurred while executing this line:
/home/jenkins/jenkins-slave/workspace/ZooKeeper_branch35_openjdk7/branch-3.5/build.xml:1292: exec returned: 2
Total time: 57 minutes 12 seconds
Build step 'Invoke Ant' marked build as failure
Archiving artifacts
Recording test results
Email was triggered for: Failure - Any
Sending email for trigger: Failure - Any
###################################################################################
############################## FAILED TESTS (if any) ##############################
All tests passed
ZooKeeper_branch35_openjdk7 - Build # 111 - Still Failing
Posted by Apache Jenkins Server <je...@builds.apache.org>.
See https://builds.apache.org/job/ZooKeeper_branch35_openjdk7/111/
###################################################################################
########################## LAST 60 LINES OF THE CONSOLE ###########################
[...truncated 391304 lines...]
[exec] Log Message Received: [2016-06-09 10:12:13,941:13632(0x2ac0e269e540):ZOO_INFO@testLogCallbackInit@993: testLogCallbackInit #8]
[exec] Log Message Received: [2016-06-09 10:12:13,941:13632(0x2ac0e269e540):ZOO_INFO@testLogCallbackInit@993: testLogCallbackInit #9]
[exec] Log Message Received: [2016-06-09 10:12:13,945:13632(0x2ac0e269e540):ZOO_INFO@zookeeper_close@3257: Closing zookeeper sessionId=0x10039f1a211000e to [127.0.0.1:22181]
[exec] ]
[exec] : elapsed 1005 : OK
[exec] Zookeeper_simpleSystem::testLogCallbackClearLog Message Received: [2016-06-09 10:12:13,945:13632(0x2ac0e269e540):ZOO_INFO@log_env@1027: Client environment:zookeeper.version=zookeeper C client 3.5.1]
[exec] Log Message Received: [2016-06-09 10:12:13,945:13632(0x2ac0e269e540):ZOO_INFO@log_env@1031: Client environment:host.name=priapus.apache.org]
[exec] Log Message Received: [2016-06-09 10:12:13,945:13632(0x2ac0e269e540):ZOO_INFO@log_env@1038: Client environment:os.name=Linux]
[exec] Log Message Received: [2016-06-09 10:12:13,945:13632(0x2ac0e269e540):ZOO_INFO@log_env@1039: Client environment:os.arch=3.13.0-86-generic]
[exec] Log Message Received: [2016-06-09 10:12:13,945:13632(0x2ac0e269e540):ZOO_INFO@log_env@1040: Client environment:os.version=#131-Ubuntu SMP Thu May 12 23:33:13 UTC 2016]
[exec] Log Message Received: [2016-06-09 10:12:13,945:13632(0x2ac0e269e540):ZOO_INFO@log_env@1048: Client environment:user.name=jenkins]
[exec] Log Message Received: [2016-06-09 10:12:13,945:13632(0x2ac0e269e540):ZOO_INFO@log_env@1056: Client environment:user.home=/home/jenkins]
[exec] Log Message Received: [2016-06-09 10:12:13,945:13632(0x2ac0e269e540):ZOO_INFO@log_env@1068: Client environment:user.dir=/home/jenkins/jenkins-slave/workspace/ZooKeeper_branch35_openjdk7/branch-3.5/build/test/test-cppunit]
[exec] Log Message Received: [2016-06-09 10:12:13,945:13632(0x2ac0e269e540):ZOO_INFO@zookeeper_init_internal@1111: Initiating client connection, host=127.0.0.1:22181 sessionTimeout=10000 watcher=0x45d2a0 sessionId=0 sessionPasswd=<null> context=0x7ffdd62a5ac0 flags=0]
[exec] Log Message Received: [2016-06-09 10:12:13,948:13632(0x2ac0e46fb700):ZOO_INFO@check_events@2357: initiated connection to server [127.0.0.1:22181]]
[exec] Log Message Received: [2016-06-09 10:12:14,134:13632(0x2ac0e46fb700):ZOO_INFO@check_events@2409: session establishment complete on server [127.0.0.1:22181], sessionId=0x10039f1a211000f, negotiated timeout=10000 ]
[exec] : elapsed 1003 : OK
[exec] Zookeeper_simpleSystem::testAsyncWatcherAutoReset ZooKeeper server started : elapsed 11610 : OK
[exec] Zookeeper_simpleSystem::testDeserializeString : elapsed 0 : OK
[exec] Zookeeper_simpleSystem::testFirstServerDown : elapsed 1010 : OK
[exec] Zookeeper_simpleSystem::testNullData : elapsed 1172 : OK
[exec] Zookeeper_simpleSystem::testIPV6 : elapsed 1016 : OK
[exec] Zookeeper_simpleSystem::testCreate : elapsed 1027 : OK
[exec] Zookeeper_simpleSystem::testPath : elapsed 1101 : OK
[exec] Zookeeper_simpleSystem::testPathValidation : elapsed 1222 : OK
[exec] Zookeeper_simpleSystem::testPing : elapsed 18685 : OK
[exec] Zookeeper_simpleSystem::testAcl : elapsed 1032 : OK
[exec] Zookeeper_simpleSystem::testChroot : elapsed 3207 : OK
[exec] Zookeeper_simpleSystem::testAuth ZooKeeper server started ZooKeeper server started : elapsed 32708 : OK
[exec] Zookeeper_simpleSystem::testHangingClient : elapsed 1092 : OK
[exec] Zookeeper_simpleSystem::testWatcherAutoResetWithGlobal ZooKeeper server started ZooKeeper server started ZooKeeper server started : elapsed 18695 : OK
[exec] Zookeeper_simpleSystem::testWatcherAutoResetWithLocal ZooKeeper server started ZooKeeper server started ZooKeeper server started : elapsed 18213 : OK
[exec] Zookeeper_simpleSystem::testGetChildren2 : elapsed 1114 : OK
[exec] Zookeeper_simpleSystem::testLastZxid : elapsed 4559 : OK
[exec] Zookeeper_simpleSystem::testRemoveWatchers ZooKeeper server started : elapsed 5453 : OK
[exec] Zookeeper_readOnly::testReadOnly : elapsed 4539 : OK
[exec] OK (72)
[exec] FAIL: zktest-mt
[exec] *** Error in `./zktest-mt': corrupted double-linked list: 0x0000000000e091b0 ***
[exec] /bin/bash: line 5: 13632 Aborted ZKROOT=/home/jenkins/jenkins-slave/workspace/ZooKeeper_branch35_openjdk7/branch-3.5/src/c/../.. CLASSPATH=$CLASSPATH:$CLOVER_HOME/lib/clover.jar ${dir}$tst
[exec] ==========================================
[exec] 1 of 2 tests failed
[exec] Please report to user@zookeeper.apache.org
[exec] ==========================================
[exec] make[1]: Leaving directory `/home/jenkins/jenkins-slave/workspace/ZooKeeper_branch35_openjdk7/branch-3.5/build/test/test-cppunit'
[exec] make[1]: *** [check-TESTS] Error 1
[exec] make: *** [check-am] Error 2
BUILD FAILED
/home/jenkins/jenkins-slave/workspace/ZooKeeper_branch35_openjdk7/branch-3.5/build.xml:1322: The following error occurred while executing this line:
/home/jenkins/jenkins-slave/workspace/ZooKeeper_branch35_openjdk7/branch-3.5/build.xml:1282: The following error occurred while executing this line:
/home/jenkins/jenkins-slave/workspace/ZooKeeper_branch35_openjdk7/branch-3.5/build.xml:1292: exec returned: 2
Total time: 17 minutes 57 seconds
Build step 'Invoke Ant' marked build as failure
Archiving artifacts
Recording test results
Email was triggered for: Failure - Any
Sending email for trigger: Failure - Any
###################################################################################
############################## FAILED TESTS (if any) ##############################
All tests passed