You are viewing a plain text version of this content. The canonical link for it is here.
Posted to builds@beam.apache.org by Apache Jenkins Server <je...@builds.apache.org> on 2020/12/23 11:42:23 UTC
Build failed in Jenkins: beam_PostRelease_NightlySnapshot #1218
See <https://ci-beam.apache.org/job/beam_PostRelease_NightlySnapshot/1218/display/redirect?page=changes>
Changes:
[noreply] Fix regex in Kotlin MinimalWordCount example. (#13570)
[noreply] [BEAM-11456] Fix flaky table provider tests (Kafka and Pubsub) (#13542)
[noreply] [BEAM-10925] Convert ScalarFn to Method. (#13593)
[noreply] [BEAM-11415][BEAM-11416] Move Go ValidatesRunner tests and add filtering
------------------------------------------
[...truncated 698.71 KB...]
[INFO] Downloading from central: https://repo.maven.apache.org/maven2/asm/asm-util/3.2/asm-util-3.2.pom
[INFO] Downloaded from central: https://repo.maven.apache.org/maven2/asm/asm-util/3.2/asm-util-3.2.pom (409 B at 16 kB/s)
[INFO] Downloading from central: https://repo.maven.apache.org/maven2/asm/asm-analysis/3.2/asm-analysis-3.2.pom
[INFO] Downloaded from central: https://repo.maven.apache.org/maven2/asm/asm-analysis/3.2/asm-analysis-3.2.pom (417 B at 14 kB/s)
[INFO] Downloading from central: https://repo.maven.apache.org/maven2/org/beanshell/bsh/2.0b4/bsh-2.0b4.pom
[INFO] Downloaded from central: https://repo.maven.apache.org/maven2/org/beanshell/bsh/2.0b4/bsh-2.0b4.pom (1.2 kB at 44 kB/s)
[INFO] Downloading from central: https://repo.maven.apache.org/maven2/org/beanshell/beanshell/2.0b4/beanshell-2.0b4.pom
[INFO] Downloaded from central: https://repo.maven.apache.org/maven2/org/beanshell/beanshell/2.0b4/beanshell-2.0b4.pom (1.4 kB at 52 kB/s)
[INFO] Downloading from central: https://repo.maven.apache.org/maven2/org/apache/ant/ant/1.8.1/ant-1.8.1.pom
[INFO] Downloaded from central: https://repo.maven.apache.org/maven2/org/apache/ant/ant/1.8.1/ant-1.8.1.pom (8.8 kB at 326 kB/s)
[INFO] Downloading from central: https://repo.maven.apache.org/maven2/org/apache/ant/ant-parent/1.8.1/ant-parent-1.8.1.pom
[INFO] Downloaded from central: https://repo.maven.apache.org/maven2/org/apache/ant/ant-parent/1.8.1/ant-parent-1.8.1.pom (4.3 kB at 159 kB/s)
[INFO] Downloading from central: https://repo.maven.apache.org/maven2/org/apache/maven/archetype/archetype-catalog/3.2.0/archetype-catalog-3.2.0.jar
[INFO] Downloading from central: https://repo.maven.apache.org/maven2/org/apache/maven/archetype/archetype-descriptor/3.2.0/archetype-descriptor-3.2.0.jar
[INFO] Downloading from central: https://repo.maven.apache.org/maven2/org/apache/maven/archetype/archetype-common/3.2.0/archetype-common-3.2.0.jar
[INFO] Downloading from central: https://repo.maven.apache.org/maven2/org/apache/ivy/ivy/2.5.0/ivy-2.5.0.jar
[INFO] Downloading from central: https://repo.maven.apache.org/maven2/org/codehaus/groovy/groovy/2.4.16/groovy-2.4.16.jar
[INFO] Downloaded from central: https://repo.maven.apache.org/maven2/org/apache/maven/archetype/archetype-descriptor/3.2.0/archetype-descriptor-3.2.0.jar (24 kB at 816 kB/s)
[INFO] Downloaded from central: https://repo.maven.apache.org/maven2/org/apache/maven/archetype/archetype-catalog/3.2.0/archetype-catalog-3.2.0.jar (19 kB at 629 kB/s)
[INFO] Downloading from central: https://repo.maven.apache.org/maven2/net/sourceforge/jchardet/jchardet/1.0/jchardet-1.0.jar
[INFO] Downloading from central: https://repo.maven.apache.org/maven2/org/codehaus/plexus/plexus-component-annotations/2.0.0/plexus-component-annotations-2.0.0.jar
[INFO] Downloaded from central: https://repo.maven.apache.org/maven2/org/codehaus/plexus/plexus-component-annotations/2.0.0/plexus-component-annotations-2.0.0.jar (4.2 kB at 80 kB/s)
[INFO] Downloading from central: https://repo.maven.apache.org/maven2/org/jdom/jdom/1.1.3/jdom-1.1.3.jar
[INFO] Downloaded from central: https://repo.maven.apache.org/maven2/net/sourceforge/jchardet/jchardet/1.0/jchardet-1.0.jar (27 kB at 429 kB/s)
[INFO] Downloading from central: https://repo.maven.apache.org/maven2/org/apache/maven/maven-artifact/3.0/maven-artifact-3.0.jar
[INFO] Downloaded from central: https://repo.maven.apache.org/maven2/org/jdom/jdom/1.1.3/jdom-1.1.3.jar (151 kB at 1.8 MB/s)
[INFO] Downloading from central: https://repo.maven.apache.org/maven2/org/apache/maven/maven-settings-builder/3.0/maven-settings-builder-3.0.jar
[INFO] Downloaded from central: https://repo.maven.apache.org/maven2/org/apache/maven/maven-artifact/3.0/maven-artifact-3.0.jar (52 kB at 570 kB/s)
[INFO] Downloading from central: https://repo.maven.apache.org/maven2/commons-io/commons-io/2.6/commons-io-2.6.jar
[INFO] Downloaded from central: https://repo.maven.apache.org/maven2/org/apache/maven/archetype/archetype-common/3.2.0/archetype-common-3.2.0.jar (184 kB at 2.0 MB/s)
[INFO] Downloading from central: https://repo.maven.apache.org/maven2/org/codehaus/plexus/plexus-velocity/1.2/plexus-velocity-1.2.jar
[INFO] Downloaded from central: https://repo.maven.apache.org/maven2/org/apache/maven/maven-settings-builder/3.0/maven-settings-builder-3.0.jar (38 kB at 347 kB/s)
[INFO] Downloading from central: https://repo.maven.apache.org/maven2/org/apache/velocity/velocity/1.7/velocity-1.7.jar
[INFO] Downloaded from central: https://repo.maven.apache.org/maven2/org/codehaus/plexus/plexus-velocity/1.2/plexus-velocity-1.2.jar (8.1 kB at 67 kB/s)
[INFO] Downloading from central: https://repo.maven.apache.org/maven2/commons-lang/commons-lang/2.4/commons-lang-2.4.jar
[INFO] Downloaded from central: https://repo.maven.apache.org/maven2/commons-io/commons-io/2.6/commons-io-2.6.jar (215 kB at 1.5 MB/s)
[INFO] Downloading from central: https://repo.maven.apache.org/maven2/org/apache/maven/wagon/wagon-provider-api/3.3.3/wagon-provider-api-3.3.3.jar
[INFO] Downloaded from central: https://repo.maven.apache.org/maven2/org/apache/velocity/velocity/1.7/velocity-1.7.jar (450 kB at 3.0 MB/s)
[INFO] Downloading from central: https://repo.maven.apache.org/maven2/org/apache/maven/maven-archiver/3.5.0/maven-archiver-3.5.0.jar
[INFO] Downloaded from central: https://repo.maven.apache.org/maven2/commons-lang/commons-lang/2.4/commons-lang-2.4.jar (262 kB at 1.6 MB/s)
[INFO] Downloading from central: https://repo.maven.apache.org/maven2/org/apache/maven/shared/maven-shared-utils/3.2.1/maven-shared-utils-3.2.1.jar
[INFO] Downloaded from central: https://repo.maven.apache.org/maven2/org/apache/maven/maven-archiver/3.5.0/maven-archiver-3.5.0.jar (26 kB at 146 kB/s)
[INFO] Downloading from central: https://repo.maven.apache.org/maven2/org/codehaus/plexus/plexus-interpolation/1.25/plexus-interpolation-1.25.jar
[INFO] Downloaded from central: https://repo.maven.apache.org/maven2/org/apache/maven/wagon/wagon-provider-api/3.3.3/wagon-provider-api-3.3.3.jar (56 kB at 320 kB/s)
[INFO] Downloading from central: https://repo.maven.apache.org/maven2/org/codehaus/plexus/plexus-archiver/4.2.1/plexus-archiver-4.2.1.jar
[INFO] Downloaded from central: https://repo.maven.apache.org/maven2/org/apache/maven/shared/maven-shared-utils/3.2.1/maven-shared-utils-3.2.1.jar (167 kB at 825 kB/s)
[INFO] Downloading from central: https://repo.maven.apache.org/maven2/org/codehaus/plexus/plexus-io/3.2.0/plexus-io-3.2.0.jar
[INFO] Downloaded from central: https://repo.maven.apache.org/maven2/org/codehaus/plexus/plexus-archiver/4.2.1/plexus-archiver-4.2.1.jar (196 kB at 944 kB/s)
[INFO] Downloading from central: https://repo.maven.apache.org/maven2/org/apache/commons/commons-compress/1.19/commons-compress-1.19.jar
[INFO] Downloaded from central: https://repo.maven.apache.org/maven2/org/codehaus/plexus/plexus-interpolation/1.25/plexus-interpolation-1.25.jar (85 kB at 406 kB/s)
[INFO] Downloading from central: https://repo.maven.apache.org/maven2/org/iq80/snappy/snappy/0.4/snappy-0.4.jar
[INFO] Downloaded from central: https://repo.maven.apache.org/maven2/org/apache/ivy/ivy/2.5.0/ivy-2.5.0.jar (1.4 MB at 6.5 MB/s)
[INFO] Downloading from central: https://repo.maven.apache.org/maven2/org/tukaani/xz/1.8/xz-1.8.jar
[INFO] Downloaded from central: https://repo.maven.apache.org/maven2/org/codehaus/plexus/plexus-io/3.2.0/plexus-io-3.2.0.jar (76 kB at 324 kB/s)
[INFO] Downloading from central: https://repo.maven.apache.org/maven2/org/codehaus/plexus/plexus-utils/3.3.0/plexus-utils-3.3.0.jar
[INFO] Downloaded from central: https://repo.maven.apache.org/maven2/org/iq80/snappy/snappy/0.4/snappy-0.4.jar (58 kB at 242 kB/s)
[INFO] Downloading from central: https://repo.maven.apache.org/maven2/org/codehaus/plexus/plexus-interactivity-api/1.0/plexus-interactivity-api-1.0.jar
[INFO] Downloaded from central: https://repo.maven.apache.org/maven2/org/tukaani/xz/1.8/xz-1.8.jar (109 kB at 443 kB/s)
[INFO] Downloading from central: https://repo.maven.apache.org/maven2/org/codehaus/plexus/plexus-container-default/1.0-alpha-9-stable-1/plexus-container-default-1.0-alpha-9-stable-1.jar
[INFO] Downloaded from central: https://repo.maven.apache.org/maven2/org/apache/commons/commons-compress/1.19/commons-compress-1.19.jar (615 kB at 2.4 MB/s)
[INFO] Downloading from central: https://repo.maven.apache.org/maven2/junit/junit/4.13/junit-4.13.jar
[INFO] Downloaded from central: https://repo.maven.apache.org/maven2/org/codehaus/plexus/plexus-interactivity-api/1.0/plexus-interactivity-api-1.0.jar (9.8 kB at 37 kB/s)
[INFO] Downloading from central: https://repo.maven.apache.org/maven2/org/hamcrest/hamcrest-core/1.3/hamcrest-core-1.3.jar
[INFO] Downloaded from central: https://repo.maven.apache.org/maven2/org/codehaus/plexus/plexus-utils/3.3.0/plexus-utils-3.3.0.jar (263 kB at 954 kB/s)
[INFO] Downloading from central: https://repo.maven.apache.org/maven2/classworlds/classworlds/1.1-alpha-2/classworlds-1.1-alpha-2.jar
[INFO] Downloaded from central: https://repo.maven.apache.org/maven2/org/codehaus/plexus/plexus-container-default/1.0-alpha-9-stable-1/plexus-container-default-1.0-alpha-9-stable-1.jar (194 kB at 684 kB/s)
[INFO] Downloading from central: https://repo.maven.apache.org/maven2/org/apache/maven/maven-plugin-api/3.0/maven-plugin-api-3.0.jar
[INFO] Downloaded from central: https://repo.maven.apache.org/maven2/junit/junit/4.13/junit-4.13.jar (382 kB at 1.3 MB/s)
[INFO] Downloading from central: https://repo.maven.apache.org/maven2/org/sonatype/sisu/sisu-inject-plexus/1.4.2/sisu-inject-plexus-1.4.2.jar
[INFO] Downloaded from central: https://repo.maven.apache.org/maven2/org/hamcrest/hamcrest-core/1.3/hamcrest-core-1.3.jar (45 kB at 154 kB/s)
[INFO] Downloading from central: https://repo.maven.apache.org/maven2/org/sonatype/sisu/sisu-inject-bean/1.4.2/sisu-inject-bean-1.4.2.jar
[INFO] Downloaded from central: https://repo.maven.apache.org/maven2/classworlds/classworlds/1.1-alpha-2/classworlds-1.1-alpha-2.jar (38 kB at 123 kB/s)
[INFO] Downloading from central: https://repo.maven.apache.org/maven2/org/sonatype/sisu/sisu-guice/2.1.7/sisu-guice-2.1.7-noaop.jar
[INFO] Downloaded from central: https://repo.maven.apache.org/maven2/org/apache/maven/maven-plugin-api/3.0/maven-plugin-api-3.0.jar (49 kB at 157 kB/s)
[INFO] Downloading from central: https://repo.maven.apache.org/maven2/org/apache/maven/maven-core/3.0/maven-core-3.0.jar
[INFO] Downloaded from central: https://repo.maven.apache.org/maven2/org/sonatype/sisu/sisu-inject-plexus/1.4.2/sisu-inject-plexus-1.4.2.jar (202 kB at 628 kB/s)
[INFO] Downloading from central: https://repo.maven.apache.org/maven2/org/apache/maven/maven-repository-metadata/3.0/maven-repository-metadata-3.0.jar
[INFO] Downloaded from central: https://repo.maven.apache.org/maven2/org/sonatype/sisu/sisu-inject-bean/1.4.2/sisu-inject-bean-1.4.2.jar (153 kB at 459 kB/s)
[INFO] Downloading from central: https://repo.maven.apache.org/maven2/org/apache/maven/maven-model-builder/3.0/maven-model-builder-3.0.jar
[INFO] Downloaded from central: https://repo.maven.apache.org/maven2/org/apache/maven/maven-repository-metadata/3.0/maven-repository-metadata-3.0.jar (30 kB at 87 kB/s)
[INFO] Downloading from central: https://repo.maven.apache.org/maven2/org/apache/maven/maven-aether-provider/3.0/maven-aether-provider-3.0.jar
[INFO] Downloaded from central: https://repo.maven.apache.org/maven2/org/sonatype/sisu/sisu-guice/2.1.7/sisu-guice-2.1.7-noaop.jar (472 kB at 1.3 MB/s)
[INFO] Downloading from central: https://repo.maven.apache.org/maven2/org/sonatype/aether/aether-impl/1.7/aether-impl-1.7.jar
[INFO] Downloaded from central: https://repo.maven.apache.org/maven2/org/apache/maven/maven-core/3.0/maven-core-3.0.jar (527 kB at 1.4 MB/s)
[INFO] Downloading from central: https://repo.maven.apache.org/maven2/org/sonatype/aether/aether-spi/1.7/aether-spi-1.7.jar
[INFO] Downloaded from central: https://repo.maven.apache.org/maven2/org/apache/maven/maven-aether-provider/3.0/maven-aether-provider-3.0.jar (51 kB at 137 kB/s)
[INFO] Downloaded from central: https://repo.maven.apache.org/maven2/org/apache/maven/maven-model-builder/3.0/maven-model-builder-3.0.jar (148 kB at 394 kB/s)
[INFO] Downloading from central: https://repo.maven.apache.org/maven2/org/sonatype/aether/aether-api/1.7/aether-api-1.7.jar
[INFO] Downloading from central: https://repo.maven.apache.org/maven2/org/sonatype/aether/aether-util/1.7/aether-util-1.7.jar
[INFO] Downloaded from central: https://repo.maven.apache.org/maven2/org/sonatype/aether/aether-impl/1.7/aether-impl-1.7.jar (106 kB at 270 kB/s)
[INFO] Downloading from central: https://repo.maven.apache.org/maven2/org/codehaus/plexus/plexus-classworlds/2.2.3/plexus-classworlds-2.2.3.jar
[INFO] Downloaded from central: https://repo.maven.apache.org/maven2/org/sonatype/aether/aether-spi/1.7/aether-spi-1.7.jar (14 kB at 34 kB/s)
[INFO] Downloaded from central: https://repo.maven.apache.org/maven2/org/codehaus/groovy/groovy/2.4.16/groovy-2.4.16.jar (4.7 MB at 12 MB/s)
[INFO] Downloading from central: https://repo.maven.apache.org/maven2/org/sonatype/plexus/plexus-sec-dispatcher/1.3/plexus-sec-dispatcher-1.3.jar
[INFO] Downloading from central: https://repo.maven.apache.org/maven2/org/sonatype/plexus/plexus-cipher/1.4/plexus-cipher-1.4.jar
[INFO] Downloaded from central: https://repo.maven.apache.org/maven2/org/sonatype/aether/aether-util/1.7/aether-util-1.7.jar (108 kB at 266 kB/s)
[INFO] Downloading from central: https://repo.maven.apache.org/maven2/org/apache/maven/maven-model/3.0/maven-model-3.0.jar
[INFO] Downloaded from central: https://repo.maven.apache.org/maven2/org/sonatype/aether/aether-api/1.7/aether-api-1.7.jar (74 kB at 182 kB/s)
[INFO] Downloading from central: https://repo.maven.apache.org/maven2/org/apache/maven/maven-settings/3.0/maven-settings-3.0.jar
[INFO] Downloaded from central: https://repo.maven.apache.org/maven2/org/codehaus/plexus/plexus-classworlds/2.2.3/plexus-classworlds-2.2.3.jar (46 kB at 110 kB/s)
[INFO] Downloading from central: https://repo.maven.apache.org/maven2/org/apache/maven/shared/maven-invoker/3.0.1/maven-invoker-3.0.1.jar
[INFO] Downloaded from central: https://repo.maven.apache.org/maven2/org/sonatype/plexus/plexus-cipher/1.4/plexus-cipher-1.4.jar (13 kB at 31 kB/s)
[INFO] Downloaded from central: https://repo.maven.apache.org/maven2/org/sonatype/plexus/plexus-sec-dispatcher/1.3/plexus-sec-dispatcher-1.3.jar (29 kB at 66 kB/s)
[INFO] Downloading from central: https://repo.maven.apache.org/maven2/org/apache/maven/shared/maven-artifact-transfer/0.12.0/maven-artifact-transfer-0.12.0.jar
[INFO] Downloading from central: https://repo.maven.apache.org/maven2/org/apache/maven/shared/maven-common-artifact-filters/3.0.1/maven-common-artifact-filters-3.0.1.jar
[INFO] Downloaded from central: https://repo.maven.apache.org/maven2/org/apache/maven/maven-settings/3.0/maven-settings-3.0.jar (47 kB at 107 kB/s)
[INFO] Downloading from central: https://repo.maven.apache.org/maven2/commons-codec/commons-codec/1.11/commons-codec-1.11.jar
[INFO] Downloaded from central: https://repo.maven.apache.org/maven2/org/apache/maven/maven-model/3.0/maven-model-3.0.jar (165 kB at 368 kB/s)
[INFO] Downloading from central: https://repo.maven.apache.org/maven2/org/slf4j/slf4j-api/1.7.5/slf4j-api-1.7.5.jar
[INFO] Downloaded from central: https://repo.maven.apache.org/maven2/org/apache/maven/shared/maven-invoker/3.0.1/maven-invoker-3.0.1.jar (33 kB at 74 kB/s)
[INFO] Downloading from central: https://repo.maven.apache.org/maven2/commons-collections/commons-collections/3.2.1/commons-collections-3.2.1.jar
[INFO] Downloaded from central: https://repo.maven.apache.org/maven2/org/apache/maven/shared/maven-common-artifact-filters/3.0.1/maven-common-artifact-filters-3.0.1.jar (61 kB at 134 kB/s)
[INFO] Downloading from central: https://repo.maven.apache.org/maven2/org/apache/maven/shared/maven-script-interpreter/1.0/maven-script-interpreter-1.0.jar
[INFO] Downloaded from central: https://repo.maven.apache.org/maven2/org/apache/maven/shared/maven-artifact-transfer/0.12.0/maven-artifact-transfer-0.12.0.jar (120 kB at 260 kB/s)
[INFO] Downloading from central: https://repo.maven.apache.org/maven2/org/beanshell/bsh/2.0b4/bsh-2.0b4.jar
[INFO] Downloaded from central: https://repo.maven.apache.org/maven2/commons-codec/commons-codec/1.11/commons-codec-1.11.jar (335 kB at 711 kB/s)
[INFO] Downloading from central: https://repo.maven.apache.org/maven2/org/apache/ant/ant/1.8.1/ant-1.8.1.jar
[INFO] Downloaded from central: https://repo.maven.apache.org/maven2/org/slf4j/slf4j-api/1.7.5/slf4j-api-1.7.5.jar (26 kB at 55 kB/s)
[INFO] Downloaded from central: https://repo.maven.apache.org/maven2/org/apache/maven/shared/maven-script-interpreter/1.0/maven-script-interpreter-1.0.jar (21 kB at 43 kB/s)
[INFO] Downloaded from central: https://repo.maven.apache.org/maven2/org/beanshell/bsh/2.0b4/bsh-2.0b4.jar (282 kB at 560 kB/s)
[INFO] Downloaded from central: https://repo.maven.apache.org/maven2/commons-collections/commons-collections/3.2.1/commons-collections-3.2.1.jar (575 kB at 1.1 MB/s)
[INFO] Downloaded from central: https://repo.maven.apache.org/maven2/org/apache/ant/ant/1.8.1/ant-1.8.1.jar (1.5 MB at 2.6 MB/s)
[INFO] Generating project in Batch mode
[INFO] Archetype repository not defined. Using the one from [org.apache.beam:beam-sdks-java-maven-archetypes-examples:2.24.0] found in catalog remote
[INFO] Downloading from test.release: https://repository.apache.org/content/repositories/snapshots/org/apache/beam/beam-sdks-java-maven-archetypes-examples/2.28.0-SNAPSHOT/maven-metadata.xml
[INFO] Downloaded from test.release: https://repository.apache.org/content/repositories/snapshots/org/apache/beam/beam-sdks-java-maven-archetypes-examples/2.28.0-SNAPSHOT/maven-metadata.xml (1.7 kB at 2.7 kB/s)
[INFO] Downloading from test.release: https://repository.apache.org/content/repositories/snapshots/org/apache/beam/beam-sdks-java-maven-archetypes-examples/2.28.0-SNAPSHOT/beam-sdks-java-maven-archetypes-examples-2.28.0-20201223.070201-8.pom
[INFO] Downloaded from test.release: https://repository.apache.org/content/repositories/snapshots/org/apache/beam/beam-sdks-java-maven-archetypes-examples/2.28.0-SNAPSHOT/beam-sdks-java-maven-archetypes-examples-2.28.0-20201223.070201-8.pom (5.0 kB at 21 kB/s)
[INFO] Downloading from test.release: https://repository.apache.org/content/repositories/snapshots/org/apache/beam/beam-sdks-java-maven-archetypes-examples/2.28.0-SNAPSHOT/beam-sdks-java-maven-archetypes-examples-2.28.0-20201223.070201-8.jar
[INFO] Downloaded from test.release: https://repository.apache.org/content/repositories/snapshots/org/apache/beam/beam-sdks-java-maven-archetypes-examples/2.28.0-SNAPSHOT/beam-sdks-java-maven-archetypes-examples-2.28.0-20201223.070201-8.jar (218 kB at 322 kB/s)
[INFO] ----------------------------------------------------------------------------
[INFO] Using following parameters for creating project from Archetype: beam-sdks-java-maven-archetypes-examples:2.28.0-SNAPSHOT
[INFO] ----------------------------------------------------------------------------
[INFO] Parameter: groupId, Value: org.example
[INFO] Parameter: artifactId, Value: word-count-beam
[INFO] Parameter: version, Value: 0.1
[INFO] Parameter: package, Value: org.apache.beam.examples
[INFO] Parameter: packageInPathFormat, Value: org/apache/beam/examples
[INFO] Parameter: package, Value: org.apache.beam.examples
[INFO] Parameter: version, Value: 0.1
[INFO] Parameter: groupId, Value: org.example
[INFO] Parameter: targetPlatform, Value: 1.8
[INFO] Parameter: artifactId, Value: word-count-beam
[INFO] Project created from Archetype in dir: /tmp/groovy-generated-9185286951373823402-tmpdir/word-count-beam
[INFO] ------------------------------------------------------------------------
[INFO] BUILD SUCCESS
[INFO] ------------------------------------------------------------------------
[INFO] Total time: 9.527 s
[INFO] Finished at: 2020-12-23T11:39:37Z
[INFO] ------------------------------------------------------------------------
Verified [INFO] BUILD SUCCESS
cd word-count-beam
ls
pom.xml
src
Verified pom.xml
Verified src
ls src/main/java/org/apache/beam/examples/
common
complete
DebuggingWordCount.java
MinimalWordCount.java
subprocess
WindowedWordCount.java
WordCount.java
Verified WordCount.java
ls src/main/java/org/apache/beam/examples/complete/game/
GameStats.java
HourlyTeamScore.java
injector
LeaderBoard.java
StatefulTeamScore.java
UserScore.java
utils
Verified UserScore.java
**************************************
* Test: Runs the WordCount Code with Dataflow runner
**************************************
gsutil rm gs://temp-storage-for-release-validation-tests/nightly-snapshot-validation/count* || echo 'No files'
CommandException: No URLs matched: gs://temp-storage-for-release-validation-tests/nightly-snapshot-validation/count*
No files
mvn compile exec:java -q -Dexec.mainClass=org.apache.beam.examples.WordCount -Dexec.args="--runner=DataflowRunner --project=apache-beam-testing --region=us-central1 --gcpTempLocation=gs://temp-storage-for-release-validation-tests/nightly-snapshot-validation/tmp --output=gs://temp-storage-for-release-validation-tests/nightly-snapshot-validation/counts --inputFile=gs://apache-beam-samples/shakespeare/*" -Pdataflow-runner
Using maven /home/jenkins/tools/maven/apache-maven-3.5.4
[ERROR] Failed to execute goal on project word-count-beam: Could not resolve dependencies for project org.example:word-count-beam:jar:0.1: Failed to collect dependencies at org.apache.beam:beam-sdks-java-core:jar:2.28.0-SNAPSHOT -> org.apache.beam:beam-model-pipeline:jar:2.28.0-SNAPSHOT -> org.apache.beam:beam-vendor-grpc-1_26_0:jar:0.3: Failed to read artifact descriptor for org.apache.beam:beam-vendor-grpc-1_26_0:jar:0.3: Could not transfer artifact org.apache.beam:beam-vendor-grpc-1_26_0:pom:0.3 from/to central (https://repo.maven.apache.org/maven2): Connection reset -> [Help 1]
[ERROR]
[ERROR] To see the full stack trace of the errors, re-run Maven with the -e switch.
[ERROR] Re-run Maven using the -X switch to enable full debug logging.
[ERROR]
[ERROR] For more information about the errors and possible solutions, please read the following articles:
[ERROR] [Help 1] http://cwiki.apache.org/confluence/display/MAVEN/DependencyResolutionException
[ERROR] Failed to execute goal on project word-count-beam: Could not resolve dependencies for project org.example:word-count-beam:jar:0.1: Failed to collect dependencies at org.apache.beam:beam-sdks-java-core:jar:2.28.0-SNAPSHOT -> org.apache.beam:beam-model-pipeline:jar:2.28.0-SNAPSHOT -> org.apache.beam:beam-vendor-grpc-1_26_0:jar:0.3: Failed to read artifact descriptor for org.apache.beam:beam-vendor-grpc-1_26_0:jar:0.3: Could not transfer artifact org.apache.beam:beam-vendor-grpc-1_26_0:pom:0.3 from/to central (https://repo.maven.apache.org/maven2): Connection reset -> [Help 1]
[ERROR]
[ERROR] To see the full stack trace of the errors, re-run Maven with the -e switch.
[ERROR] Re-run Maven using the -X switch to enable full debug logging.
[ERROR]
[ERROR] For more information about the errors and possible solutions, please read the following articles:
[ERROR] [Help 1] http://cwiki.apache.org/confluence/display/MAVEN/DependencyResolutionException
[ERROR] Failed command
> Task :runners:google-cloud-dataflow-java:runQuickstartJavaDataflow FAILED
FAILURE: Build completed with 3 failures.
1: Task failed with an exception.
-----------
* What went wrong:
Execution failed for task ':runners:direct-java:runMobileGamingJavaDirect'.
> Process 'command '/usr/lib/jvm/java-8-openjdk-amd64/bin/java'' finished with non-zero exit value 1
* Try:
Run with --stacktrace option to get the stack trace. Run with --info or --debug option to get more log output. Run with --scan to get full insights.
==============================================================================
2: Task failed with an exception.
-----------
* What went wrong:
Execution failed for task ':runners:flink:1.10:runQuickstartJavaFlinkLocal'.
> Process 'command '/usr/lib/jvm/java-8-openjdk-amd64/bin/java'' finished with non-zero exit value 1
* Try:
Run with --stacktrace option to get the stack trace. Run with --info or --debug option to get more log output. Run with --scan to get full insights.
==============================================================================
3: Task failed with an exception.
-----------
* What went wrong:
Execution failed for task ':runners:google-cloud-dataflow-java:runQuickstartJavaDataflow'.
> Process 'command '/usr/lib/jvm/java-8-openjdk-amd64/bin/java'' finished with non-zero exit value 1
* Try:
Run with --stacktrace option to get the stack trace. Run with --info or --debug option to get more log output. Run with --scan to get full insights.
==============================================================================
* Get more help at https://help.gradle.org
Deprecated Gradle features were used in this build, making it incompatible with Gradle 7.0.
Use '--warning-mode all' to show the individual deprecation warnings.
See https://docs.gradle.org/6.7/userguide/command_line_interface.html#sec:command_line_warnings
BUILD FAILED in 42m 1s
8 actionable tasks: 7 executed, 1 from cache
Publishing build scan...
https://gradle.com/s/3deft5yz3huvu
Build step 'Invoke Gradle script' changed build result to FAILURE
Build step 'Invoke Gradle script' marked build as failure
---------------------------------------------------------------------
To unsubscribe, e-mail: builds-unsubscribe@beam.apache.org
For additional commands, e-mail: builds-help@beam.apache.org
Jenkins build is back to normal : beam_PostRelease_NightlySnapshot
#1221
Posted by Apache Jenkins Server <je...@builds.apache.org>.
See <https://ci-beam.apache.org/job/beam_PostRelease_NightlySnapshot/1221/display/redirect?page=changes>
---------------------------------------------------------------------
To unsubscribe, e-mail: builds-unsubscribe@beam.apache.org
For additional commands, e-mail: builds-help@beam.apache.org
Build failed in Jenkins: beam_PostRelease_NightlySnapshot #1220
Posted by Apache Jenkins Server <je...@builds.apache.org>.
See <https://ci-beam.apache.org/job/beam_PostRelease_NightlySnapshot/1220/display/redirect?page=changes>
Changes:
[noreply] Bump Gradle to 6.7.1
[anantd] [BEAM-11460] Implement reading unknown schema files for ParquetIO
[anantd] Update ParquertIO capability in CHANGES.md
[anantd] improve backward compatibility by creating separate `Parse<T>` and
[noreply] Fix review comments by @iemejia
[noreply] Make GenericRecordPassthroughFn singleton
[anantd] fix spotless Apply
[Brian Hulette] Remove usages of WriteStringsToPubSub in examples
[anantd] Move ParquetIO Changes to 2.28.0
[anantd] Make passthroughfunction singleton by making the class with private
------------------------------------------
[...truncated 593.51 KB...]
INFO: Total number of streaming insert requests: 2, P99: 420ms, P90: 416ms, P50: 60ms
Dec 25, 2020 11:19:09 AM org.apache.beam.sdk.io.gcp.bigquery.StreamingWriteFn logPercentiles
INFO: Total number of streaming insert requests: 2, P99: 440ms, P90: 436ms, P50: 60ms
Dec 25, 2020 11:19:09 AM org.apache.beam.sdk.io.gcp.bigquery.StreamingWriteFn logPercentiles
INFO: Total number of streaming insert requests: 2, P99: 420ms, P90: 416ms, P50: 60ms
Dec 25, 2020 11:19:09 AM org.apache.beam.sdk.io.gcp.bigquery.StreamingWriteFn logPercentiles
INFO: Total number of streaming insert requests: 2, P99: 420ms, P90: 416ms, P50: 60ms
Dec 25, 2020 11:19:09 AM org.apache.beam.sdk.io.gcp.bigquery.StreamingWriteFn logPercentiles
INFO: Total number of streaming insert requests: 2, P99: 440ms, P90: 436ms, P50: 60ms
Dec 25, 2020 11:19:09 AM org.apache.beam.sdk.io.gcp.bigquery.StreamingWriteFn logPercentiles
INFO: Total number of streaming insert requests: 2, P99: 460ms, P90: 456ms, P50: 80ms
Dec 25, 2020 11:19:09 AM org.apache.beam.sdk.io.gcp.bigquery.StreamingWriteFn logPercentiles
INFO: Total number of streaming insert requests: 2, P99: 420ms, P90: 416ms, P50: 80ms
Dec 25, 2020 11:19:09 AM org.apache.beam.sdk.io.gcp.bigquery.StreamingWriteFn logPercentiles
INFO: Total number of streaming insert requests: 2, P99: 420ms, P90: 416ms, P50: 80ms
Dec 25, 2020 11:19:09 AM org.apache.beam.sdk.io.gcp.bigquery.StreamingWriteFn logPercentiles
INFO: Total number of streaming insert requests: 2, P99: 420ms, P90: 416ms, P50: 100ms
Dec 25, 2020 11:19:09 AM org.apache.beam.sdk.io.gcp.bigquery.StreamingWriteFn logPercentiles
INFO: Total number of streaming insert requests: 2, P99: 400ms, P90: 396ms, P50: 80ms
Dec 25, 2020 11:19:16 AM org.apache.beam.sdk.io.gcp.bigquery.StreamingWriteFn logPercentiles
INFO: Total number of streaming insert requests: 2, P99: 420ms, P90: 416ms, P50: 80ms
..............................................................................................................................................................Introducing a parse error.
bq query SELECT table_id FROM beam_postrelease_mobile_gaming.__TABLES_SUMMARY__
Waiting on bqjob_r1d5aee7dc6a71328_0000017699a008de_1 ... (0s) Current status: RUNNING
Waiting on bqjob_r1d5aee7dc6a71328_0000017699a008de_1 ... (0s) Current status: DONE
+-----------------------------------+
| table_id |
+-----------------------------------+
| hourly_team_score_python_dataflow |
| hourly_team_score_python_direct |
| leaderboard_DataflowRunner_team |
| leaderboard_DataflowRunner_user |
| leaderboard_DirectRunner_team |
| leaderboard_DirectRunner_user |
+-----------------------------------+
bq query --batch "SELECT user FROM [apache-beam-testing:beam_postrelease_mobile_gaming.leaderboard_DirectRunner_user] LIMIT 10"
Waiting on bqjob_r65516c4b4248af76_0000017699a015e0_1 ... (0s) Current status: PENDING
Waiting on bqjob_r65516c4b4248af76_0000017699a015e0_1 ... (1s) Current status: PENDING
Waiting on bqjob_r65516c4b4248af76_0000017699a015e0_1 ... (2s) Current status: PENDING
Waiting on bqjob_r65516c4b4248af76_0000017699a015e0_1 ... (3s) Current status: PENDING
Waiting on bqjob_r65516c4b4248af76_0000017699a015e0_1 ... (4s) Current status: PENDING
Waiting on bqjob_r65516c4b4248af76_0000017699a015e0_1 ... (5s) Current status: PENDING
Waiting on bqjob_r65516c4b4248af76_0000017699a015e0_1 ... (6s) Current status: PENDING
Waiting on bqjob_r65516c4b4248af76_0000017699a015e0_1 ... (7s) Current status: PENDING
Waiting on bqjob_r65516c4b4248af76_0000017699a015e0_1 ... (8s) Current status: PENDING
Waiting on bqjob_r65516c4b4248af76_0000017699a015e0_1 ... (9s) Current status: PENDING
Waiting on bqjob_r65516c4b4248af76_0000017699a015e0_1 ... (10s) Current status: PENDING
Waiting on bqjob_r65516c4b4248af76_0000017699a015e0_1 ... (11s) Current status: PENDING
Waiting on bqjob_r65516c4b4248af76_0000017699a015e0_1 ... (12s) Current status: PENDING
Waiting on bqjob_r65516c4b4248af76_0000017699a015e0_1 ... (13s) Current status: PENDING
Waiting on bqjob_r65516c4b4248af76_0000017699a015e0_1 ... (14s) Current status: PENDING
Waiting on bqjob_r65516c4b4248af76_0000017699a015e0_1 ... (15s) Current status: PENDING
Waiting on bqjob_r65516c4b4248af76_0000017699a015e0_1 ... (16s) Current status: PENDING
Waiting on bqjob_r65516c4b4248af76_0000017699a015e0_1 ... (17s) Current status: PENDING
Waiting on bqjob_r65516c4b4248af76_0000017699a015e0_1 ... (18s) Current status: PENDING
Waiting on bqjob_r65516c4b4248af76_0000017699a015e0_1 ... (19s) Current status: PENDING
Waiting on bqjob_r65516c4b4248af76_0000017699a015e0_1 ... (20s) Current status: PENDING
Waiting on bqjob_r65516c4b4248af76_0000017699a015e0_1 ... (21s) Current status: PENDING
Waiting on bqjob_r65516c4b4248af76_0000017699a015e0_1 ... (22s) Current status: PENDING
Waiting on bqjob_r65516c4b4248af76_0000017699a015e0_1 ... (23s) Current status: PENDING
...............................................................................Introducing a parse error.
Waiting on bqjob_r65516c4b4248af76_0000017699a015e0_1 ... (24s) Current status: PENDING
Waiting on bqjob_r65516c4b4248af76_0000017699a015e0_1 ... (25s) Current status: PENDING
Waiting on bqjob_r65516c4b4248af76_0000017699a015e0_1 ... (26s) Current status: PENDING
Waiting on bqjob_r65516c4b4248af76_0000017699a015e0_1 ... (27s) Current status: PENDING
Waiting on bqjob_r65516c4b4248af76_0000017699a015e0_1 ... (28s) Current status: PENDING
Waiting on bqjob_r65516c4b4248af76_0000017699a015e0_1 ... (29s) Current status: PENDING
Waiting on bqjob_r65516c4b4248af76_0000017699a015e0_1 ... (30s) Current status: PENDING
Waiting on bqjob_r65516c4b4248af76_0000017699a015e0_1 ... (31s) Current status: PENDING
Waiting on bqjob_r65516c4b4248af76_0000017699a015e0_1 ... (32s) Current status: PENDING
Waiting on bqjob_r65516c4b4248af76_0000017699a015e0_1 ... (33s) Current status: PENDING
Waiting on bqjob_r65516c4b4248af76_0000017699a015e0_1 ... (34s) Current status: PENDING
Waiting on bqjob_r65516c4b4248af76_0000017699a015e0_1 ... (36s) Current status: PENDING
Waiting on bqjob_r65516c4b4248af76_0000017699a015e0_1 ... (37s) Current status: PENDING
Waiting on bqjob_r65516c4b4248af76_0000017699a015e0_1 ... (38s) Current status: PENDING
Waiting on bqjob_r65516c4b4248af76_0000017699a015e0_1 ... (39s) Current status: PENDING
Waiting on bqjob_r65516c4b4248af76_0000017699a015e0_1 ... (40s) Current status: PENDING
Waiting on bqjob_r65516c4b4248af76_0000017699a015e0_1 ... (41s) Current status: PENDING
Waiting on bqjob_r65516c4b4248af76_0000017699a015e0_1 ... (42s) Current status: PENDING
Waiting on bqjob_r65516c4b4248af76_0000017699a015e0_1 ... (43s) Current status: PENDING
Waiting on bqjob_r65516c4b4248af76_0000017699a015e0_1 ... (44s) Current status: PENDING
Waiting on bqjob_r65516c4b4248af76_0000017699a015e0_1 ... (45s) Current status: PENDING
Waiting on bqjob_r65516c4b4248af76_0000017699a015e0_1 ... (46s) Current status: PENDING
Waiting on bqjob_r65516c4b4248af76_0000017699a015e0_1 ... (47s) Current status: PENDING
Waiting on bqjob_r65516c4b4248af76_0000017699a015e0_1 ... (48s) Current status: PENDING
Waiting on bqjob_r65516c4b4248af76_0000017699a015e0_1 ... (49s) Current status: PENDING
Waiting on bqjob_r65516c4b4248af76_0000017699a015e0_1 ... (50s) Current status: PENDING
Waiting on bqjob_r65516c4b4248af76_0000017699a015e0_1 ... (51s) Current status: PENDING
Waiting on bqjob_r65516c4b4248af76_0000017699a015e0_1 ... (52s) Current status: PENDING
Waiting on bqjob_r65516c4b4248af76_0000017699a015e0_1 ... (53s) Current status: PENDING
Waiting on bqjob_r65516c4b4248af76_0000017699a015e0_1 ... (54s) Current status: PENDING
Waiting on bqjob_r65516c4b4248af76_0000017699a015e0_1 ... (55s) Current status: PENDING
Waiting on bqjob_r65516c4b4248af76_0000017699a015e0_1 ... (56s) Current status: PENDING
Waiting on bqjob_r65516c4b4248af76_0000017699a015e0_1 ... (57s) Current status: PENDING
Waiting on bqjob_r65516c4b4248af76_0000017699a015e0_1 ... (58s) Current status: PENDING
Waiting on bqjob_r65516c4b4248af76_0000017699a015e0_1 ... (59s) Current status: PENDING
Waiting on bqjob_r65516c4b4248af76_0000017699a015e0_1 ... (60s) Current status: PENDING
Waiting on bqjob_r65516c4b4248af76_0000017699a015e0_1 ... (61s) Current status: PENDING
Waiting on bqjob_r65516c4b4248af76_0000017699a015e0_1 ... (62s) Current status: PENDING
Waiting on bqjob_r65516c4b4248af76_0000017699a015e0_1 ... (63s) Current status: PENDING
Waiting on bqjob_r65516c4b4248af76_0000017699a015e0_1 ... (64s) Current status: PENDING
Waiting on bqjob_r65516c4b4248af76_0000017699a015e0_1 ... (65s) Current status: PENDING
Waiting on bqjob_r65516c4b4248af76_0000017699a015e0_1 ... (65s) Current status: DONE
+-------------------------+
| user |
+-------------------------+
| user15_BisqueQuokka |
| user11_BisqueQuokka |
| user14_ApricotDingo |
| user6_ArmyGreenCockatoo |
| user2_RubyDingo |
| user1_BananaEmu |
| user8_AliceBlueNumbat |
| user0_AliceBlueEchidna |
| Robot-1 |
| user4_BananaEmu |
+-------------------------+
Verified AliceBlue
**************************************
* SUCCESS: LeaderBoard successfully run on DirectRunner.
**************************************
[SUCCESS]
FAILURE: Build completed with 4 failures.
1: Task failed with an exception.
-----------
* What went wrong:
Execution failed for task ':runners:direct-java:runQuickstartJavaDirect'.
> Process 'command '/usr/lib/jvm/java-8-openjdk-amd64/bin/java'' finished with non-zero exit value 1
* Try:
Run with --stacktrace option to get the stack trace. Run with --info or --debug option to get more log output. Run with --scan to get full insights.
==============================================================================
2: Task failed with an exception.
-----------
* What went wrong:
Execution failed for task ':runners:google-cloud-dataflow-java:runMobileGamingJavaDataflow'.
> Process 'command '/usr/lib/jvm/java-8-openjdk-amd64/bin/java'' finished with non-zero exit value 1
* Try:
Run with --stacktrace option to get the stack trace. Run with --info or --debug option to get more log output. Run with --scan to get full insights.
==============================================================================
3: Task failed with an exception.
-----------
* What went wrong:
Execution failed for task ':runners:flink:1.10:runQuickstartJavaFlinkLocal'.
> Process 'command '/usr/lib/jvm/java-8-openjdk-amd64/bin/java'' finished with non-zero exit value 1
* Try:
Run with --stacktrace option to get the stack trace. Run with --info or --debug option to get more log output. Run with --scan to get full insights.
==============================================================================
4: Task failed with an exception.
-----------
* What went wrong:
Execution failed for task ':runners:twister2:runQuickstartJavaTwister2'.
> Process 'command '/usr/lib/jvm/java-8-openjdk-amd64/bin/java'' finished with non-zero exit value 1
* Try:
Run with --stacktrace option to get the stack trace. Run with --info or --debug option to get more log output. Run with --scan to get full insights.
==============================================================================
* Get more help at https://help.gradle.org
Deprecated Gradle features were used in this build, making it incompatible with Gradle 7.0.
Use '--warning-mode all' to show the individual deprecation warnings.
See https://docs.gradle.org/6.7.1/userguide/command_line_interface.html#sec:command_line_warnings
BUILD FAILED in 20m 23s
8 actionable tasks: 8 executed
Publishing build scan...
https://gradle.com/s/cokze4tpkybye
Build step 'Invoke Gradle script' changed build result to FAILURE
Build step 'Invoke Gradle script' marked build as failure
---------------------------------------------------------------------
To unsubscribe, e-mail: builds-unsubscribe@beam.apache.org
For additional commands, e-mail: builds-help@beam.apache.org
Build failed in Jenkins: beam_PostRelease_NightlySnapshot #1219
Posted by Apache Jenkins Server <je...@builds.apache.org>.
See <https://ci-beam.apache.org/job/beam_PostRelease_NightlySnapshot/1219/display/redirect?page=changes>
Changes:
[noreply] [BEAM-11515] Add check for missing authors, add missing authors (#13599)
[noreply] Add 2.28.0 section to CHANGES.md (#13610)
[noreply] [BEAM-11159] Use official GCP client in TestPubSubSignal (#13598)
[noreply] [BEAM-11515] Minor release guide updates (#13609)
[noreply] [BEAM-11522] Revert "Optimizes extract_output for 1 element accumulator
------------------------------------------
[...truncated 793.21 KB...]
+-----------------------------------+
| hourly_team_score_python_dataflow |
| hourly_team_score_python_direct |
| leaderboard_DataflowRunner_team |
| leaderboard_DirectRunner_team |
| leaderboard_DirectRunner_user |
+-----------------------------------+
Waiting for pipeline to produce more results...
............................................................................................................................................................................................................................................................................................................................................................................................................................................................................................................................................................................DELAY(453244, 1)
{timestamp_ms=1608809725000}
late data for: user11_AliceBlueCaneToad,AliceBlueCaneToad,1,1608809725000,2020-12-24 03:42:59.180
bq query SELECT table_id FROM beam_postrelease_mobile_gaming.__TABLES_SUMMARY__
Waiting on bqjob_r37d1f0deb65e590e_00000176948f9a6f_1 ... (0s) Current status: RUNNING
Waiting on bqjob_r37d1f0deb65e590e_00000176948f9a6f_1 ... (0s) Current status: DONE
+-----------------------------------+
| table_id |
+-----------------------------------+
| hourly_team_score_python_dataflow |
| hourly_team_score_python_direct |
| leaderboard_DataflowRunner_team |
| leaderboard_DirectRunner_team |
| leaderboard_DirectRunner_user |
+-----------------------------------+
Waiting for pipeline to produce more results...
bq query SELECT table_id FROM beam_postrelease_mobile_gaming.__TABLES_SUMMARY__
Waiting on bqjob_r404f5ef2455dc844_00000176949094bf_1 ... (0s) Current status: RUNNING
Waiting on bqjob_r404f5ef2455dc844_00000176949094bf_1 ... (0s) Current status: DONE
+-----------------------------------+
| table_id |
+-----------------------------------+
| hourly_team_score_python_dataflow |
| hourly_team_score_python_direct |
| leaderboard_DataflowRunner_team |
| leaderboard_DirectRunner_team |
| leaderboard_DirectRunner_user |
+-----------------------------------+
Waiting for pipeline to produce more results...
bq query SELECT table_id FROM beam_postrelease_mobile_gaming.__TABLES_SUMMARY__
Waiting on bqjob_r41376a0c335218c5_0000017694918c73_1 ... (0s) Current status: RUNNING
Waiting on bqjob_r41376a0c335218c5_0000017694918c73_1 ... (0s) Current status: DONE
+-----------------------------------+
| table_id |
+-----------------------------------+
| hourly_team_score_python_dataflow |
| hourly_team_score_python_direct |
| leaderboard_DataflowRunner_team |
| leaderboard_DataflowRunner_user |
| leaderboard_DirectRunner_team |
| leaderboard_DirectRunner_user |
+-----------------------------------+
bq query --batch "SELECT user FROM [apache-beam-testing:beam_postrelease_mobile_gaming.leaderboard_DataflowRunner_user] LIMIT 10"
Waiting on bqjob_r36f2dbce8f474fe_0000017694919afc_1 ... (0s) Current status: PENDING
Waiting on bqjob_r36f2dbce8f474fe_0000017694919afc_1 ... (1s) Current status: PENDING
Waiting on bqjob_r36f2dbce8f474fe_0000017694919afc_1 ... (2s) Current status: PENDING
Waiting on bqjob_r36f2dbce8f474fe_0000017694919afc_1 ... (3s) Current status: PENDING
Waiting on bqjob_r36f2dbce8f474fe_0000017694919afc_1 ... (4s) Current status: PENDING
Waiting on bqjob_r36f2dbce8f474fe_0000017694919afc_1 ... (5s) Current status: PENDING
Waiting on bqjob_r36f2dbce8f474fe_0000017694919afc_1 ... (6s) Current status: PENDING
Waiting on bqjob_r36f2dbce8f474fe_0000017694919afc_1 ... (7s) Current status: PENDING
Waiting on bqjob_r36f2dbce8f474fe_0000017694919afc_1 ... (8s) Current status: PENDING
Waiting on bqjob_r36f2dbce8f474fe_0000017694919afc_1 ... (9s) Current status: PENDING
Waiting on bqjob_r36f2dbce8f474fe_0000017694919afc_1 ... (10s) Current status: PENDING
Waiting on bqjob_r36f2dbce8f474fe_0000017694919afc_1 ... (11s) Current status: PENDING
Waiting on bqjob_r36f2dbce8f474fe_0000017694919afc_1 ... (12s) Current status: PENDING
Waiting on bqjob_r36f2dbce8f474fe_0000017694919afc_1 ... (13s) Current status: PENDING
Waiting on bqjob_r36f2dbce8f474fe_0000017694919afc_1 ... (14s) Current status: PENDING
Waiting on bqjob_r36f2dbce8f474fe_0000017694919afc_1 ... (15s) Current status: PENDING
Waiting on bqjob_r36f2dbce8f474fe_0000017694919afc_1 ... (16s) Current status: PENDING
Waiting on bqjob_r36f2dbce8f474fe_0000017694919afc_1 ... (17s) Current status: PENDING
Waiting on bqjob_r36f2dbce8f474fe_0000017694919afc_1 ... (18s) Current status: PENDING
Waiting on bqjob_r36f2dbce8f474fe_0000017694919afc_1 ... (19s) Current status: PENDING
Waiting on bqjob_r36f2dbce8f474fe_0000017694919afc_1 ... (20s) Current status: PENDING
Waiting on bqjob_r36f2dbce8f474fe_0000017694919afc_1 ... (21s) Current status: PENDING
Waiting on bqjob_r36f2dbce8f474fe_0000017694919afc_1 ... (22s) Current status: PENDING
Waiting on bqjob_r36f2dbce8f474fe_0000017694919afc_1 ... (23s) Current status: PENDING
Waiting on bqjob_r36f2dbce8f474fe_0000017694919afc_1 ... (24s) Current status: PENDING
Waiting on bqjob_r36f2dbce8f474fe_0000017694919afc_1 ... (25s) Current status: PENDING
Waiting on bqjob_r36f2dbce8f474fe_0000017694919afc_1 ... (26s) Current status: PENDING
Waiting on bqjob_r36f2dbce8f474fe_0000017694919afc_1 ... (27s) Current status: PENDING
Waiting on bqjob_r36f2dbce8f474fe_0000017694919afc_1 ... (28s) Current status: PENDING
Waiting on bqjob_r36f2dbce8f474fe_0000017694919afc_1 ... (29s) Current status: PENDING
Waiting on bqjob_r36f2dbce8f474fe_0000017694919afc_1 ... (30s) Current status: PENDING
Waiting on bqjob_r36f2dbce8f474fe_0000017694919afc_1 ... (31s) Current status: PENDING
Waiting on bqjob_r36f2dbce8f474fe_0000017694919afc_1 ... (32s) Current status: PENDING
Waiting on bqjob_r36f2dbce8f474fe_0000017694919afc_1 ... (33s) Current status: PENDING
Waiting on bqjob_r36f2dbce8f474fe_0000017694919afc_1 ... (35s) Current status: PENDING
Waiting on bqjob_r36f2dbce8f474fe_0000017694919afc_1 ... (36s) Current status: PENDING
Waiting on bqjob_r36f2dbce8f474fe_0000017694919afc_1 ... (37s) Current status: PENDING
Waiting on bqjob_r36f2dbce8f474fe_0000017694919afc_1 ... (38s) Current status: PENDING
Waiting on bqjob_r36f2dbce8f474fe_0000017694919afc_1 ... (39s) Current status: PENDING
Waiting on bqjob_r36f2dbce8f474fe_0000017694919afc_1 ... (40s) Current status: PENDING
Waiting on bqjob_r36f2dbce8f474fe_0000017694919afc_1 ... (41s) Current status: PENDING
Waiting on bqjob_r36f2dbce8f474fe_0000017694919afc_1 ... (42s) Current status: PENDING
Waiting on bqjob_r36f2dbce8f474fe_0000017694919afc_1 ... (43s) Current status: PENDING
Waiting on bqjob_r36f2dbce8f474fe_0000017694919afc_1 ... (44s) Current status: PENDING
Waiting on bqjob_r36f2dbce8f474fe_0000017694919afc_1 ... (45s) Current status: PENDING
Waiting on bqjob_r36f2dbce8f474fe_0000017694919afc_1 ... (46s) Current status: PENDING
Waiting on bqjob_r36f2dbce8f474fe_0000017694919afc_1 ... (47s) Current status: PENDING
Waiting on bqjob_r36f2dbce8f474fe_0000017694919afc_1 ... (48s) Current status: PENDING
Waiting on bqjob_r36f2dbce8f474fe_0000017694919afc_1 ... (49s) Current status: PENDING
Waiting on bqjob_r36f2dbce8f474fe_0000017694919afc_1 ... (50s) Current status: PENDING
Waiting on bqjob_r36f2dbce8f474fe_0000017694919afc_1 ... (51s) Current status: PENDING
Waiting on bqjob_r36f2dbce8f474fe_0000017694919afc_1 ... (52s) Current status: PENDING
Waiting on bqjob_r36f2dbce8f474fe_0000017694919afc_1 ... (53s) Current status: PENDING
Waiting on bqjob_r36f2dbce8f474fe_0000017694919afc_1 ... (54s) Current status: PENDING
Waiting on bqjob_r36f2dbce8f474fe_0000017694919afc_1 ... (55s) Current status: PENDING
Waiting on bqjob_r36f2dbce8f474fe_0000017694919afc_1 ... (56s) Current status: PENDING
Waiting on bqjob_r36f2dbce8f474fe_0000017694919afc_1 ... (57s) Current status: PENDING
Waiting on bqjob_r36f2dbce8f474fe_0000017694919afc_1 ... (58s) Current status: PENDING
Waiting on bqjob_r36f2dbce8f474fe_0000017694919afc_1 ... (59s) Current status: PENDING
Waiting on bqjob_r36f2dbce8f474fe_0000017694919afc_1 ... (60s) Current status: PENDING
Waiting on bqjob_r36f2dbce8f474fe_0000017694919afc_1 ... (61s) Current status: PENDING
Waiting on bqjob_r36f2dbce8f474fe_0000017694919afc_1 ... (62s) Current status: PENDING
Waiting on bqjob_r36f2dbce8f474fe_0000017694919afc_1 ... (63s) Current status: PENDING
Waiting on bqjob_r36f2dbce8f474fe_0000017694919afc_1 ... (64s) Current status: PENDING
Waiting on bqjob_r36f2dbce8f474fe_0000017694919afc_1 ... (65s) Current status: PENDING
Waiting on bqjob_r36f2dbce8f474fe_0000017694919afc_1 ... (65s) Current status: DONE
+---------------------------+
| user |
+---------------------------+
| user9_BeigeWallaby |
| user0_AndroidGreenWallaby |
| user0_AliceBlueKangaroo |
| user12_AmethystPossum |
| user4_AliceBlueKangaroo |
| user12_AuburnPossum |
| user4_BeigeWallaby |
| user1_BarnRedCaneToad |
| user17_ApricotMarmot |
| user0_AuburnKangaroo |
+---------------------------+
Verified AliceBlue
gcloud dataflow jobs cancel $(gcloud dataflow jobs list | grep leaderboard-validation-1608809569151-889 | grep Running | cut -d' ' -f1)
Cancelled job [2020-12-24_03_33_05-14800818979477878974]
**************************************
* SUCCESS: LeaderBoard successfully run on DataflowRunner. with Streaming Engine
**************************************
[SUCCESS]
FAILURE: Build completed with 2 failures.
1: Task failed with an exception.
-----------
* What went wrong:
Execution failed for task ':runners:direct-java:runQuickstartJavaDirect'.
> Process 'command '/usr/lib/jvm/java-8-openjdk-amd64/bin/java'' finished with non-zero exit value 1
* Try:
Run with --stacktrace option to get the stack trace. Run with --info or --debug option to get more log output. Run with --scan to get full insights.
==============================================================================
2: Task failed with an exception.
-----------
* What went wrong:
Execution failed for task ':runners:flink:1.10:runQuickstartJavaFlinkLocal'.
> Process 'command '/usr/lib/jvm/java-8-openjdk-amd64/bin/java'' finished with non-zero exit value 1
* Try:
Run with --stacktrace option to get the stack trace. Run with --info or --debug option to get more log output. Run with --scan to get full insights.
==============================================================================
* Get more help at https://help.gradle.org
Deprecated Gradle features were used in this build, making it incompatible with Gradle 7.0.
Use '--warning-mode all' to show the individual deprecation warnings.
See https://docs.gradle.org/6.7/userguide/command_line_interface.html#sec:command_line_warnings
BUILD FAILED in 46m 31s
8 actionable tasks: 7 executed, 1 from cache
Publishing build scan...
https://gradle.com/s/iw75lqub5hvbq
Build step 'Invoke Gradle script' changed build result to FAILURE
Build step 'Invoke Gradle script' marked build as failure
---------------------------------------------------------------------
To unsubscribe, e-mail: builds-unsubscribe@beam.apache.org
For additional commands, e-mail: builds-help@beam.apache.org