You are viewing a plain text version of this content. The canonical link for it is here.
Posted to commits@phoenix.apache.org by Apache Jenkins Server <je...@builds.apache.org> on 2015/11/11 04:37:59 UTC
Build failed in Jenkins: Phoenix | Master #947
See <https://builds.apache.org/job/Phoenix-master/947/changes>
Changes:
[jamestaylor] PHOENIX-2399 Server is sometimes unable to find Phoenix driver
------------------------------------------
[...truncated 7336 lines...]
Running org.apache.phoenix.end2end.ServerExceptionIT
Tests run: 1, Failures: 0, Errors: 0, Skipped: 0, Time elapsed: 6.343 sec - in org.apache.phoenix.end2end.ServerExceptionIT
Running org.apache.phoenix.end2end.CSVCommonsLoaderIT
Tests run: 13, Failures: 0, Errors: 0, Skipped: 0, Time elapsed: 61.429 sec - in org.apache.phoenix.end2end.index.ImmutableIndexIT
Running org.apache.phoenix.end2end.ReverseFunctionIT
Tests run: 16, Failures: 0, Errors: 0, Skipped: 0, Time elapsed: 49.931 sec - in org.apache.phoenix.end2end.CSVCommonsLoaderIT
Running org.apache.phoenix.end2end.GetSetByteBitFunctionEnd2EndIT
Tests run: 20, Failures: 0, Errors: 0, Skipped: 0, Time elapsed: 372.574 sec - in org.apache.phoenix.end2end.index.LocalIndexIT
Running org.apache.phoenix.end2end.ArrayAppendFunctionIT
Tests run: 5, Failures: 0, Errors: 0, Skipped: 0, Time elapsed: 9.647 sec - in org.apache.phoenix.end2end.ReverseFunctionIT
Running org.apache.phoenix.end2end.LnLogFunctionEnd2EndIT
Tests run: 1, Failures: 0, Errors: 0, Skipped: 0, Time elapsed: 9.329 sec - in org.apache.phoenix.end2end.GetSetByteBitFunctionEnd2EndIT
Running org.apache.phoenix.end2end.AutoCommitIT
Tests run: 1, Failures: 0, Errors: 0, Skipped: 0, Time elapsed: 6.372 sec - in org.apache.phoenix.end2end.AutoCommitIT
Running org.apache.phoenix.end2end.TenantIdTypeIT
Tests run: 1, Failures: 0, Errors: 0, Skipped: 0, Time elapsed: 18.686 sec - in org.apache.phoenix.end2end.LnLogFunctionEnd2EndIT
Running org.apache.phoenix.end2end.PowerFunctionEnd2EndIT
Tests run: 34, Failures: 0, Errors: 0, Skipped: 0, Time elapsed: 31.559 sec - in org.apache.phoenix.end2end.ArrayAppendFunctionIT
Running org.apache.phoenix.end2end.TenantSpecificViewIndexSaltedIT
Tests run: 1, Failures: 0, Errors: 0, Skipped: 0, Time elapsed: 14.658 sec - in org.apache.phoenix.end2end.PowerFunctionEnd2EndIT
Running org.apache.phoenix.end2end.DateTimeIT
Tests run: 4, Failures: 0, Errors: 0, Skipped: 0, Time elapsed: 26.162 sec - in org.apache.phoenix.end2end.TenantSpecificViewIndexSaltedIT
Running org.apache.phoenix.end2end.SpooledTmpFileDeleteIT
Tests run: 1, Failures: 0, Errors: 0, Skipped: 0, Time elapsed: 9.465 sec - in org.apache.phoenix.end2end.SpooledTmpFileDeleteIT
Running org.apache.phoenix.end2end.CbrtFunctionEnd2EndIT
Tests run: 19, Failures: 0, Errors: 0, Skipped: 0, Time elapsed: 30.297 sec - in org.apache.phoenix.end2end.DateTimeIT
Running org.apache.phoenix.end2end.DecodeFunctionIT
Tests run: 2, Failures: 0, Errors: 0, Skipped: 0, Time elapsed: 12.143 sec - in org.apache.phoenix.end2end.CbrtFunctionEnd2EndIT
Running org.apache.phoenix.end2end.ModulusExpressionIT
Tests run: 6, Failures: 0, Errors: 0, Skipped: 0, Time elapsed: 11.498 sec - in org.apache.phoenix.end2end.DecodeFunctionIT
Running org.apache.phoenix.end2end.OctetLengthFunctionEnd2EndIT
Tests run: 11, Failures: 0, Errors: 0, Skipped: 0, Time elapsed: 10.83 sec - in org.apache.phoenix.end2end.ModulusExpressionIT
Running org.apache.phoenix.end2end.LastValueFunctionIT
Tests run: 62, Failures: 0, Errors: 0, Skipped: 0, Time elapsed: 312.274 sec - in org.apache.phoenix.end2end.index.IndexExpressionIT
Running org.apache.phoenix.end2end.UpgradeIT
Tests run: 1, Failures: 0, Errors: 0, Skipped: 0, Time elapsed: 6.974 sec - in org.apache.phoenix.end2end.OctetLengthFunctionEnd2EndIT
Running org.apache.phoenix.end2end.FirstValueFunctionIT
Tests run: 7, Failures: 0, Errors: 0, Skipped: 0, Time elapsed: 12.121 sec - in org.apache.phoenix.end2end.FirstValueFunctionIT
Running org.apache.phoenix.end2end.DisableLocalIndexIT
Tests run: 16, Failures: 0, Errors: 0, Skipped: 0, Time elapsed: 229.698 sec - in org.apache.phoenix.end2end.index.LocalMutableIndexIT
Running org.apache.phoenix.end2end.HashJoinLocalIndexIT
Tests run: 11, Failures: 0, Errors: 0, Skipped: 0, Time elapsed: 17.857 sec - in org.apache.phoenix.end2end.LastValueFunctionIT
Running org.apache.phoenix.end2end.UpsertBigValuesIT
Tests run: 1, Failures: 0, Errors: 0, Skipped: 0, Time elapsed: 16.182 sec - in org.apache.phoenix.end2end.DisableLocalIndexIT
Running org.apache.phoenix.end2end.MD5FunctionIT
Tests run: 4, Failures: 0, Errors: 0, Skipped: 0, Time elapsed: 29.146 sec - in org.apache.phoenix.end2end.UpsertBigValuesIT
Running org.apache.phoenix.end2end.LpadFunctionIT
Tests run: 3, Failures: 0, Errors: 0, Skipped: 0, Time elapsed: 17.259 sec - in org.apache.phoenix.end2end.MD5FunctionIT
Running org.apache.phoenix.end2end.SignFunctionEnd2EndIT
Tests run: 1, Failures: 0, Errors: 0, Skipped: 0, Time elapsed: 48.966 sec - in org.apache.phoenix.end2end.HashJoinLocalIndexIT
Running org.apache.phoenix.end2end.SortOrderIT
Tests run: 2, Failures: 0, Errors: 0, Skipped: 0, Time elapsed: 18.88 sec - in org.apache.phoenix.end2end.SignFunctionEnd2EndIT
Running org.apache.phoenix.end2end.ArrayToStringFunctionIT
Tests run: 12, Failures: 0, Errors: 0, Skipped: 0, Time elapsed: 33.332 sec - in org.apache.phoenix.end2end.LpadFunctionIT
Running org.apache.phoenix.end2end.QueryExecWithoutSCNIT
Tests run: 1, Failures: 0, Errors: 0, Skipped: 0, Time elapsed: 11.376 sec - in org.apache.phoenix.end2end.QueryExecWithoutSCNIT
Running org.apache.phoenix.end2end.RegexpReplaceFunctionIT
Tests run: 6, Failures: 0, Errors: 0, Skipped: 0, Time elapsed: 95.515 sec - in org.apache.phoenix.end2end.UpgradeIT
Running org.apache.phoenix.end2end.DynamicFamilyIT
Tests run: 2, Failures: 0, Errors: 0, Skipped: 0, Time elapsed: 6.641 sec - in org.apache.phoenix.end2end.RegexpReplaceFunctionIT
Running org.apache.phoenix.end2end.RoundFloorCeilFunctionsEnd2EndIT
Tests run: 4, Failures: 0, Errors: 0, Skipped: 0, Time elapsed: 16.189 sec - in org.apache.phoenix.end2end.DynamicFamilyIT
Running org.apache.phoenix.end2end.DeleteIT
Tests run: 36, Failures: 0, Errors: 0, Skipped: 0, Time elapsed: 48.533 sec - in org.apache.phoenix.end2end.ArrayToStringFunctionIT
Running org.apache.phoenix.end2end.InListIT
Tests run: 31, Failures: 0, Errors: 0, Skipped: 0, Time elapsed: 26.744 sec - in org.apache.phoenix.end2end.RoundFloorCeilFunctionsEnd2EndIT
Running org.apache.phoenix.end2end.EvaluationOfORIT
Tests run: 15, Failures: 0, Errors: 0, Skipped: 0, Time elapsed: 204.89 sec - in org.apache.phoenix.end2end.TenantIdTypeIT
Running org.apache.phoenix.end2end.ReverseScanIT
Tests run: 2, Failures: 0, Errors: 0, Skipped: 0, Time elapsed: 6.641 sec - in org.apache.phoenix.end2end.EvaluationOfORIT
Running org.apache.phoenix.end2end.RTrimFunctionIT
Tests run: 2, Failures: 0, Errors: 0, Skipped: 0, Time elapsed: 6.893 sec - in org.apache.phoenix.end2end.RTrimFunctionIT
Running org.apache.phoenix.end2end.NthValueFunctionIT
Tests run: 3, Failures: 0, Errors: 0, Skipped: 0, Time elapsed: 17.482 sec - in org.apache.phoenix.end2end.ReverseScanIT
Running org.apache.phoenix.end2end.ReadOnlyIT
Tests run: 11, Failures: 0, Errors: 0, Skipped: 0, Time elapsed: 18.034 sec - in org.apache.phoenix.end2end.NthValueFunctionIT
Running org.apache.phoenix.end2end.ArrayPrependFunctionIT
Tests run: 1, Failures: 0, Errors: 0, Skipped: 0, Time elapsed: 13.553 sec - in org.apache.phoenix.end2end.ReadOnlyIT
Running org.apache.phoenix.end2end.ExecuteStatementsIT
Tests run: 22, Failures: 0, Errors: 0, Skipped: 0, Time elapsed: 70.285 sec - in org.apache.phoenix.end2end.DeleteIT
Running org.apache.phoenix.iterate.RoundRobinResultIteratorIT
Tests run: 2, Failures: 0, Errors: 0, Skipped: 0, Time elapsed: 34.404 sec - in org.apache.phoenix.end2end.ExecuteStatementsIT
Running org.apache.phoenix.iterate.PhoenixQueryTimeoutIT
Tests run: 34, Failures: 0, Errors: 0, Skipped: 0, Time elapsed: 36.923 sec - in org.apache.phoenix.end2end.ArrayPrependFunctionIT
Tests run: 2, Failures: 0, Errors: 0, Skipped: 0, Time elapsed: 8.886 sec - in org.apache.phoenix.iterate.PhoenixQueryTimeoutIT
Tests run: 45, Failures: 0, Errors: 0, Skipped: 0, Time elapsed: 142.772 sec - in org.apache.phoenix.end2end.SortOrderIT
Tests run: 9, Failures: 0, Errors: 0, Skipped: 0, Time elapsed: 97.209 sec - in org.apache.phoenix.iterate.RoundRobinResultIteratorIT
Tests run: 28, Failures: 0, Errors: 0, Skipped: 0, Time elapsed: 214.642 sec - in org.apache.phoenix.end2end.InListIT
Results :
Tests run: 1176, Failures: 0, Errors: 0, Skipped: 0
[INFO]
[INFO] --- maven-failsafe-plugin:2.19:integration-test (NeedTheirOwnClusterTests) @ phoenix-core ---
-------------------------------------------------------
T E S T S
-------------------------------------------------------
Running org.apache.phoenix.rpc.PhoenixClientRpcIT
Running org.apache.phoenix.rpc.PhoenixServerRpcIT
Running org.apache.phoenix.mapreduce.IndexToolIT
Running org.apache.phoenix.execute.PartialCommitIT
Tests run: 6, Failures: 0, Errors: 0, Skipped: 0, Time elapsed: 3.011 sec - in org.apache.phoenix.execute.PartialCommitIT
Tests run: 2, Failures: 0, Errors: 0, Skipped: 0, Time elapsed: 11.362 sec - in org.apache.phoenix.rpc.PhoenixClientRpcIT
Running org.apache.phoenix.mapreduce.CsvBulkLoadToolIT
Tests run: 2, Failures: 0, Errors: 0, Skipped: 0, Time elapsed: 21.127 sec - in org.apache.phoenix.rpc.PhoenixServerRpcIT
Running org.apache.phoenix.end2end.ConnectionUtilIT
Running org.apache.phoenix.end2end.ViewIT
Tests run: 5, Failures: 0, Errors: 5, Skipped: 0, Time elapsed: 32.461 sec <<< FAILURE! - in org.apache.phoenix.mapreduce.CsvBulkLoadToolIT
testBasicImport(org.apache.phoenix.mapreduce.CsvBulkLoadToolIT) Time elapsed: 4.564 sec <<< ERROR!
java.sql.SQLException: No suitable driver found for jdbc:phoenix:localhost:64380:/hbase;test=true;
at org.apache.phoenix.mapreduce.CsvBulkLoadToolIT.testBasicImport(CsvBulkLoadToolIT.java:104)
testImportWithLocalIndex(org.apache.phoenix.mapreduce.CsvBulkLoadToolIT) Time elapsed: 6.175 sec <<< ERROR!
java.sql.SQLException: No suitable driver found for jdbc:phoenix:localhost:64380:/hbase;test=true;
at org.apache.phoenix.mapreduce.CsvBulkLoadToolIT.testImportWithLocalIndex(CsvBulkLoadToolIT.java:220)
testFullOptionImport(org.apache.phoenix.mapreduce.CsvBulkLoadToolIT) Time elapsed: 2.894 sec <<< ERROR!
java.sql.SQLException: No suitable driver found for jdbc:phoenix:localhost:64380:/hbase;test=true;
at org.apache.phoenix.mapreduce.CsvBulkLoadToolIT.testFullOptionImport(CsvBulkLoadToolIT.java:141)
testImportWithIndex(org.apache.phoenix.mapreduce.CsvBulkLoadToolIT) Time elapsed: 7.467 sec <<< ERROR!
java.sql.SQLException: No suitable driver found for jdbc:phoenix:localhost:64380:/hbase;test=true;
at org.apache.phoenix.mapreduce.CsvBulkLoadToolIT.testImportWithIndex(CsvBulkLoadToolIT.java:183)
testImportOneIndexTable(org.apache.phoenix.mapreduce.CsvBulkLoadToolIT) Time elapsed: 4.444 sec <<< ERROR!
java.sql.SQLException: No suitable driver found for jdbc:phoenix:localhost:64380:/hbase;test=true;
at org.apache.phoenix.mapreduce.CsvBulkLoadToolIT.testImportOneIndexTable(CsvBulkLoadToolIT.java:261)
at org.apache.phoenix.mapreduce.CsvBulkLoadToolIT.testImportOneIndexTable(CsvBulkLoadToolIT.java:233)
Tests run: 1, Failures: 0, Errors: 0, Skipped: 0, Time elapsed: 28.703 sec - in org.apache.phoenix.end2end.ConnectionUtilIT
Running org.apache.phoenix.end2end.StatsCollectorIT
Running org.apache.phoenix.end2end.AlterTableIT
Tests run: 22, Failures: 0, Errors: 0, Skipped: 0, Time elapsed: 73.739 sec - in org.apache.phoenix.end2end.ViewIT
Running org.apache.phoenix.end2end.SaltedViewIT
Tests run: 4, Failures: 0, Errors: 0, Skipped: 0, Time elapsed: 69.947 sec - in org.apache.phoenix.end2end.StatsCollectorIT
Tests run: 2, Failures: 0, Errors: 0, Skipped: 0, Time elapsed: 24.497 sec - in org.apache.phoenix.end2end.SaltedViewIT
Running org.apache.phoenix.end2end.index.ImmutableIndexWithStatsIT
Running org.apache.phoenix.end2end.index.MutableIndexReplicationIT
Tests run: 1, Failures: 0, Errors: 0, Skipped: 0, Time elapsed: 12.694 sec - in org.apache.phoenix.end2end.index.ImmutableIndexWithStatsIT
Running org.apache.phoenix.end2end.index.MutableIndexFailureIT
Tests run: 1, Failures: 0, Errors: 0, Skipped: 0, Time elapsed: 41.377 sec - in org.apache.phoenix.end2end.index.MutableIndexReplicationIT
Running org.apache.phoenix.end2end.SpillableGroupByIT
Tests run: 3, Failures: 0, Errors: 0, Skipped: 2, Time elapsed: 54.44 sec - in org.apache.phoenix.end2end.index.MutableIndexFailureIT
Tests run: 1, Failures: 0, Errors: 0, Skipped: 0, Time elapsed: 14.992 sec - in org.apache.phoenix.end2end.SpillableGroupByIT
Running org.apache.phoenix.end2end.CountDistinctCompressionIT
Running org.apache.phoenix.end2end.KeyOnlyIT
Tests run: 1, Failures: 0, Errors: 0, Skipped: 0, Time elapsed: 11.885 sec - in org.apache.phoenix.end2end.CountDistinctCompressionIT
Tests run: 3, Failures: 0, Errors: 0, Skipped: 0, Time elapsed: 23.185 sec - in org.apache.phoenix.end2end.KeyOnlyIT
Running org.apache.phoenix.end2end.TenantSpecificTablesDDLIT
Running org.apache.phoenix.end2end.TenantSpecificTablesDMLIT
Tests run: 17, Failures: 0, Errors: 0, Skipped: 0, Time elapsed: 64.893 sec - in org.apache.phoenix.end2end.TenantSpecificTablesDDLIT
Tests run: 16, Failures: 0, Errors: 0, Skipped: 0, Time elapsed: 63.275 sec - in org.apache.phoenix.end2end.TenantSpecificTablesDMLIT
Running org.apache.phoenix.end2end.ContextClassloaderIT
Tests run: 3, Failures: 0, Errors: 0, Skipped: 0, Time elapsed: 11.584 sec - in org.apache.phoenix.end2end.ContextClassloaderIT
Running org.apache.phoenix.end2end.QueryTimeoutIT
Tests run: 1, Failures: 0, Errors: 0, Skipped: 0, Time elapsed: 22.896 sec - in org.apache.phoenix.end2end.QueryTimeoutIT
Running org.apache.phoenix.end2end.UserDefinedFunctionsIT
Tests run: 9, Failures: 0, Errors: 0, Skipped: 0, Time elapsed: 432.096 sec - in org.apache.phoenix.mapreduce.IndexToolIT
Running org.apache.phoenix.end2end.QueryWithLimitIT
Running org.apache.phoenix.end2end.StatsCollectorWithSplitsAndMultiCFIT
Tests run: 2, Failures: 0, Errors: 0, Skipped: 0, Time elapsed: 25.076 sec - in org.apache.phoenix.end2end.QueryWithLimitIT
Tests run: 13, Failures: 0, Errors: 0, Skipped: 0, Time elapsed: 51.004 sec - in org.apache.phoenix.end2end.UserDefinedFunctionsIT
Tests run: 2, Failures: 0, Errors: 0, Skipped: 0, Time elapsed: 32.598 sec - in org.apache.phoenix.end2end.StatsCollectorWithSplitsAndMultiCFIT
Running org.apache.phoenix.end2end.UnionAllIT
Running org.apache.phoenix.end2end.ParallelIteratorsIT
Running org.apache.phoenix.iterate.RoundRobinResultIteratorWithStatsIT
Tests run: 12, Failures: 0, Errors: 0, Skipped: 0, Time elapsed: 35.063 sec - in org.apache.phoenix.end2end.UnionAllIT
Tests run: 1, Failures: 0, Errors: 0, Skipped: 0, Time elapsed: 12.596 sec - in org.apache.phoenix.iterate.RoundRobinResultIteratorWithStatsIT
Running org.apache.phoenix.hbase.index.covered.EndToEndCoveredColumnsIndexBuilderIT
Tests run: 3, Failures: 0, Errors: 0, Skipped: 0, Time elapsed: 33.271 sec - in org.apache.phoenix.end2end.ParallelIteratorsIT
Running org.apache.phoenix.hbase.index.covered.example.EndtoEndIndexingWithCompressionIT
Running org.apache.phoenix.hbase.index.covered.example.EndToEndCoveredIndexingIT
Tests run: 2, Failures: 0, Errors: 0, Skipped: 0, Time elapsed: 19.115 sec - in org.apache.phoenix.hbase.index.covered.EndToEndCoveredColumnsIndexBuilderIT
Running org.apache.phoenix.hbase.index.covered.example.FailWithoutRetriesIT
Tests run: 1, Failures: 0, Errors: 0, Skipped: 0, Time elapsed: 9.01 sec - in org.apache.phoenix.hbase.index.covered.example.FailWithoutRetriesIT
Running org.apache.phoenix.hbase.index.balancer.IndexLoadBalancerIT
Tests run: 55, Failures: 0, Errors: 0, Skipped: 0, Time elapsed: 504.538 sec - in org.apache.phoenix.end2end.AlterTableIT
Running org.apache.phoenix.hbase.index.FailForUnsupportedHBaseVersionsIT
Tests run: 2, Failures: 0, Errors: 0, Skipped: 0, Time elapsed: 17.612 sec - in org.apache.phoenix.hbase.index.FailForUnsupportedHBaseVersionsIT
Running org.apache.phoenix.monitoring.PhoenixMetricsIT
Tests run: 11, Failures: 0, Errors: 1, Skipped: 0, Time elapsed: 158.586 sec <<< FAILURE! - in org.apache.phoenix.hbase.index.covered.example.EndtoEndIndexingWithCompressionIT
testExceedVersionsOutOfOrderUpdates(org.apache.phoenix.hbase.index.covered.example.EndtoEndIndexingWithCompressionIT) Time elapsed: 4.763 sec <<< ERROR!
java.lang.RuntimeException: java.util.concurrent.RejectedExecutionException: Task org.apache.hadoop.hbase.client.ResultBoundedCompletionService$QueueingFuture@6b69d4d6 rejected from java.util.concurrent.ThreadPoolExecutor@711464b1[Running, pool size = 2, active threads = 2, queued tasks = 0, completed tasks = 5]
Caused by: java.util.concurrent.RejectedExecutionException: Task org.apache.hadoop.hbase.client.ResultBoundedCompletionService$QueueingFuture@6b69d4d6 rejected from java.util.concurrent.ThreadPoolExecutor@711464b1[Running, pool size = 2, active threads = 2, queued tasks = 0, completed tasks = 5]
Running org.apache.hadoop.hbase.regionserver.wal.WALReplayWithIndexWritesAndCompressedWALIT
Tests run: 11, Failures: 0, Errors: 0, Skipped: 0, Time elapsed: 159.149 sec - in org.apache.phoenix.hbase.index.covered.example.EndToEndCoveredIndexingIT
Running org.apache.hadoop.hbase.regionserver.wal.WALReplayWithIndexWritesAndUncompressedWALInHBase_094_9_IT
Tests run: 17, Failures: 0, Errors: 0, Skipped: 0, Time elapsed: 85.001 sec - in org.apache.phoenix.monitoring.PhoenixMetricsIT
Tests run: 1, Failures: 0, Errors: 0, Skipped: 0, Time elapsed: 27.788 sec - in org.apache.hadoop.hbase.regionserver.wal.WALReplayWithIndexWritesAndCompressedWALIT
Tests run: 1, Failures: 0, Errors: 0, Skipped: 0, Time elapsed: 27.835 sec - in org.apache.hadoop.hbase.regionserver.wal.WALReplayWithIndexWritesAndUncompressedWALInHBase_094_9_IT
Tests run: 9, Failures: 0, Errors: 0, Skipped: 0, Time elapsed: 242.741 sec - in org.apache.phoenix.hbase.index.balancer.IndexLoadBalancerIT
Running org.apache.phoenix.end2end.MultiCfQueryExecIT
Tests run: 7, Failures: 0, Errors: 0, Skipped: 0, Time elapsed: 25.489 sec - in org.apache.phoenix.end2end.MultiCfQueryExecIT
Results :
Tests in error:
EndtoEndIndexingWithCompressionIT>EndToEndCoveredIndexingIT.testExceedVersionsOutOfOrderUpdates:754 » Runtime
CsvBulkLoadToolIT.testBasicImport:104 » SQL No suitable driver found for jdbc:...
CsvBulkLoadToolIT.testFullOptionImport:141 » SQL No suitable driver found for ...
CsvBulkLoadToolIT.testImportOneIndexTable:233->testImportOneIndexTable:261 » SQL
CsvBulkLoadToolIT.testImportWithIndex:183 » SQL No suitable driver found for j...
CsvBulkLoadToolIT.testImportWithLocalIndex:220 » SQL No suitable driver found ...
Tests run: 250, Failures: 0, Errors: 6, Skipped: 2
[INFO]
[INFO] --- maven-failsafe-plugin:2.19:verify (ClientManagedTimeTests) @ phoenix-core ---
[INFO] ------------------------------------------------------------------------
[INFO] Reactor Summary:
[INFO]
[INFO] Apache Phoenix .................................... SUCCESS [4.010s]
[INFO] Phoenix Core ...................................... FAILURE [56:12.925s]
[INFO] Phoenix - Flume ................................... SKIPPED
[INFO] Phoenix - Pig ..................................... SKIPPED
[INFO] Phoenix Query Server Client ....................... SKIPPED
[INFO] Phoenix Query Server .............................. SKIPPED
[INFO] Phoenix - Pherf ................................... SKIPPED
[INFO] Phoenix - Spark ................................... SKIPPED
[INFO] Phoenix Assembly .................................. SKIPPED
[INFO] Phoenix - Tracing Web Application ................. SKIPPED
[INFO] ------------------------------------------------------------------------
[INFO] BUILD FAILURE
[INFO] ------------------------------------------------------------------------
[INFO] Total time: 56:17.609s
[INFO] Finished at: Wed Nov 11 03:34:54 UTC 2015
[INFO] Final Memory: 51M/1269M
[INFO] ------------------------------------------------------------------------
[ERROR] Failed to execute goal org.apache.maven.plugins:maven-failsafe-plugin:2.19:verify (ClientManagedTimeTests) on project phoenix-core: There are test failures.
[ERROR]
[ERROR] Please refer to <https://builds.apache.org/job/Phoenix-master/ws/phoenix-core/target/failsafe-reports> for the individual test results.
[ERROR] -> [Help 1]
[ERROR]
[ERROR] To see the full stack trace of the errors, re-run Maven with the -e switch.
[ERROR] Re-run Maven using the -X switch to enable full debug logging.
[ERROR]
[ERROR] For more information about the errors and possible solutions, please read the following articles:
[ERROR] [Help 1] http://cwiki.apache.org/confluence/display/MAVEN/MojoFailureException
[ERROR]
[ERROR] After correcting the problems, you can resume the build with the command
[ERROR] mvn <goals> -rf :phoenix-core
Build step 'Invoke top-level Maven targets' marked build as failure
Archiving artifacts
Compressed 1.12 GB of artifacts by 48.7% relative to #942
Updating PHOENIX-2399
Recording test results
Jenkins build is back to normal : Phoenix | Master #949
Posted by Apache Jenkins Server <je...@builds.apache.org>.
See <https://builds.apache.org/job/Phoenix-master/949/changes>
Build failed in Jenkins: Phoenix | Master #948
Posted by Apache Jenkins Server <je...@builds.apache.org>.
See <https://builds.apache.org/job/Phoenix-master/948/changes>
Changes:
[jtaylor] PHOENIX-2399 Server is sometimes unable to find Phoenix driver
------------------------------------------
[...truncated 7251 lines...]
Running org.apache.phoenix.end2end.AbsFunctionEnd2EndIT
Tests run: 1, Failures: 0, Errors: 0, Skipped: 0, Time elapsed: 5.152 sec - in org.apache.phoenix.end2end.AbsFunctionEnd2EndIT
Running org.apache.phoenix.end2end.ToDateFunctionIT
Tests run: 4, Failures: 0, Errors: 0, Skipped: 0, Time elapsed: 19.747 sec - in org.apache.phoenix.end2end.UpsertBigValuesIT
Running org.apache.phoenix.end2end.DynamicFamilyIT
Tests run: 4, Failures: 0, Errors: 0, Skipped: 0, Time elapsed: 18.878 sec - in org.apache.phoenix.end2end.TenantSpecificViewIndexSaltedIT
Running org.apache.phoenix.end2end.CSVCommonsLoaderIT
Tests run: 11, Failures: 0, Errors: 0, Skipped: 0, Time elapsed: 11.314 sec - in org.apache.phoenix.end2end.ToDateFunctionIT
Running org.apache.phoenix.end2end.SortMergeJoinIT
Tests run: 4, Failures: 0, Errors: 0, Skipped: 0, Time elapsed: 10.168 sec - in org.apache.phoenix.end2end.DynamicFamilyIT
Running org.apache.phoenix.end2end.ReadOnlyIT
Tests run: 1, Failures: 0, Errors: 0, Skipped: 0, Time elapsed: 10.898 sec - in org.apache.phoenix.end2end.ReadOnlyIT
Running org.apache.phoenix.end2end.FirstValueFunctionIT
Tests run: 7, Failures: 0, Errors: 0, Skipped: 0, Time elapsed: 6.096 sec - in org.apache.phoenix.end2end.FirstValueFunctionIT
Running org.apache.phoenix.end2end.StringToArrayFunctionIT
Tests run: 16, Failures: 0, Errors: 0, Skipped: 0, Time elapsed: 38.378 sec - in org.apache.phoenix.end2end.CSVCommonsLoaderIT
Running org.apache.phoenix.end2end.CoalesceFunctionIT
Tests run: 62, Failures: 0, Errors: 0, Skipped: 0, Time elapsed: 276.865 sec - in org.apache.phoenix.end2end.index.IndexExpressionIT
Running org.apache.phoenix.end2end.DisableLocalIndexIT
Tests run: 22, Failures: 0, Errors: 0, Skipped: 0, Time elapsed: 18.139 sec - in org.apache.phoenix.end2end.StringToArrayFunctionIT
Running org.apache.phoenix.end2end.TimezoneOffsetFunctionIT
Tests run: 1, Failures: 0, Errors: 0, Skipped: 0, Time elapsed: 10.52 sec - in org.apache.phoenix.end2end.DisableLocalIndexIT
Running org.apache.phoenix.end2end.RegexpSubstrFunctionIT
Tests run: 7, Failures: 0, Errors: 0, Skipped: 0, Time elapsed: 10.667 sec - in org.apache.phoenix.end2end.TimezoneOffsetFunctionIT
Running org.apache.phoenix.end2end.CbrtFunctionEnd2EndIT
Tests run: 10, Failures: 0, Errors: 0, Skipped: 0, Time elapsed: 17.205 sec - in org.apache.phoenix.end2end.CoalesceFunctionIT
Running org.apache.phoenix.end2end.StoreNullsIT
Tests run: 2, Failures: 0, Errors: 0, Skipped: 0, Time elapsed: 6.076 sec - in org.apache.phoenix.end2end.RegexpSubstrFunctionIT
Running org.apache.phoenix.end2end.SpooledSortMergeJoinIT
Tests run: 2, Failures: 0, Errors: 0, Skipped: 0, Time elapsed: 10.103 sec - in org.apache.phoenix.end2end.CbrtFunctionEnd2EndIT
Running org.apache.phoenix.end2end.SortOrderIT
Tests run: 3, Failures: 0, Errors: 0, Skipped: 0, Time elapsed: 26.301 sec - in org.apache.phoenix.end2end.StoreNullsIT
Running org.apache.phoenix.end2end.InListIT
Tests run: 21, Failures: 0, Errors: 0, Skipped: 0, Time elapsed: 124.878 sec - in org.apache.phoenix.end2end.SubqueryIT
Running org.apache.phoenix.end2end.ReverseScanIT
Tests run: 3, Failures: 0, Errors: 0, Skipped: 0, Time elapsed: 13.32 sec - in org.apache.phoenix.end2end.ReverseScanIT
Running org.apache.phoenix.end2end.NthValueFunctionIT
Tests run: 11, Failures: 0, Errors: 0, Skipped: 0, Time elapsed: 15.165 sec - in org.apache.phoenix.end2end.NthValueFunctionIT
Running org.apache.phoenix.end2end.MappingTableDataTypeIT
Tests run: 1, Failures: 0, Errors: 0, Skipped: 0, Time elapsed: 12.533 sec - in org.apache.phoenix.end2end.MappingTableDataTypeIT
Running org.apache.phoenix.end2end.LikeExpressionIT
Tests run: 2, Failures: 0, Errors: 0, Skipped: 0, Time elapsed: 11.235 sec - in org.apache.phoenix.end2end.LikeExpressionIT
Running org.apache.phoenix.end2end.UpsertSelectAutoCommitIT
Tests run: 45, Failures: 0, Errors: 0, Skipped: 0, Time elapsed: 76.667 sec - in org.apache.phoenix.end2end.SortOrderIT
Running org.apache.phoenix.end2end.IsNullIT
Tests run: 3, Failures: 0, Errors: 0, Skipped: 0, Time elapsed: 9.998 sec - in org.apache.phoenix.end2end.IsNullIT
Running org.apache.phoenix.end2end.BinaryRowKeyIT
Tests run: 3, Failures: 0, Errors: 0, Skipped: 0, Time elapsed: 6.329 sec - in org.apache.phoenix.end2end.BinaryRowKeyIT
Running org.apache.phoenix.end2end.RegexpReplaceFunctionIT
Tests run: 2, Failures: 0, Errors: 0, Skipped: 0, Time elapsed: 5.141 sec - in org.apache.phoenix.end2end.RegexpReplaceFunctionIT
Running org.apache.phoenix.end2end.salted.SaltedTableUpsertSelectIT
Tests run: 3, Failures: 0, Errors: 0, Skipped: 0, Time elapsed: 27.177 sec - in org.apache.phoenix.end2end.UpsertSelectAutoCommitIT
Running org.apache.phoenix.end2end.salted.SaltedTableVarLengthRowKeyIT
Tests run: 1, Failures: 0, Errors: 0, Skipped: 0, Time elapsed: 6.489 sec - in org.apache.phoenix.end2end.salted.SaltedTableVarLengthRowKeyIT
Running org.apache.phoenix.end2end.HashJoinIT
Tests run: 108, Failures: 0, Errors: 0, Skipped: 0, Time elapsed: 176.398 sec - in org.apache.phoenix.end2end.SortMergeJoinIT
Running org.apache.phoenix.end2end.MD5FunctionIT
Tests run: 28, Failures: 0, Errors: 0, Skipped: 0, Time elapsed: 97.692 sec - in org.apache.phoenix.end2end.InListIT
Running org.apache.phoenix.end2end.DateTimeIT
Tests run: 5, Failures: 0, Errors: 0, Skipped: 0, Time elapsed: 18.529 sec - in org.apache.phoenix.end2end.salted.SaltedTableUpsertSelectIT
Running org.apache.phoenix.end2end.TenantSpecificViewIndexIT
Tests run: 3, Failures: 0, Errors: 0, Skipped: 0, Time elapsed: 10.02 sec - in org.apache.phoenix.end2end.MD5FunctionIT
Running org.apache.phoenix.end2end.AlterSessionIT
Tests run: 2, Failures: 0, Errors: 0, Skipped: 0, Time elapsed: 5.192 sec - in org.apache.phoenix.end2end.AlterSessionIT
Running org.apache.phoenix.end2end.PhoenixRuntimeIT
Tests run: 19, Failures: 0, Errors: 0, Skipped: 0, Time elapsed: 14.385 sec - in org.apache.phoenix.end2end.DateTimeIT
Running org.apache.phoenix.end2end.DecodeFunctionIT
Tests run: 6, Failures: 0, Errors: 0, Skipped: 0, Time elapsed: 7.08 sec - in org.apache.phoenix.end2end.DecodeFunctionIT
Running org.apache.phoenix.end2end.UpgradeIT
Tests run: 8, Failures: 0, Errors: 0, Skipped: 0, Time elapsed: 31.76 sec - in org.apache.phoenix.end2end.TenantSpecificViewIndexIT
Running org.apache.phoenix.end2end.ServerExceptionIT
Tests run: 1, Failures: 0, Errors: 0, Skipped: 0, Time elapsed: 5.98 sec - in org.apache.phoenix.end2end.ServerExceptionIT
Running org.apache.phoenix.end2end.RegexpSplitFunctionIT
Tests run: 2, Failures: 0, Errors: 0, Skipped: 0, Time elapsed: 33.523 sec - in org.apache.phoenix.end2end.PhoenixRuntimeIT
Running org.apache.phoenix.end2end.ExecuteStatementsIT
Tests run: 11, Failures: 0, Errors: 0, Skipped: 0, Time elapsed: 6.725 sec - in org.apache.phoenix.end2end.RegexpSplitFunctionIT
Running org.apache.phoenix.end2end.SkipScanAfterManualSplitIT
Tests run: 2, Failures: 0, Errors: 0, Skipped: 0, Time elapsed: 28.788 sec - in org.apache.phoenix.end2end.ExecuteStatementsIT
Running org.apache.phoenix.end2end.ConvertTimezoneFunctionIT
Tests run: 3, Failures: 0, Errors: 0, Skipped: 0, Time elapsed: 34.411 sec - in org.apache.phoenix.end2end.SkipScanAfterManualSplitIT
Tests run: 7, Failures: 0, Errors: 0, Skipped: 0, Time elapsed: 6.37 sec - in org.apache.phoenix.end2end.ConvertTimezoneFunctionIT
Running org.apache.phoenix.end2end.SignFunctionEnd2EndIT
Running org.apache.phoenix.end2end.RTrimFunctionIT
Tests run: 2, Failures: 0, Errors: 0, Skipped: 0, Time elapsed: 5.211 sec - in org.apache.phoenix.end2end.RTrimFunctionIT
Running org.apache.phoenix.end2end.SkipScanQueryIT
Tests run: 2, Failures: 0, Errors: 0, Skipped: 0, Time elapsed: 10.206 sec - in org.apache.phoenix.end2end.SignFunctionEnd2EndIT
Running org.apache.phoenix.end2end.ExpFunctionEnd2EndIT
Tests run: 6, Failures: 0, Errors: 0, Skipped: 0, Time elapsed: 72.542 sec - in org.apache.phoenix.end2end.UpgradeIT
Running org.apache.phoenix.end2end.ArrayAppendFunctionIT
Tests run: 3, Failures: 0, Errors: 0, Skipped: 0, Time elapsed: 16.185 sec - in org.apache.phoenix.end2end.ExpFunctionEnd2EndIT
Running org.apache.phoenix.end2end.TenantIdTypeIT
Tests run: 34, Failures: 0, Errors: 0, Skipped: 0, Time elapsed: 23.062 sec - in org.apache.phoenix.end2end.ArrayAppendFunctionIT
Running org.apache.phoenix.end2end.LpadFunctionIT
Tests run: 9, Failures: 0, Errors: 0, Skipped: 0, Time elapsed: 32.827 sec - in org.apache.phoenix.end2end.SkipScanQueryIT
Tests run: 12, Failures: 0, Errors: 0, Skipped: 0, Time elapsed: 23.43 sec - in org.apache.phoenix.end2end.LpadFunctionIT
Tests run: 108, Failures: 0, Errors: 0, Skipped: 0, Time elapsed: 370.789 sec - in org.apache.phoenix.end2end.SpooledSortMergeJoinIT
Tests run: 15, Failures: 0, Errors: 0, Skipped: 0, Time elapsed: 153.927 sec - in org.apache.phoenix.end2end.TenantIdTypeIT
Tests run: 108, Failures: 0, Errors: 0, Skipped: 0, Time elapsed: 365.116 sec - in org.apache.phoenix.end2end.HashJoinIT
Results :
Tests run: 1176, Failures: 0, Errors: 0, Skipped: 0
[INFO]
[INFO] --- maven-failsafe-plugin:2.19:integration-test (NeedTheirOwnClusterTests) @ phoenix-core ---
-------------------------------------------------------
T E S T S
-------------------------------------------------------
Running org.apache.hadoop.hbase.regionserver.wal.WALReplayWithIndexWritesAndCompressedWALIT
Running org.apache.hadoop.hbase.regionserver.wal.WALReplayWithIndexWritesAndUncompressedWALInHBase_094_9_IT
Running org.apache.phoenix.hbase.index.balancer.IndexLoadBalancerIT
Running org.apache.phoenix.rpc.PhoenixServerRpcIT
Running org.apache.phoenix.rpc.PhoenixClientRpcIT
Tests run: 1, Failures: 0, Errors: 0, Skipped: 0, Time elapsed: 34.733 sec - in org.apache.hadoop.hbase.regionserver.wal.WALReplayWithIndexWritesAndUncompressedWALInHBase_094_9_IT
Running org.apache.phoenix.hbase.index.FailForUnsupportedHBaseVersionsIT
Tests run: 1, Failures: 0, Errors: 0, Skipped: 0, Time elapsed: 37.317 sec - in org.apache.hadoop.hbase.regionserver.wal.WALReplayWithIndexWritesAndCompressedWALIT
Tests run: 2, Failures: 0, Errors: 0, Skipped: 0, Time elapsed: 12.581 sec - in org.apache.phoenix.rpc.PhoenixClientRpcIT
Tests run: 2, Failures: 0, Errors: 0, Skipped: 0, Time elapsed: 15.108 sec - in org.apache.phoenix.rpc.PhoenixServerRpcIT
Running org.apache.phoenix.hbase.index.covered.EndToEndCoveredColumnsIndexBuilderIT
Running org.apache.phoenix.hbase.index.covered.example.FailWithoutRetriesIT
Tests run: 2, Failures: 0, Errors: 0, Skipped: 0, Time elapsed: 16.949 sec - in org.apache.phoenix.hbase.index.FailForUnsupportedHBaseVersionsIT
Tests run: 1, Failures: 0, Errors: 0, Skipped: 0, Time elapsed: 9.527 sec - in org.apache.phoenix.hbase.index.covered.example.FailWithoutRetriesIT
Running org.apache.phoenix.hbase.index.covered.example.EndToEndCoveredIndexingIT
Tests run: 2, Failures: 0, Errors: 0, Skipped: 0, Time elapsed: 17.974 sec - in org.apache.phoenix.hbase.index.covered.EndToEndCoveredColumnsIndexBuilderIT
Running org.apache.phoenix.hbase.index.covered.example.EndtoEndIndexingWithCompressionIT
Running org.apache.phoenix.monitoring.PhoenixMetricsIT
Running org.apache.phoenix.iterate.RoundRobinResultIteratorWithStatsIT
Tests run: 1, Failures: 0, Errors: 0, Skipped: 0, Time elapsed: 15.525 sec - in org.apache.phoenix.iterate.RoundRobinResultIteratorWithStatsIT
Running org.apache.phoenix.end2end.TenantSpecificTablesDMLIT
Tests run: 17, Failures: 0, Errors: 0, Skipped: 0, Time elapsed: 60.106 sec - in org.apache.phoenix.monitoring.PhoenixMetricsIT
Running org.apache.phoenix.end2end.ViewIT
Tests run: 16, Failures: 0, Errors: 0, Skipped: 0, Time elapsed: 36.287 sec - in org.apache.phoenix.end2end.TenantSpecificTablesDMLIT
Running org.apache.phoenix.end2end.TenantSpecificTablesDDLIT
Tests run: 11, Failures: 0, Errors: 0, Skipped: 0, Time elapsed: 126.646 sec - in org.apache.phoenix.hbase.index.covered.example.EndToEndCoveredIndexingIT
Running org.apache.phoenix.end2end.index.MutableIndexFailureIT
Tests run: 9, Failures: 0, Errors: 0, Skipped: 0, Time elapsed: 172.982 sec - in org.apache.phoenix.hbase.index.balancer.IndexLoadBalancerIT
Tests run: 11, Failures: 0, Errors: 0, Skipped: 0, Time elapsed: 133.55 sec - in org.apache.phoenix.hbase.index.covered.example.EndtoEndIndexingWithCompressionIT
Running org.apache.phoenix.end2end.index.MutableIndexReplicationIT
Tests run: 22, Failures: 0, Errors: 0, Skipped: 0, Time elapsed: 58.065 sec - in org.apache.phoenix.end2end.ViewIT
Tests run: 17, Failures: 0, Errors: 0, Skipped: 0, Time elapsed: 47.636 sec - in org.apache.phoenix.end2end.TenantSpecificTablesDDLIT
Running org.apache.phoenix.end2end.UnionAllIT
Running org.apache.phoenix.end2end.StatsCollectorIT
Tests run: 1, Failures: 0, Errors: 0, Skipped: 0, Time elapsed: 27.23 sec - in org.apache.phoenix.end2end.index.MutableIndexReplicationIT
Running org.apache.phoenix.end2end.KeyOnlyIT
Tests run: 12, Failures: 0, Errors: 0, Skipped: 0, Time elapsed: 38.147 sec - in org.apache.phoenix.end2end.UnionAllIT
Tests run: 3, Failures: 0, Errors: 0, Skipped: 0, Time elapsed: 17.701 sec - in org.apache.phoenix.end2end.KeyOnlyIT
Running org.apache.phoenix.end2end.UserDefinedFunctionsIT
Tests run: 4, Failures: 0, Errors: 0, Skipped: 0, Time elapsed: 55.659 sec - in org.apache.phoenix.end2end.StatsCollectorIT
Running org.apache.phoenix.end2end.ContextClassloaderIT
Tests run: 3, Failures: 0, Errors: 0, Skipped: 0, Time elapsed: 5.908 sec - in org.apache.phoenix.end2end.ContextClassloaderIT
Running org.apache.phoenix.end2end.QueryTimeoutIT
Tests run: 13, Failures: 0, Errors: 0, Skipped: 0, Time elapsed: 29.087 sec - in org.apache.phoenix.end2end.UserDefinedFunctionsIT
Running org.apache.phoenix.end2end.MultiCfQueryExecIT
Running org.apache.phoenix.end2end.QueryWithLimitIT
Tests run: 1, Failures: 0, Errors: 0, Skipped: 0, Time elapsed: 17.047 sec - in org.apache.phoenix.end2end.QueryTimeoutIT
Tests run: 7, Failures: 0, Errors: 0, Skipped: 0, Time elapsed: 16.235 sec - in org.apache.phoenix.end2end.MultiCfQueryExecIT
Tests run: 2, Failures: 0, Errors: 0, Skipped: 0, Time elapsed: 19.247 sec - in org.apache.phoenix.end2end.QueryWithLimitIT
Running org.apache.phoenix.end2end.ParallelIteratorsIT
Running org.apache.phoenix.end2end.SaltedViewIT
Running org.apache.phoenix.end2end.SpillableGroupByIT
Tests run: 1, Failures: 0, Errors: 0, Skipped: 0, Time elapsed: 8.05 sec - in org.apache.phoenix.end2end.SpillableGroupByIT
Tests run: 2, Failures: 0, Errors: 0, Skipped: 0, Time elapsed: 17.669 sec - in org.apache.phoenix.end2end.SaltedViewIT
Tests run: 3, Failures: 0, Errors: 0, Skipped: 0, Time elapsed: 27.406 sec - in org.apache.phoenix.end2end.ParallelIteratorsIT
Running org.apache.phoenix.end2end.StatsCollectorWithSplitsAndMultiCFIT
Running org.apache.phoenix.end2end.AlterTableIT
Running org.apache.phoenix.end2end.CountDistinctCompressionIT
Tests run: 1, Failures: 0, Errors: 0, Skipped: 0, Time elapsed: 5.659 sec - in org.apache.phoenix.end2end.CountDistinctCompressionIT
Running org.apache.phoenix.end2end.ConnectionUtilIT
Tests run: 2, Failures: 0, Errors: 0, Skipped: 0, Time elapsed: 28.428 sec - in org.apache.phoenix.end2end.StatsCollectorWithSplitsAndMultiCFIT
Tests run: 1, Failures: 0, Errors: 0, Skipped: 0, Time elapsed: 19.521 sec - in org.apache.phoenix.end2end.ConnectionUtilIT
Running org.apache.phoenix.mapreduce.IndexToolIT
Running org.apache.phoenix.mapreduce.CsvBulkLoadToolIT
Tests run: 5, Failures: 4, Errors: 0, Skipped: 0, Time elapsed: 231.168 sec <<< FAILURE! - in org.apache.phoenix.mapreduce.CsvBulkLoadToolIT
testBasicImport(org.apache.phoenix.mapreduce.CsvBulkLoadToolIT) Time elapsed: 50.512 sec <<< FAILURE!
java.lang.AssertionError
at org.apache.phoenix.mapreduce.CsvBulkLoadToolIT.testBasicImport(CsvBulkLoadToolIT.java:118)
testFullOptionImport(org.apache.phoenix.mapreduce.CsvBulkLoadToolIT) Time elapsed: 46.63 sec <<< FAILURE!
java.lang.AssertionError
at org.apache.phoenix.mapreduce.CsvBulkLoadToolIT.testFullOptionImport(CsvBulkLoadToolIT.java:158)
testImportWithIndex(org.apache.phoenix.mapreduce.CsvBulkLoadToolIT) Time elapsed: 49.212 sec <<< FAILURE!
java.lang.AssertionError
at org.apache.phoenix.mapreduce.CsvBulkLoadToolIT.testImportWithIndex(CsvBulkLoadToolIT.java:197)
testImportOneIndexTable(org.apache.phoenix.mapreduce.CsvBulkLoadToolIT) Time elapsed: 46.109 sec <<< FAILURE!
java.lang.AssertionError
at org.apache.phoenix.mapreduce.CsvBulkLoadToolIT.testImportOneIndexTable(CsvBulkLoadToolIT.java:278)
at org.apache.phoenix.mapreduce.CsvBulkLoadToolIT.testImportOneIndexTable(CsvBulkLoadToolIT.java:240)
Tests run: 55, Failures: 0, Errors: 0, Skipped: 0, Time elapsed: 398.38 sec - in org.apache.phoenix.end2end.AlterTableIT
Tests run: 9, Failures: 0, Errors: 0, Skipped: 0, Time elapsed: 393.581 sec - in org.apache.phoenix.mapreduce.IndexToolIT
Running org.apache.phoenix.end2end.index.ImmutableIndexWithStatsIT
Tests run: 1, Failures: 0, Errors: 0, Skipped: 0, Time elapsed: 11.347 sec - in org.apache.phoenix.end2end.index.ImmutableIndexWithStatsIT
Tests run: 3, Failures: 0, Errors: 0, Skipped: 2, Time elapsed: 1,234.03 sec - in org.apache.phoenix.end2end.index.MutableIndexFailureIT
Running org.apache.phoenix.execute.PartialCommitIT
Tests run: 6, Failures: 0, Errors: 0, Skipped: 0, Time elapsed: 2.311 sec - in org.apache.phoenix.execute.PartialCommitIT
Results :
Failed tests:
CsvBulkLoadToolIT.testBasicImport:118 null
CsvBulkLoadToolIT.testFullOptionImport:158 null
CsvBulkLoadToolIT.testImportOneIndexTable:240->testImportOneIndexTable:278 null
CsvBulkLoadToolIT.testImportWithIndex:197 null
Tests run: 250, Failures: 4, Errors: 0, Skipped: 2
[INFO]
[INFO] --- maven-failsafe-plugin:2.19:verify (ClientManagedTimeTests) @ phoenix-core ---
[INFO] ------------------------------------------------------------------------
[INFO] Reactor Summary:
[INFO]
[INFO] Apache Phoenix .................................... SUCCESS [3.978s]
[INFO] Phoenix Core ...................................... FAILURE [58:22.818s]
[INFO] Phoenix - Flume ................................... SKIPPED
[INFO] Phoenix - Pig ..................................... SKIPPED
[INFO] Phoenix Query Server Client ....................... SKIPPED
[INFO] Phoenix Query Server .............................. SKIPPED
[INFO] Phoenix - Pherf ................................... SKIPPED
[INFO] Phoenix - Spark ................................... SKIPPED
[INFO] Phoenix Assembly .................................. SKIPPED
[INFO] Phoenix - Tracing Web Application ................. SKIPPED
[INFO] ------------------------------------------------------------------------
[INFO] BUILD FAILURE
[INFO] ------------------------------------------------------------------------
[INFO] Total time: 58:27.552s
[INFO] Finished at: Wed Nov 11 07:39:44 UTC 2015
[INFO] Final Memory: 48M/1027M
[INFO] ------------------------------------------------------------------------
[ERROR] Failed to execute goal org.apache.maven.plugins:maven-failsafe-plugin:2.19:verify (ClientManagedTimeTests) on project phoenix-core: There are test failures.
[ERROR]
[ERROR] Please refer to <https://builds.apache.org/job/Phoenix-master/ws/phoenix-core/target/failsafe-reports> for the individual test results.
[ERROR] -> [Help 1]
[ERROR]
[ERROR] To see the full stack trace of the errors, re-run Maven with the -e switch.
[ERROR] Re-run Maven using the -X switch to enable full debug logging.
[ERROR]
[ERROR] For more information about the errors and possible solutions, please read the following articles:
[ERROR] [Help 1] http://cwiki.apache.org/confluence/display/MAVEN/MojoFailureException
[ERROR]
[ERROR] After correcting the problems, you can resume the build with the command
[ERROR] mvn <goals> -rf :phoenix-core
Build step 'Invoke top-level Maven targets' marked build as failure
Archiving artifacts
Compressed 1.23 GB of artifacts by 51.4% relative to #942
Updating PHOENIX-2399
Recording test results