You are viewing a plain text version of this content. The canonical link for it is here.
Posted to notifications@qpid.apache.org by Apache Jenkins Server <je...@builds.apache.org> on 2020/02/21 13:57:19 UTC
Build failed in Jenkins: Qpid-Broker-J-Checks #1117
See <https://builds.apache.org/job/Qpid-Broker-J-Checks/1117/display/redirect?page=changes>
Changes:
[orudyy] QPID-8418: [Broker-J] Update jetty version to 9.4.26.v20200117
[orudyy] QPID-8421: [Broker-J] Update dojo toolkit dependecy to version 1.16.0
------------------------------------------
[...truncated 1.79 MB...]
[INFO]
[INFO] --- maven-assembly-plugin:3.0.0:single (source-release-assembly) @ qpid-broker-j-developer-guide ---
[INFO] Assemblies have been skipped per configuration of the skipAssembly parameter.
[INFO]
[INFO] --- maven-source-plugin:3.0.1:jar-no-fork (attach-sources) @ qpid-broker-j-developer-guide ---
[INFO] Building jar: <https://builds.apache.org/job/Qpid-Broker-J-Checks/ws/doc/developer-guide/target/qpid-broker-j-developer-guide-8.0.0-SNAPSHOT-sources.jar>
[INFO]
[INFO] --- maven-javadoc-plugin:3.0.1:jar (attach-javadocs) @ qpid-broker-j-developer-guide ---
[INFO]
[INFO] --- maven-gpg-plugin:1.6:sign (sign-release-artifacts) @ qpid-broker-j-developer-guide ---
[INFO]
[INFO] --- checksum-maven-plugin:1.7:files (source-release-checksum) @ qpid-broker-j-developer-guide ---
[JENKINS] Archiving disabled
[JENKINS] Archiving disabled
[JENKINS] Archiving disabled
[JENKINS] Archiving disabled
[JENKINS] Archiving disabled
[JENKINS] Archiving disabled
[JENKINS] Archiving disabled
[JENKINS] Archiving disabled
[JENKINS] Archiving disabled
[JENKINS] Archiving disabled
[JENKINS] Archiving disabled
[JENKINS] Archiving disabled
[JENKINS] Archiving disabled
[JENKINS] Archiving disabled
[JENKINS] Archiving disabled
[JENKINS] Archiving disabled
[JENKINS] Archiving disabled
[JENKINS] Archiving disabled
[JENKINS] Archiving disabled
[JENKINS] Archiving disabled
[JENKINS] Archiving disabled
[JENKINS] Archiving disabled
[JENKINS] Archiving disabled
[JENKINS] Archiving disabled
[JENKINS] Archiving disabled
[JENKINS] Archiving disabled
[JENKINS] Archiving disabled
[JENKINS] Archiving disabled
[JENKINS] Archiving disabled
[JENKINS] Archiving disabled
[JENKINS] Archiving disabled
[JENKINS] Archiving disabled
[JENKINS] Archiving disabled
[JENKINS] Archiving disabled
[JENKINS] Archiving disabled
[JENKINS] Archiving disabled
[JENKINS] Archiving disabled
[JENKINS] Archiving disabled
[JENKINS] Archiving disabled
[JENKINS] Archiving disabled
[JENKINS] Archiving disabled
[JENKINS] Archiving disabled
[JENKINS] Archiving disabled
[JENKINS] Archiving disabled
[JENKINS] Archiving disabled
[JENKINS] Archiving disabled
[JENKINS] Archiving disabled
[JENKINS] Archiving disabled
[JENKINS] Archiving disabled
[INFO] ------------------------------------------------------------------------
[INFO] Reactor Summary for Apache Qpid Broker-J Parent 8.0.0-SNAPSHOT:
[INFO]
[INFO] Apache Qpid Broker-J Parent ........................ SUCCESS [ 13.131 s]
[INFO] Apache Qpid Broker-J Code Generation ............... SUCCESS [ 11.048 s]
[INFO] Apache Qpid Broker-J Test Utilities ................ SUCCESS [ 8.829 s]
[INFO] Apache Qpid Broker-J Core .......................... SUCCESS [ 55.561 s]
[INFO] Apache Qpid Broker-J LogBack Logging Plug-in ....... SUCCESS [ 12.977 s]
[INFO] Apache Qpid Broker-J Access Control Plug-in ........ SUCCESS [ 10.803 s]
[INFO] Apache Qpid Broker-J AMQP 0-10 Protocol Plug-in .... SUCCESS [ 15.255 s]
[INFO] Apache Qpid Broker-J AMQP 0-8 Protocol Plug-in ..... SUCCESS [ 15.516 s]
[INFO] Apache Qpid Broker-J AMQP 1-0 Protocol Plug-in ..... SUCCESS [ 19.854 s]
[INFO] Apache Qpid Broker-J AMQP 0-8 to 0-10 Message Conversion Plug-in SUCCESS [ 7.254 s]
[INFO] Apache Qpid Broker-J AMQP 0-8 to 1-0 Message Conversion Plug-in SUCCESS [ 8.086 s]
[INFO] Apache Qpid Broker-J AMQP 0-10 to 1-0 Message Conversion Plug-in SUCCESS [ 8.041 s]
[INFO] Apache Qpid Broker-J JDBC Message Store Plug-in .... SUCCESS [ 10.444 s]
[INFO] Apache Qpid Broker-J Derby Message Store Plug-in ... SUCCESS [ 11.001 s]
[INFO] Apache Qpid Broker-J JDBC Message Store Connection Pooling Plug-in SUCCESS [ 7.091 s]
[INFO] Apache Qpid Broker-J LogBack JDBC Logging Plug-in .. SUCCESS [ 8.161 s]
[INFO] Apache Qpid AMQP 1.0 JDBC Link Store Plug-in ....... SUCCESS [ 7.156 s]
[INFO] Apache Qpid Broker-J HTTP Management Plug-in ....... SUCCESS [ 30.506 s]
[INFO] Apache Qpid Broker-J AMQP Management Protocol Plug-in SUCCESS [ 7.960 s]
[INFO] Apache Qpid Broker-J Memory Message Store Plug-in .. SUCCESS [ 8.349 s]
[INFO] Apache Qpid Broker-J WebSocket Plug-in ............. SUCCESS [ 7.297 s]
[INFO] Apache Qpid Broker-J BDB Message Store Plug-in ..... SUCCESS [ 14.769 s]
[INFO] Apache Qpid AMQP 1.0 BDB Link Store Plug-in ........ SUCCESS [ 7.872 s]
[INFO] Apache Qpid Broker-J ............................... SUCCESS [ 7.940 s]
[INFO] Apache Qpid Broker-J Bundles ....................... FAILURE [ 3.477 s]
[INFO] Apache Qpid Broker-J Tools ......................... SUCCESS [ 6.986 s]
[INFO] Apache Qpid Broker-J System Test Parent ............ SUCCESS [ 3.641 s]
[INFO] Apache Qpid Broker-J System Test Utils ............. SUCCESS [ 5.595 s]
[INFO] Apache Qpid Broker-J JMS System Tests Core ......... SUCCESS [ 5.846 s]
[INFO] Apache Qpid Broker-J JMS 1.1 System Tests .......... SUCCESS [ 8.259 s]
[INFO] Apache Qpid Broker-J JMS 2.0 System Tests .......... SUCCESS [ 5.758 s]
[INFO] Apache Qpid Broker-J HTTP system tests ............. SUCCESS [ 8.494 s]
[INFO] Apache Qpid Broker-J Protocol Tests Core ........... SUCCESS [ 5.105 s]
[INFO] Apache Qpid Protocol Tests for AMQP 0-8,0-9,0-9-1 .. SUCCESS [ 7.220 s]
[INFO] Apache Qpid Protocol Tests for AMQP 0-10 ........... SUCCESS [ 6.377 s]
[INFO] Apache Qpid Protocol Tests for AMQP 1.0 ............ SUCCESS [ 8.540 s]
[INFO] Apache Qpid Broker-J System Tests Spawn Broker Admin SUCCESS [ 7.177 s]
[INFO] Apache Qpid Broker-J End to End Conversion Tests ... SUCCESS [ 8.556 s]
[INFO] Apache Qpid Broker-J Performance Tests ............. SUCCESS [ 15.582 s]
[INFO] Apache Qpid Broker-J Performance Test System Tests . SUCCESS [ 6.042 s]
[INFO] Apache Qpid Broker-J Performance Tests Visualisation JFC SUCCESS [ 9.970 s]
[INFO] Apache Qpid Broker-J BDB Store System Tests ........ SUCCESS [ 6.824 s]
[INFO] Apache Qpid Joram JMS Tests ........................ SUCCESS [ 8.074 s]
[INFO] Apache Qpid Broker-J JMS TCK Configuration ......... SUCCESS [ 6.479 s]
[INFO] Apache Qpid Broker-J Docbook ....................... SUCCESS [ 3.624 s]
[INFO] Apache Qpid Broker-J Docbook ....................... SUCCESS [ 6.895 s]
[INFO] Apache Qpid Broker-J Performance Test Docbook ...... SUCCESS [ 5.427 s]
[INFO] Apache Qpid Broker-J Developer Guide ............... SUCCESS [ 5.018 s]
[INFO] ------------------------------------------------------------------------
[INFO] BUILD FAILURE
[INFO] ------------------------------------------------------------------------
[INFO] Total time: 11:18 min
[INFO] Finished at: 2020-02-21T13:57:02Z
[INFO] ------------------------------------------------------------------------
Waiting for Jenkins to finish collecting data
[ERROR] Failed to execute goal org.apache.maven.plugins:maven-antrun-plugin:1.8:run (dependency-change-verification) on project apache-qpid-broker-j: An Ant BuildException has occured: Generated dependency info does not match the reference. Ensure LICENCE and NOTICE files are correct and then update the reference by running again with -Dupdate-dependency-reference. Generated file: '<https://builds.apache.org/job/Qpid-Broker-J-Checks/ws/apache-qpid-broker-j/target/dependency-change-verification/PROCESSED_DEPENDENCIES_INFO'.> Reference file: '<https://builds.apache.org/job/Qpid-Broker-J-Checks/ws/apache-qpid-broker-j/src/main/assembly/dependency-verification/DEPENDENCIES_REFERENCE'.>
[ERROR] around Ant part ...<fail message="Generated dependency info does not match the reference. Ensure LICENCE and NOTICE files are correct and then update the reference by running again with -Dupdate-dependency-reference. Generated file: '${dependency-verification-output-file}'. Reference file: '<https://builds.apache.org/job/Qpid-Broker-J-Checks/ws/apache-qpid-broker-j/src/main/assembly/dependency-verification/DEPENDENCIES_REFERENCE'.">...> @ 48:444 in <https://builds.apache.org/job/Qpid-Broker-J-Checks/ws/apache-qpid-broker-j/target/antrun/build-main.xml>
[ERROR] -> [Help 1]
org.apache.maven.lifecycle.LifecycleExecutionException: Failed to execute goal org.apache.maven.plugins:maven-antrun-plugin:1.8:run (dependency-change-verification) on project apache-qpid-broker-j: An Ant BuildException has occured: Generated dependency info does not match the reference. Ensure LICENCE and NOTICE files are correct and then update the reference by running again with -Dupdate-dependency-reference. Generated file: '<https://builds.apache.org/job/Qpid-Broker-J-Checks/ws/apache-qpid-broker-j/target/dependency-change-verification/PROCESSED_DEPENDENCIES_INFO'.> Reference file: '<https://builds.apache.org/job/Qpid-Broker-J-Checks/ws/apache-qpid-broker-j/src/main/assembly/dependency-verification/DEPENDENCIES_REFERENCE'.>
around Ant part ...<fail message="Generated dependency info does not match the reference. Ensure LICENCE and NOTICE files are correct and then update the reference by running again with -Dupdate-dependency-reference. Generated file: '${dependency-verification-output-file}'. Reference file: '<https://builds.apache.org/job/Qpid-Broker-J-Checks/ws/apache-qpid-broker-j/src/main/assembly/dependency-verification/DEPENDENCIES_REFERENCE'.">...> @ 48:444 in <https://builds.apache.org/job/Qpid-Broker-J-Checks/ws/apache-qpid-broker-j/target/antrun/build-main.xml>
at org.apache.maven.lifecycle.internal.MojoExecutor.execute (MojoExecutor.java:215)
at org.apache.maven.lifecycle.internal.MojoExecutor.execute (MojoExecutor.java:156)
at org.apache.maven.lifecycle.internal.MojoExecutor.execute (MojoExecutor.java:148)
at org.apache.maven.lifecycle.internal.LifecycleModuleBuilder.buildProject (LifecycleModuleBuilder.java:117)
at org.apache.maven.lifecycle.internal.LifecycleModuleBuilder.buildProject (LifecycleModuleBuilder.java:81)
at org.apache.maven.lifecycle.internal.builder.singlethreaded.SingleThreadedBuilder.build (SingleThreadedBuilder.java:56)
at org.apache.maven.lifecycle.internal.LifecycleStarter.execute (LifecycleStarter.java:128)
at org.apache.maven.DefaultMaven.doExecute (DefaultMaven.java:305)
at org.apache.maven.DefaultMaven.doExecute (DefaultMaven.java:192)
at org.apache.maven.DefaultMaven.execute (DefaultMaven.java:105)
at org.jvnet.hudson.maven3.launcher.Maven35Launcher.main (Maven35Launcher.java:130)
at sun.reflect.NativeMethodAccessorImpl.invoke0 (Native Method)
at sun.reflect.NativeMethodAccessorImpl.invoke (NativeMethodAccessorImpl.java:62)
at sun.reflect.DelegatingMethodAccessorImpl.invoke (DelegatingMethodAccessorImpl.java:43)
at java.lang.reflect.Method.invoke (Method.java:498)
at org.codehaus.plexus.classworlds.launcher.Launcher.launchEnhanced (Launcher.java:282)
at org.codehaus.plexus.classworlds.launcher.Launcher.launch (Launcher.java:225)
at jenkins.maven3.agent.Maven35Main.launch (Maven35Main.java:178)
at sun.reflect.NativeMethodAccessorImpl.invoke0 (Native Method)
at sun.reflect.NativeMethodAccessorImpl.invoke (NativeMethodAccessorImpl.java:62)
at sun.reflect.DelegatingMethodAccessorImpl.invoke (DelegatingMethodAccessorImpl.java:43)
at java.lang.reflect.Method.invoke (Method.java:498)
at hudson.maven.Maven3Builder.call (Maven3Builder.java:139)
at hudson.maven.Maven3Builder.call (Maven3Builder.java:70)
at hudson.remoting.UserRequest.perform (UserRequest.java:212)
at hudson.remoting.UserRequest.perform (UserRequest.java:54)
at hudson.remoting.Request$2.run (Request.java:369)
at hudson.remoting.InterceptingExecutorService$1.call (InterceptingExecutorService.java:72)
at java.util.concurrent.FutureTask.run (FutureTask.java:266)
at java.util.concurrent.ThreadPoolExecutor.runWorker (ThreadPoolExecutor.java:1149)
at java.util.concurrent.ThreadPoolExecutor$Worker.run (ThreadPoolExecutor.java:624)
at java.lang.Thread.run (Thread.java:748)
Caused by: org.apache.maven.plugin.MojoExecutionException: An Ant BuildException has occured: Generated dependency info does not match the reference. Ensure LICENCE and NOTICE files are correct and then update the reference by running again with -Dupdate-dependency-reference. Generated file: '<https://builds.apache.org/job/Qpid-Broker-J-Checks/ws/apache-qpid-broker-j/target/dependency-change-verification/PROCESSED_DEPENDENCIES_INFO'.> Reference file: '<https://builds.apache.org/job/Qpid-Broker-J-Checks/ws/apache-qpid-broker-j/src/main/assembly/dependency-verification/DEPENDENCIES_REFERENCE'.>
around Ant part ...<fail message="Generated dependency info does not match the reference. Ensure LICENCE and NOTICE files are correct and then update the reference by running again with -Dupdate-dependency-reference. Generated file: '${dependency-verification-output-file}'. Reference file: '<https://builds.apache.org/job/Qpid-Broker-J-Checks/ws/apache-qpid-broker-j/src/main/assembly/dependency-verification/DEPENDENCIES_REFERENCE'.">...> @ 48:444 in <https://builds.apache.org/job/Qpid-Broker-J-Checks/ws/apache-qpid-broker-j/target/antrun/build-main.xml>
at org.apache.maven.plugin.antrun.AntRunMojo.execute (AntRunMojo.java:342)
at org.apache.maven.plugin.DefaultBuildPluginManager.executeMojo (DefaultBuildPluginManager.java:137)
at org.apache.maven.lifecycle.internal.MojoExecutor.execute (MojoExecutor.java:210)
at org.apache.maven.lifecycle.internal.MojoExecutor.execute (MojoExecutor.java:156)
at org.apache.maven.lifecycle.internal.MojoExecutor.execute (MojoExecutor.java:148)
at org.apache.maven.lifecycle.internal.LifecycleModuleBuilder.buildProject (LifecycleModuleBuilder.java:117)
at org.apache.maven.lifecycle.internal.LifecycleModuleBuilder.buildProject (LifecycleModuleBuilder.java:81)
at org.apache.maven.lifecycle.internal.builder.singlethreaded.SingleThreadedBuilder.build (SingleThreadedBuilder.java:56)
at org.apache.maven.lifecycle.internal.LifecycleStarter.execute (LifecycleStarter.java:128)
at org.apache.maven.DefaultMaven.doExecute (DefaultMaven.java:305)
at org.apache.maven.DefaultMaven.doExecute (DefaultMaven.java:192)
at org.apache.maven.DefaultMaven.execute (DefaultMaven.java:105)
at org.jvnet.hudson.maven3.launcher.Maven35Launcher.main (Maven35Launcher.java:130)
at sun.reflect.NativeMethodAccessorImpl.invoke0 (Native Method)
at sun.reflect.NativeMethodAccessorImpl.invoke (NativeMethodAccessorImpl.java:62)
at sun.reflect.DelegatingMethodAccessorImpl.invoke (DelegatingMethodAccessorImpl.java:43)
at java.lang.reflect.Method.invoke (Method.java:498)
at org.codehaus.plexus.classworlds.launcher.Launcher.launchEnhanced (Launcher.java:282)
at org.codehaus.plexus.classworlds.launcher.Launcher.launch (Launcher.java:225)
at jenkins.maven3.agent.Maven35Main.launch (Maven35Main.java:178)
at sun.reflect.NativeMethodAccessorImpl.invoke0 (Native Method)
at sun.reflect.NativeMethodAccessorImpl.invoke (NativeMethodAccessorImpl.java:62)
at sun.reflect.DelegatingMethodAccessorImpl.invoke (DelegatingMethodAccessorImpl.java:43)
at java.lang.reflect.Method.invoke (Method.java:498)
at hudson.maven.Maven3Builder.call (Maven3Builder.java:139)
at hudson.maven.Maven3Builder.call (Maven3Builder.java:70)
at hudson.remoting.UserRequest.perform (UserRequest.java:212)
at hudson.remoting.UserRequest.perform (UserRequest.java:54)
at hudson.remoting.Request$2.run (Request.java:369)
at hudson.remoting.InterceptingExecutorService$1.call (InterceptingExecutorService.java:72)
at java.util.concurrent.FutureTask.run (FutureTask.java:266)
at java.util.concurrent.ThreadPoolExecutor.runWorker (ThreadPoolExecutor.java:1149)
at java.util.concurrent.ThreadPoolExecutor$Worker.run (ThreadPoolExecutor.java:624)
at java.lang.Thread.run (Thread.java:748)
Caused by: org.apache.tools.ant.BuildException: Generated dependency info does not match the reference. Ensure LICENCE and NOTICE files are correct and then update the reference by running again with -Dupdate-dependency-reference. Generated file: '<https://builds.apache.org/job/Qpid-Broker-J-Checks/ws/apache-qpid-broker-j/target/dependency-change-verification/PROCESSED_DEPENDENCIES_INFO'.> Reference file: '<https://builds.apache.org/job/Qpid-Broker-J-Checks/ws/apache-qpid-broker-j/src/main/assembly/dependency-verification/DEPENDENCIES_REFERENCE'.>
at org.apache.tools.ant.taskdefs.Exit.execute (Exit.java:164)
at org.apache.tools.ant.UnknownElement.execute (UnknownElement.java:292)
at sun.reflect.GeneratedMethodAccessor42.invoke (Unknown Source)
at sun.reflect.DelegatingMethodAccessorImpl.invoke (DelegatingMethodAccessorImpl.java:43)
at java.lang.reflect.Method.invoke (Method.java:498)
at org.apache.tools.ant.dispatch.DispatchUtils.execute (DispatchUtils.java:106)
at org.apache.tools.ant.Task.perform (Task.java:348)
at org.apache.tools.ant.Target.execute (Target.java:435)
at org.apache.tools.ant.Target.performTasks (Target.java:456)
at org.apache.tools.ant.Project.executeSortedTargets (Project.java:1393)
at org.apache.tools.ant.Project.executeTarget (Project.java:1364)
at org.apache.maven.plugin.antrun.AntRunMojo.execute (AntRunMojo.java:313)
at org.apache.maven.plugin.DefaultBuildPluginManager.executeMojo (DefaultBuildPluginManager.java:137)
at org.apache.maven.lifecycle.internal.MojoExecutor.execute (MojoExecutor.java:210)
at org.apache.maven.lifecycle.internal.MojoExecutor.execute (MojoExecutor.java:156)
at org.apache.maven.lifecycle.internal.MojoExecutor.execute (MojoExecutor.java:148)
at org.apache.maven.lifecycle.internal.LifecycleModuleBuilder.buildProject (LifecycleModuleBuilder.java:117)
at org.apache.maven.lifecycle.internal.LifecycleModuleBuilder.buildProject (LifecycleModuleBuilder.java:81)
at org.apache.maven.lifecycle.internal.builder.singlethreaded.SingleThreadedBuilder.build (SingleThreadedBuilder.java:56)
at org.apache.maven.lifecycle.internal.LifecycleStarter.execute (LifecycleStarter.java:128)
at org.apache.maven.DefaultMaven.doExecute (DefaultMaven.java:305)
at org.apache.maven.DefaultMaven.doExecute (DefaultMaven.java:192)
at org.apache.maven.DefaultMaven.execute (DefaultMaven.java:105)
at org.jvnet.hudson.maven3.launcher.Maven35Launcher.main (Maven35Launcher.java:130)
at sun.reflect.NativeMethodAccessorImpl.invoke0 (Native Method)
at sun.reflect.NativeMethodAccessorImpl.invoke (NativeMethodAccessorImpl.java:62)
at sun.reflect.DelegatingMethodAccessorImpl.invoke (DelegatingMethodAccessorImpl.java:43)
at java.lang.reflect.Method.invoke (Method.java:498)
at org.codehaus.plexus.classworlds.launcher.Launcher.launchEnhanced (Launcher.java:282)
at org.codehaus.plexus.classworlds.launcher.Launcher.launch (Launcher.java:225)
at jenkins.maven3.agent.Maven35Main.launch (Maven35Main.java:178)
at sun.reflect.NativeMethodAccessorImpl.invoke0 (Native Method)
at sun.reflect.NativeMethodAccessorImpl.invoke (NativeMethodAccessorImpl.java:62)
at sun.reflect.DelegatingMethodAccessorImpl.invoke (DelegatingMethodAccessorImpl.java:43)
at java.lang.reflect.Method.invoke (Method.java:498)
at hudson.maven.Maven3Builder.call (Maven3Builder.java:139)
at hudson.maven.Maven3Builder.call (Maven3Builder.java:70)
at hudson.remoting.UserRequest.perform (UserRequest.java:212)
at hudson.remoting.UserRequest.perform (UserRequest.java:54)
at hudson.remoting.Request$2.run (Request.java:369)
at hudson.remoting.InterceptingExecutorService$1.call (InterceptingExecutorService.java:72)
at java.util.concurrent.FutureTask.run (FutureTask.java:266)
at java.util.concurrent.ThreadPoolExecutor.runWorker (ThreadPoolExecutor.java:1149)
at java.util.concurrent.ThreadPoolExecutor$Worker.run (ThreadPoolExecutor.java:624)
at java.lang.Thread.run (Thread.java:748)
[ERROR]
[ERROR] Re-run Maven using the -X switch to enable full debug logging.
[ERROR]
[ERROR] For more information about the errors and possible solutions, please read the following articles:
[ERROR] [Help 1] http://cwiki.apache.org/confluence/display/MAVEN/MojoExecutionException
[ERROR]
[ERROR] After correcting the problems, you can resume the build with the command
[ERROR] mvn <goals> -rf :apache-qpid-broker-j
channel stopped
Archiving artifacts
[Fast Archiver] Compressed 576.59 KB of artifacts by 33.3% relative to #1116
Jenkins build is back to normal : Qpid-Broker-J-Checks #1119
Posted by Apache Jenkins Server <je...@builds.apache.org>.
See <https://builds.apache.org/job/Qpid-Broker-J-Checks/1119/display/redirect?page=changes>
Build failed in Jenkins: Qpid-Broker-J-Checks #1118
Posted by Apache Jenkins Server <je...@builds.apache.org>.
See <https://builds.apache.org/job/Qpid-Broker-J-Checks/1118/display/redirect?page=changes>
Changes:
[orudyy] QPID-8422: [Broker-J] Update test dependecies to the latest versions
------------------------------------------
[...truncated 1.82 MB...]
[INFO]
[INFO] --- maven-assembly-plugin:3.0.0:single (source-release-assembly) @ qpid-broker-j-developer-guide ---
[INFO] Assemblies have been skipped per configuration of the skipAssembly parameter.
[INFO]
[INFO] --- maven-source-plugin:3.0.1:jar-no-fork (attach-sources) @ qpid-broker-j-developer-guide ---
[INFO] Building jar: <https://builds.apache.org/job/Qpid-Broker-J-Checks/ws/doc/developer-guide/target/qpid-broker-j-developer-guide-8.0.0-SNAPSHOT-sources.jar>
[INFO]
[INFO] --- maven-javadoc-plugin:3.0.1:jar (attach-javadocs) @ qpid-broker-j-developer-guide ---
[INFO]
[INFO] --- maven-gpg-plugin:1.6:sign (sign-release-artifacts) @ qpid-broker-j-developer-guide ---
[INFO]
[INFO] --- checksum-maven-plugin:1.7:files (source-release-checksum) @ qpid-broker-j-developer-guide ---
[JENKINS] Archiving disabled
[JENKINS] Archiving disabled
[JENKINS] Archiving disabled
[JENKINS] Archiving disabled
[JENKINS] Archiving disabled
[JENKINS] Archiving disabled
[JENKINS] Archiving disabled
[JENKINS] Archiving disabled
[JENKINS] Archiving disabled
[JENKINS] Archiving disabled
[JENKINS] Archiving disabled
[JENKINS] Archiving disabled
[JENKINS] Archiving disabled
[JENKINS] Archiving disabled
[JENKINS] Archiving disabled
[JENKINS] Archiving disabled
[JENKINS] Archiving disabled
[JENKINS] Archiving disabled
[JENKINS] Archiving disabled
[JENKINS] Archiving disabled
[JENKINS] Archiving disabled
[JENKINS] Archiving disabled
[JENKINS] Archiving disabled
[JENKINS] Archiving disabled
[JENKINS] Archiving disabled
[JENKINS] Archiving disabled
[JENKINS] Archiving disabled
[JENKINS] Archiving disabled
[JENKINS] Archiving disabled
[JENKINS] Archiving disabled
[JENKINS] Archiving disabled
[JENKINS] Archiving disabled
[JENKINS] Archiving disabled
[JENKINS] Archiving disabled
[JENKINS] Archiving disabled
[JENKINS] Archiving disabled
[JENKINS] Archiving disabled
[JENKINS] Archiving disabled
[JENKINS] Archiving disabled
[JENKINS] Archiving disabled
[JENKINS] Archiving disabled
[JENKINS] Archiving disabled
[JENKINS] Archiving disabled
[JENKINS] Archiving disabled
[JENKINS] Archiving disabled
[JENKINS] Archiving disabled
[JENKINS] Archiving disabled
[JENKINS] Archiving disabled
[JENKINS] Archiving disabled
[INFO] ------------------------------------------------------------------------
[INFO] Reactor Summary for Apache Qpid Broker-J Parent 8.0.0-SNAPSHOT:
[INFO]
[INFO] Apache Qpid Broker-J Parent ........................ SUCCESS [ 13.306 s]
[INFO] Apache Qpid Broker-J Code Generation ............... SUCCESS [ 11.189 s]
[INFO] Apache Qpid Broker-J Test Utilities ................ SUCCESS [ 9.948 s]
[INFO] Apache Qpid Broker-J Core .......................... SUCCESS [01:49 min]
[INFO] Apache Qpid Broker-J LogBack Logging Plug-in ....... SUCCESS [ 14.607 s]
[INFO] Apache Qpid Broker-J Access Control Plug-in ........ SUCCESS [ 10.216 s]
[INFO] Apache Qpid Broker-J AMQP 0-10 Protocol Plug-in .... SUCCESS [ 15.428 s]
[INFO] Apache Qpid Broker-J AMQP 0-8 Protocol Plug-in ..... SUCCESS [ 15.847 s]
[INFO] Apache Qpid Broker-J AMQP 1-0 Protocol Plug-in ..... SUCCESS [ 18.081 s]
[INFO] Apache Qpid Broker-J AMQP 0-8 to 0-10 Message Conversion Plug-in SUCCESS [ 7.443 s]
[INFO] Apache Qpid Broker-J AMQP 0-8 to 1-0 Message Conversion Plug-in SUCCESS [ 7.519 s]
[INFO] Apache Qpid Broker-J AMQP 0-10 to 1-0 Message Conversion Plug-in SUCCESS [ 7.949 s]
[INFO] Apache Qpid Broker-J JDBC Message Store Plug-in .... SUCCESS [ 10.687 s]
[INFO] Apache Qpid Broker-J Derby Message Store Plug-in ... SUCCESS [ 9.681 s]
[INFO] Apache Qpid Broker-J JDBC Message Store Connection Pooling Plug-in SUCCESS [ 6.975 s]
[INFO] Apache Qpid Broker-J LogBack JDBC Logging Plug-in .. SUCCESS [ 12.723 s]
[INFO] Apache Qpid AMQP 1.0 JDBC Link Store Plug-in ....... SUCCESS [ 9.137 s]
[INFO] Apache Qpid Broker-J HTTP Management Plug-in ....... SUCCESS [ 16.974 s]
[INFO] Apache Qpid Broker-J AMQP Management Protocol Plug-in SUCCESS [ 8.744 s]
[INFO] Apache Qpid Broker-J Memory Message Store Plug-in .. SUCCESS [ 8.297 s]
[INFO] Apache Qpid Broker-J WebSocket Plug-in ............. SUCCESS [ 7.724 s]
[INFO] Apache Qpid Broker-J BDB Message Store Plug-in ..... SUCCESS [ 15.246 s]
[INFO] Apache Qpid AMQP 1.0 BDB Link Store Plug-in ........ SUCCESS [ 7.255 s]
[INFO] Apache Qpid Broker-J ............................... SUCCESS [ 7.559 s]
[INFO] Apache Qpid Broker-J Bundles ....................... FAILURE [ 3.479 s]
[INFO] Apache Qpid Broker-J Tools ......................... SUCCESS [ 7.128 s]
[INFO] Apache Qpid Broker-J System Test Parent ............ SUCCESS [ 3.667 s]
[INFO] Apache Qpid Broker-J System Test Utils ............. SUCCESS [ 5.481 s]
[INFO] Apache Qpid Broker-J JMS System Tests Core ......... SUCCESS [ 5.842 s]
[INFO] Apache Qpid Broker-J JMS 1.1 System Tests .......... SUCCESS [ 20.995 s]
[INFO] Apache Qpid Broker-J JMS 2.0 System Tests .......... SUCCESS [ 5.778 s]
[INFO] Apache Qpid Broker-J HTTP system tests ............. SUCCESS [ 7.300 s]
[INFO] Apache Qpid Broker-J Protocol Tests Core ........... SUCCESS [ 5.403 s]
[INFO] Apache Qpid Protocol Tests for AMQP 0-8,0-9,0-9-1 .. SUCCESS [ 7.223 s]
[INFO] Apache Qpid Protocol Tests for AMQP 0-10 ........... SUCCESS [ 6.102 s]
[INFO] Apache Qpid Protocol Tests for AMQP 1.0 ............ SUCCESS [ 8.606 s]
[INFO] Apache Qpid Broker-J System Tests Spawn Broker Admin SUCCESS [ 7.766 s]
[INFO] Apache Qpid Broker-J End to End Conversion Tests ... SUCCESS [ 8.236 s]
[INFO] Apache Qpid Broker-J Performance Tests ............. SUCCESS [ 14.874 s]
[INFO] Apache Qpid Broker-J Performance Test System Tests . SUCCESS [ 5.804 s]
[INFO] Apache Qpid Broker-J Performance Tests Visualisation JFC SUCCESS [ 10.251 s]
[INFO] Apache Qpid Broker-J BDB Store System Tests ........ SUCCESS [ 6.651 s]
[INFO] Apache Qpid Joram JMS Tests ........................ SUCCESS [ 7.319 s]
[INFO] Apache Qpid Broker-J JMS TCK Configuration ......... SUCCESS [ 6.630 s]
[INFO] Apache Qpid Broker-J Docbook ....................... SUCCESS [ 3.606 s]
[INFO] Apache Qpid Broker-J Docbook ....................... SUCCESS [ 5.795 s]
[INFO] Apache Qpid Broker-J Performance Test Docbook ...... SUCCESS [ 4.954 s]
[INFO] Apache Qpid Broker-J Developer Guide ............... SUCCESS [ 6.821 s]
[INFO] ------------------------------------------------------------------------
[INFO] BUILD FAILURE
[INFO] ------------------------------------------------------------------------
[INFO] Total time: 12:19 min
[INFO] Finished at: 2020-02-22T03:20:55Z
[INFO] ------------------------------------------------------------------------
Waiting for Jenkins to finish collecting data
[ERROR] Failed to execute goal org.apache.maven.plugins:maven-antrun-plugin:1.8:run (dependency-change-verification) on project apache-qpid-broker-j: An Ant BuildException has occured: Generated dependency info does not match the reference. Ensure LICENCE and NOTICE files are correct and then update the reference by running again with -Dupdate-dependency-reference. Generated file: '<https://builds.apache.org/job/Qpid-Broker-J-Checks/ws/apache-qpid-broker-j/target/dependency-change-verification/PROCESSED_DEPENDENCIES_INFO'.> Reference file: '<https://builds.apache.org/job/Qpid-Broker-J-Checks/ws/apache-qpid-broker-j/src/main/assembly/dependency-verification/DEPENDENCIES_REFERENCE'.>
[ERROR] around Ant part ...<fail message="Generated dependency info does not match the reference. Ensure LICENCE and NOTICE files are correct and then update the reference by running again with -Dupdate-dependency-reference. Generated file: '${dependency-verification-output-file}'. Reference file: '<https://builds.apache.org/job/Qpid-Broker-J-Checks/ws/apache-qpid-broker-j/src/main/assembly/dependency-verification/DEPENDENCIES_REFERENCE'.">...> @ 48:444 in <https://builds.apache.org/job/Qpid-Broker-J-Checks/ws/apache-qpid-broker-j/target/antrun/build-main.xml>
[ERROR] -> [Help 1]
org.apache.maven.lifecycle.LifecycleExecutionException: Failed to execute goal org.apache.maven.plugins:maven-antrun-plugin:1.8:run (dependency-change-verification) on project apache-qpid-broker-j: An Ant BuildException has occured: Generated dependency info does not match the reference. Ensure LICENCE and NOTICE files are correct and then update the reference by running again with -Dupdate-dependency-reference. Generated file: '<https://builds.apache.org/job/Qpid-Broker-J-Checks/ws/apache-qpid-broker-j/target/dependency-change-verification/PROCESSED_DEPENDENCIES_INFO'.> Reference file: '<https://builds.apache.org/job/Qpid-Broker-J-Checks/ws/apache-qpid-broker-j/src/main/assembly/dependency-verification/DEPENDENCIES_REFERENCE'.>
around Ant part ...<fail message="Generated dependency info does not match the reference. Ensure LICENCE and NOTICE files are correct and then update the reference by running again with -Dupdate-dependency-reference. Generated file: '${dependency-verification-output-file}'. Reference file: '<https://builds.apache.org/job/Qpid-Broker-J-Checks/ws/apache-qpid-broker-j/src/main/assembly/dependency-verification/DEPENDENCIES_REFERENCE'.">...> @ 48:444 in <https://builds.apache.org/job/Qpid-Broker-J-Checks/ws/apache-qpid-broker-j/target/antrun/build-main.xml>
at org.apache.maven.lifecycle.internal.MojoExecutor.execute (MojoExecutor.java:215)
at org.apache.maven.lifecycle.internal.MojoExecutor.execute (MojoExecutor.java:156)
at org.apache.maven.lifecycle.internal.MojoExecutor.execute (MojoExecutor.java:148)
at org.apache.maven.lifecycle.internal.LifecycleModuleBuilder.buildProject (LifecycleModuleBuilder.java:117)
at org.apache.maven.lifecycle.internal.LifecycleModuleBuilder.buildProject (LifecycleModuleBuilder.java:81)
at org.apache.maven.lifecycle.internal.builder.singlethreaded.SingleThreadedBuilder.build (SingleThreadedBuilder.java:56)
at org.apache.maven.lifecycle.internal.LifecycleStarter.execute (LifecycleStarter.java:128)
at org.apache.maven.DefaultMaven.doExecute (DefaultMaven.java:305)
at org.apache.maven.DefaultMaven.doExecute (DefaultMaven.java:192)
at org.apache.maven.DefaultMaven.execute (DefaultMaven.java:105)
at org.jvnet.hudson.maven3.launcher.Maven35Launcher.main (Maven35Launcher.java:130)
at sun.reflect.NativeMethodAccessorImpl.invoke0 (Native Method)
at sun.reflect.NativeMethodAccessorImpl.invoke (NativeMethodAccessorImpl.java:62)
at sun.reflect.DelegatingMethodAccessorImpl.invoke (DelegatingMethodAccessorImpl.java:43)
at java.lang.reflect.Method.invoke (Method.java:498)
at org.codehaus.plexus.classworlds.launcher.Launcher.launchEnhanced (Launcher.java:282)
at org.codehaus.plexus.classworlds.launcher.Launcher.launch (Launcher.java:225)
at jenkins.maven3.agent.Maven35Main.launch (Maven35Main.java:178)
at sun.reflect.NativeMethodAccessorImpl.invoke0 (Native Method)
at sun.reflect.NativeMethodAccessorImpl.invoke (NativeMethodAccessorImpl.java:62)
at sun.reflect.DelegatingMethodAccessorImpl.invoke (DelegatingMethodAccessorImpl.java:43)
at java.lang.reflect.Method.invoke (Method.java:498)
at hudson.maven.Maven3Builder.call (Maven3Builder.java:139)
at hudson.maven.Maven3Builder.call (Maven3Builder.java:70)
at hudson.remoting.UserRequest.perform (UserRequest.java:212)
at hudson.remoting.UserRequest.perform (UserRequest.java:54)
at hudson.remoting.Request$2.run (Request.java:369)
at hudson.remoting.InterceptingExecutorService$1.call (InterceptingExecutorService.java:72)
at java.util.concurrent.FutureTask.run (FutureTask.java:266)
at java.util.concurrent.ThreadPoolExecutor.runWorker (ThreadPoolExecutor.java:1149)
at java.util.concurrent.ThreadPoolExecutor$Worker.run (ThreadPoolExecutor.java:624)
at java.lang.Thread.run (Thread.java:748)
Caused by: org.apache.maven.plugin.MojoExecutionException: An Ant BuildException has occured: Generated dependency info does not match the reference. Ensure LICENCE and NOTICE files are correct and then update the reference by running again with -Dupdate-dependency-reference. Generated file: '<https://builds.apache.org/job/Qpid-Broker-J-Checks/ws/apache-qpid-broker-j/target/dependency-change-verification/PROCESSED_DEPENDENCIES_INFO'.> Reference file: '<https://builds.apache.org/job/Qpid-Broker-J-Checks/ws/apache-qpid-broker-j/src/main/assembly/dependency-verification/DEPENDENCIES_REFERENCE'.>
around Ant part ...<fail message="Generated dependency info does not match the reference. Ensure LICENCE and NOTICE files are correct and then update the reference by running again with -Dupdate-dependency-reference. Generated file: '${dependency-verification-output-file}'. Reference file: '<https://builds.apache.org/job/Qpid-Broker-J-Checks/ws/apache-qpid-broker-j/src/main/assembly/dependency-verification/DEPENDENCIES_REFERENCE'.">...> @ 48:444 in <https://builds.apache.org/job/Qpid-Broker-J-Checks/ws/apache-qpid-broker-j/target/antrun/build-main.xml>
at org.apache.maven.plugin.antrun.AntRunMojo.execute (AntRunMojo.java:342)
at org.apache.maven.plugin.DefaultBuildPluginManager.executeMojo (DefaultBuildPluginManager.java:137)
at org.apache.maven.lifecycle.internal.MojoExecutor.execute (MojoExecutor.java:210)
at org.apache.maven.lifecycle.internal.MojoExecutor.execute (MojoExecutor.java:156)
at org.apache.maven.lifecycle.internal.MojoExecutor.execute (MojoExecutor.java:148)
at org.apache.maven.lifecycle.internal.LifecycleModuleBuilder.buildProject (LifecycleModuleBuilder.java:117)
at org.apache.maven.lifecycle.internal.LifecycleModuleBuilder.buildProject (LifecycleModuleBuilder.java:81)
at org.apache.maven.lifecycle.internal.builder.singlethreaded.SingleThreadedBuilder.build (SingleThreadedBuilder.java:56)
at org.apache.maven.lifecycle.internal.LifecycleStarter.execute (LifecycleStarter.java:128)
at org.apache.maven.DefaultMaven.doExecute (DefaultMaven.java:305)
at org.apache.maven.DefaultMaven.doExecute (DefaultMaven.java:192)
at org.apache.maven.DefaultMaven.execute (DefaultMaven.java:105)
at org.jvnet.hudson.maven3.launcher.Maven35Launcher.main (Maven35Launcher.java:130)
at sun.reflect.NativeMethodAccessorImpl.invoke0 (Native Method)
at sun.reflect.NativeMethodAccessorImpl.invoke (NativeMethodAccessorImpl.java:62)
at sun.reflect.DelegatingMethodAccessorImpl.invoke (DelegatingMethodAccessorImpl.java:43)
at java.lang.reflect.Method.invoke (Method.java:498)
at org.codehaus.plexus.classworlds.launcher.Launcher.launchEnhanced (Launcher.java:282)
at org.codehaus.plexus.classworlds.launcher.Launcher.launch (Launcher.java:225)
at jenkins.maven3.agent.Maven35Main.launch (Maven35Main.java:178)
at sun.reflect.NativeMethodAccessorImpl.invoke0 (Native Method)
at sun.reflect.NativeMethodAccessorImpl.invoke (NativeMethodAccessorImpl.java:62)
at sun.reflect.DelegatingMethodAccessorImpl.invoke (DelegatingMethodAccessorImpl.java:43)
at java.lang.reflect.Method.invoke (Method.java:498)
at hudson.maven.Maven3Builder.call (Maven3Builder.java:139)
at hudson.maven.Maven3Builder.call (Maven3Builder.java:70)
at hudson.remoting.UserRequest.perform (UserRequest.java:212)
at hudson.remoting.UserRequest.perform (UserRequest.java:54)
at hudson.remoting.Request$2.run (Request.java:369)
at hudson.remoting.InterceptingExecutorService$1.call (InterceptingExecutorService.java:72)
at java.util.concurrent.FutureTask.run (FutureTask.java:266)
at java.util.concurrent.ThreadPoolExecutor.runWorker (ThreadPoolExecutor.java:1149)
at java.util.concurrent.ThreadPoolExecutor$Worker.run (ThreadPoolExecutor.java:624)
at java.lang.Thread.run (Thread.java:748)
Caused by: org.apache.tools.ant.BuildException: Generated dependency info does not match the reference. Ensure LICENCE and NOTICE files are correct and then update the reference by running again with -Dupdate-dependency-reference. Generated file: '<https://builds.apache.org/job/Qpid-Broker-J-Checks/ws/apache-qpid-broker-j/target/dependency-change-verification/PROCESSED_DEPENDENCIES_INFO'.> Reference file: '<https://builds.apache.org/job/Qpid-Broker-J-Checks/ws/apache-qpid-broker-j/src/main/assembly/dependency-verification/DEPENDENCIES_REFERENCE'.>
at org.apache.tools.ant.taskdefs.Exit.execute (Exit.java:164)
at org.apache.tools.ant.UnknownElement.execute (UnknownElement.java:292)
at sun.reflect.GeneratedMethodAccessor42.invoke (Unknown Source)
at sun.reflect.DelegatingMethodAccessorImpl.invoke (DelegatingMethodAccessorImpl.java:43)
at java.lang.reflect.Method.invoke (Method.java:498)
at org.apache.tools.ant.dispatch.DispatchUtils.execute (DispatchUtils.java:106)
at org.apache.tools.ant.Task.perform (Task.java:348)
at org.apache.tools.ant.Target.execute (Target.java:435)
at org.apache.tools.ant.Target.performTasks (Target.java:456)
at org.apache.tools.ant.Project.executeSortedTargets (Project.java:1393)
at org.apache.tools.ant.Project.executeTarget (Project.java:1364)
at org.apache.maven.plugin.antrun.AntRunMojo.execute (AntRunMojo.java:313)
at org.apache.maven.plugin.DefaultBuildPluginManager.executeMojo (DefaultBuildPluginManager.java:137)
at org.apache.maven.lifecycle.internal.MojoExecutor.execute (MojoExecutor.java:210)
at org.apache.maven.lifecycle.internal.MojoExecutor.execute (MojoExecutor.java:156)
at org.apache.maven.lifecycle.internal.MojoExecutor.execute (MojoExecutor.java:148)
at org.apache.maven.lifecycle.internal.LifecycleModuleBuilder.buildProject (LifecycleModuleBuilder.java:117)
at org.apache.maven.lifecycle.internal.LifecycleModuleBuilder.buildProject (LifecycleModuleBuilder.java:81)
at org.apache.maven.lifecycle.internal.builder.singlethreaded.SingleThreadedBuilder.build (SingleThreadedBuilder.java:56)
at org.apache.maven.lifecycle.internal.LifecycleStarter.execute (LifecycleStarter.java:128)
at org.apache.maven.DefaultMaven.doExecute (DefaultMaven.java:305)
at org.apache.maven.DefaultMaven.doExecute (DefaultMaven.java:192)
at org.apache.maven.DefaultMaven.execute (DefaultMaven.java:105)
at org.jvnet.hudson.maven3.launcher.Maven35Launcher.main (Maven35Launcher.java:130)
at sun.reflect.NativeMethodAccessorImpl.invoke0 (Native Method)
at sun.reflect.NativeMethodAccessorImpl.invoke (NativeMethodAccessorImpl.java:62)
at sun.reflect.DelegatingMethodAccessorImpl.invoke (DelegatingMethodAccessorImpl.java:43)
at java.lang.reflect.Method.invoke (Method.java:498)
at org.codehaus.plexus.classworlds.launcher.Launcher.launchEnhanced (Launcher.java:282)
at org.codehaus.plexus.classworlds.launcher.Launcher.launch (Launcher.java:225)
at jenkins.maven3.agent.Maven35Main.launch (Maven35Main.java:178)
at sun.reflect.NativeMethodAccessorImpl.invoke0 (Native Method)
at sun.reflect.NativeMethodAccessorImpl.invoke (NativeMethodAccessorImpl.java:62)
at sun.reflect.DelegatingMethodAccessorImpl.invoke (DelegatingMethodAccessorImpl.java:43)
at java.lang.reflect.Method.invoke (Method.java:498)
at hudson.maven.Maven3Builder.call (Maven3Builder.java:139)
at hudson.maven.Maven3Builder.call (Maven3Builder.java:70)
at hudson.remoting.UserRequest.perform (UserRequest.java:212)
at hudson.remoting.UserRequest.perform (UserRequest.java:54)
at hudson.remoting.Request$2.run (Request.java:369)
at hudson.remoting.InterceptingExecutorService$1.call (InterceptingExecutorService.java:72)
at java.util.concurrent.FutureTask.run (FutureTask.java:266)
at java.util.concurrent.ThreadPoolExecutor.runWorker (ThreadPoolExecutor.java:1149)
at java.util.concurrent.ThreadPoolExecutor$Worker.run (ThreadPoolExecutor.java:624)
at java.lang.Thread.run (Thread.java:748)
[ERROR]
[ERROR] Re-run Maven using the -X switch to enable full debug logging.
[ERROR]
[ERROR] For more information about the errors and possible solutions, please read the following articles:
[ERROR] [Help 1] http://cwiki.apache.org/confluence/display/MAVEN/MojoExecutionException
[ERROR]
[ERROR] After correcting the problems, you can resume the build with the command
[ERROR] mvn <goals> -rf :apache-qpid-broker-j
channel stopped
Archiving artifacts
[Fast Archiver] Compressed 576.59 KB of artifacts by 33.3% relative to #1116