You are viewing a plain text version of this content. The canonical link for it is here.
Posted to builds@beam.apache.org by Apache Jenkins Server <je...@builds.apache.org> on 2023/01/31 11:21:31 UTC
Build failed in Jenkins: beam_PostCommit_XVR_Direct #3693
See <https://ci-beam.apache.org/job/beam_PostCommit_XVR_Direct/3693/display/redirect?page=changes>
Changes:
[noreply] Standardizing naming and URN for Pubsub Read Schema Transform (#25170)
------------------------------------------
[...truncated 589.00 KB...]
pydot==1.4.2
PyHamcrest==1.10.1
pymongo==3.13.0
PyMySQL==1.0.2
pyparsing==3.0.9
pytest==7.2.1
pytest-forked==1.4.0
pytest-timeout==2.1.0
pytest-xdist==2.5.0
python-dateutil==2.8.2
python-snappy==0.6.1
pytz==2022.7.1
PyYAML==6.0
regex==2022.10.31
requests==2.28.2
requests-mock==1.10.0
requests-oauthlib==1.3.1
rsa==4.9
scikit-learn==1.0.2
scipy==1.7.3
setuptools==67.0.0
six==1.16.0
sortedcontainers==2.4.0
soupsieve==2.3.2.post1
SQLAlchemy==1.4.46
sqlparse==0.4.3
tenacity==5.1.5
tensorboard==2.11.2
tensorboard-data-server==0.6.1
tensorboard-plugin-wit==1.8.1
tensorflow==2.11.0
tensorflow-estimator==2.11.0
tensorflow-io-gcs-filesystem==0.30.0
termcolor==2.2.0
testcontainers==3.7.1
threadpoolctl==3.1.0
tomli==2.0.1
tqdm==4.64.1
typing_extensions==4.4.0
uritemplate==4.1.1
urllib3==1.26.14
websocket-client==1.4.2
Werkzeug==2.2.2
wheel==0.38.4
wrapt==1.14.1
zipp==3.11.0
zstandard==0.19.0
Removing intermediate container 9d6ed74321ad
---> 5d030aebab99
Step 17/32 : COPY target/LICENSE /opt/apache/beam/
---> 1d7bd502b7a4
Step 18/32 : COPY target/LICENSE.python /opt/apache/beam/
---> 21530bbe1d82
Step 19/32 : COPY target/NOTICE /opt/apache/beam/
---> aedaecf09790
Step 20/32 : COPY target/launcher/linux_amd64/boot /opt/apache/beam/
---> 9435df2c9b22
Step 21/32 : ENTRYPOINT ["/opt/apache/beam/boot"]
---> Running in 37b5757cb09c
Removing intermediate container 37b5757cb09c
---> d6df06b024a0
Step 22/32 : FROM beam as third_party_licenses
---> d6df06b024a0
Step 23/32 : ARG pull_licenses
---> Running in 9116543ecf4d
Removing intermediate container 9116543ecf4d
---> ef1be8ffe3a0
Step 24/32 : COPY target/license_scripts /tmp/license_scripts/
---> 24bc135ad3f3
Step 25/32 : COPY target/LICENSE target/go-licenses/* /opt/apache/beam/third_party_licenses/golang/
---> fb58ac330aa5
Step 26/32 : RUN rm /opt/apache/beam/third_party_licenses/golang/LICENSE
---> Running in cb00d807ea94
Removing intermediate container cb00d807ea94
---> bc84d0146c35
Step 27/32 : COPY target/license_scripts /tmp/license_scripts/
---> 482d4a9efa9c
Step 28/32 : RUN if [ "$pull_licenses" = "true" ] ; then pip install 'pip-licenses<4.0.0' pyyaml tenacity && python /tmp/license_scripts/pull_licenses_py.py ; fi
---> Running in 1c591894aa67
Collecting pip-licenses<4.0.0
Downloading pip_licenses-3.5.5-py3-none-any.whl (17 kB)
Requirement already satisfied: pyyaml in /usr/local/lib/python3.7/site-packages (6.0)
Requirement already satisfied: tenacity in /usr/local/lib/python3.7/site-packages (5.1.5)
Collecting PTable
Downloading PTable-0.9.2.tar.gz (31 kB)
Preparing metadata (setup.py): started
Preparing metadata (setup.py): finished with status 'done'
Requirement already satisfied: six>=1.9.0 in /usr/local/lib/python3.7/site-packages (from tenacity) (1.16.0)
Building wheels for collected packages: PTable
Building wheel for PTable (setup.py): started
Building wheel for PTable (setup.py): finished with status 'done'
Created wheel for PTable: filename=PTable-0.9.2-py3-none-any.whl size=22908 sha256=1cebd76bc0d2fa4c46f76f17fa2f6f30ebea339b5b30dcdc59b7bc354a1b8e70
Stored in directory: /root/.cache/pip/wheels/33/df/2f/674985b3f8a2de3f96357d1eadef5110f74fa91b3785e52a54
Successfully built PTable
Installing collected packages: PTable, pip-licenses
Successfully installed PTable-0.9.2 pip-licenses-3.5.5
[91mWARNING: Running pip as the 'root' user can result in broken permissions and conflicting behaviour with the system package manager. It is recommended to use a virtual environment instead: https://pip.pypa.io/warnings/venv
[0m[91mERROR:root:Error occurred when pull license for flatbuffers from {'license': 'https://raw.githubusercontent.com/google/flatbuffers/master/LICENSE.txt'}.
[0m[91mTraceback (most recent call last):
File "/tmp/license_scripts/pull_licenses_py.py", line 98, in pull_from_url
headers={'User-Agent': 'Apache Beam'}))
File "/usr/local/lib/python3.7/urllib/request.py", line 222, in urlopen
return opener.open(url, data, timeout)
File "/usr/local/lib/python3.7/urllib/request.py", line 531, in open
response = meth(req, response)
File "/usr/local/lib/python3.7/urllib/request.py", line 641, in http_response
'http', request, response, code, msg, hdrs)
File "/usr/local/lib/python3.7/urllib/request.py", line 569, in error
return self._call_chain(*args)
File "/usr/local/lib/python3.7/urllib/request.py", line 503, in _call_chain
result = func(*args)
File "/usr/local/lib/python3.7/urllib/request.py", line 649, in http_error_default
raise HTTPError(req.full_url, code, msg, hdrs, fp)
urllib.error.HTTPError: HTTP Error 404: Not Found
ERROR:root:Error occurred when pull license for flatbuffers from {'license': 'https://raw.githubusercontent.com/google/flatbuffers/master/LICENSE.txt'}.
[0m[91mTraceback (most recent call last):
File "/tmp/license_scripts/pull_licenses_py.py", line 98, in pull_from_url
headers={'User-Agent': 'Apache Beam'}))
File "/usr/local/lib/python3.7/urllib/request.py", line 222, in urlopen
return opener.open(url, data, timeout)
File "/usr/local/lib/python3.7/urllib/request.py", line 531, in open
response = meth(req, response)
File "/usr/local/lib/python3.7/urllib/request.py", line 641, in http_response
'http', request, response, code, msg, hdrs)
File "/usr/local/lib/python3.7/urllib/request.py", line 569, in error
return self._call_chain(*args)
File "/usr/local/lib/python3.7/urllib/request.py", line 503, in _call_chain
result = func(*args)
File "/usr/local/lib/python3.7/urllib/request.py", line 649, in http_error_default
raise HTTPError(req.full_url, code, msg, hdrs, fp)
urllib.error.HTTPError: HTTP Error 404: Not Found
ERROR:root:Error occurred when pull license for flatbuffers from {'license': 'https://raw.githubusercontent.com/google/flatbuffers/master/LICENSE.txt'}.
[0m[91mTraceback (most recent call last):
File "/tmp/license_scripts/pull_licenses_py.py", line 98, in pull_from_url
headers={'User-Agent': 'Apache Beam'}))
File "/usr/local/lib/python3.7/urllib/request.py", line 222, in urlopen
return opener.open(url, data, timeout)
File "/usr/local/lib/python3.7/urllib/request.py", line 531, in open
response = meth(req, response)
File "/usr/local/lib/python3.7/urllib/request.py", line 641, in http_response
'http', request, response, code, msg, hdrs)
File "/usr/local/lib/python3.7/urllib/request.py", line 569, in error
return self._call_chain(*args)
File "/usr/local/lib/python3.7/urllib/request.py", line 503, in _call_chain
result = func(*args)
File "/usr/local/lib/python3.7/urllib/request.py", line 649, in http_error_default
raise HTTPError(req.full_url, code, msg, hdrs, fp)
urllib.error.HTTPError: HTTP Error 404: Not Found
ERROR:root:Error occurred when pull license for flatbuffers from {'license': 'https://raw.githubusercontent.com/google/flatbuffers/master/LICENSE.txt'}.
[0m[91mTraceback (most recent call last):
File "/tmp/license_scripts/pull_licenses_py.py", line 98, in pull_from_url
headers={'User-Agent': 'Apache Beam'}))
File "/usr/local/lib/python3.7/urllib/request.py", line 222, in urlopen
return opener.open(url, data, timeout)
File "/usr/local/lib/python3.7/urllib/request.py", line 531, in open
response = meth(req, response)
File "/usr/local/lib/python3.7/urllib/request.py", line 641, in http_response
'http', request, response, code, msg, hdrs)
File "/usr/local/lib/python3.7/urllib/request.py", line 569, in error
return self._call_chain(*args)
File "/usr/local/lib/python3.7/urllib/request.py", line 503, in _call_chain
result = func(*args)
File "/usr/local/lib/python3.7/urllib/request.py", line 649, in http_error_default
raise HTTPError(req.full_url, code, msg, hdrs, fp)
urllib.error.HTTPError: HTTP Error 404: Not Found
ERROR:root:Error occurred when pull license for flatbuffers from {'license': 'https://raw.githubusercontent.com/google/flatbuffers/master/LICENSE.txt'}.
[0mSkip pulling license for bs4
[91mTraceback (most recent call last):
File "/tmp/license_scripts/pull_licenses_py.py", line 98, in pull_from_url
headers={'User-Agent': 'Apache Beam'}))
File "/usr/local/lib/python3.7/urllib/request.py", line 222, in urlopen
return opener.open(url, data, timeout)
File "/usr/local/lib/python3.7/urllib/request.py", line 531, in open
response = meth(req, response)
File "/usr/local/lib/python3.7/urllib/request.py", line 641, in http_response
'http', request, response, code, msg, hdrs)
File "/usr/local/lib/python3.7/urllib/request.py", line 569, in error
return self._call_chain(*args)
File "/usr/local/lib/python3.7/urllib/request.py", line 503, in _call_chain
result = func(*args)
File "/usr/local/lib/python3.7/urllib/request.py", line 649, in http_error_default
raise HTTPError(req.full_url, code, msg, hdrs, fp)
urllib.error.HTTPError: HTTP Error 404: Not Found
[0m[91mTraceback (most recent call last):
File "/tmp/license_scripts/pull_licenses_py.py", line 176, in <module>
pull_from_url(dep['Name'].lower(), dep_config['pip_dependencies'])):
File "/usr/local/lib/python3.7/site-packages/tenacity/__init__.py", line 293, in wrapped_f
return self.call(f, *args, **kw)
File "/usr/local/lib/python3.7/site-packages/tenacity/__init__.py", line 359, in call
do = self.iter(retry_state=retry_state)
File "/usr/local/lib/python3.7/site-packages/tenacity/__init__.py", line 332, in iter
raise retry_exc.reraise()
File "/usr/local/lib/python3.7/site-packages/tenacity/__init__.py", line 168, in reraise
raise self.last_attempt.result()
File "/usr/local/lib/python3.7/concurrent/futures/_base.py", line 428, in result
return self.__get_result()
File "/usr/local/lib/python3.7/concurrent/futures/_base.py", line 384, in __get_result
raise self._exception
File "/usr/local/lib/python3.7/site-packages/tenacity/__init__.py", line 362, in call
result = fn(*args, **kwargs)
File "/tmp/license_scripts/pull_licenses_py.py", line 98, in pull_from_url
headers={'User-Agent': 'Apache Beam'}))
File "/usr/local/lib/python3.7/urllib/request.py", line 222, in urlopen
return opener.open(url, data, timeout)
File "/usr/local/lib/python3.7/urllib/request.py", line 531, in open
response = meth(req, response)
File "/usr/local/lib/python3.7/urllib/request.py", line 641, in http_response
'http', request, response, code, msg, hdrs)
File "/usr/local/lib/python3.7/urllib/request.py", line 569, in error
return self._call_chain(*args)
File "/usr/local/lib/python3.7/urllib/request.py", line 503, in _call_chain
result = func(*args)
File "/usr/local/lib/python3.7/urllib/request.py", line 649, in http_error_default
raise HTTPError(req.full_url, code, msg, hdrs, fp)
urllib.error.HTTPError: HTTP Error 404: Not Found
[0mThe command '/bin/sh -c if [ "$pull_licenses" = "true" ] ; then pip install 'pip-licenses<4.0.0' pyyaml tenacity && python /tmp/license_scripts/pull_licenses_py.py ; fi' returned a non-zero code: 1
> Task :sdks:python:container:py37:docker FAILED
> Task :sdks:python:test-suites:direct:xlang:fnApiJobServerCleanup
FAILURE: Build failed with an exception.
* What went wrong:
Execution failed for task ':sdks:python:container:py37:docker'.
> Process 'command 'docker'' finished with non-zero exit value 1
* Try:
> Run with --stacktrace option to get the stack trace.
> Run with --info or --debug option to get more log output.
* Get more help at https://help.gradle.org
Deprecated Gradle features were used in this build, making it incompatible with Gradle 8.0.
You can use '--warning-mode all' to show the individual deprecation warnings and determine if they come from your own scripts or plugins.
See https://docs.gradle.org/7.5.1/userguide/command_line_interface.html#sec:command_line_warnings
Execution optimizations have been disabled for 1 invalid unit(s) of work during this build to ensure correctness.
Please consult deprecation warnings for more details.
BUILD FAILED in 11m
242 actionable tasks: 161 executed, 69 from cache, 12 up-to-date
Publishing build scan...
https://gradle.com/s/dlkcv2kvyyqxg
Build step 'Invoke Gradle script' changed build result to FAILURE
Build step 'Invoke Gradle script' marked build as failure
---------------------------------------------------------------------
To unsubscribe, e-mail: builds-unsubscribe@beam.apache.org
For additional commands, e-mail: builds-help@beam.apache.org
Jenkins build is back to normal : beam_PostCommit_XVR_Direct #3696
Posted by Apache Jenkins Server <je...@builds.apache.org>.
See <https://ci-beam.apache.org/job/beam_PostCommit_XVR_Direct/3696/display/redirect?page=changes>
---------------------------------------------------------------------
To unsubscribe, e-mail: builds-unsubscribe@beam.apache.org
For additional commands, e-mail: builds-help@beam.apache.org
beam_PostCommit_XVR_Direct - Build # 3695 - Aborted!
Posted by Apache Jenkins Server <je...@builds.apache.org>.
beam_PostCommit_XVR_Direct - Build # 3695 - Aborted:
Check console output at https://ci-beam.apache.org/job/beam_PostCommit_XVR_Direct/3695/ to view the results.
Build failed in Jenkins: beam_PostCommit_XVR_Direct #3694
Posted by Apache Jenkins Server <je...@builds.apache.org>.
See <https://ci-beam.apache.org/job/beam_PostCommit_XVR_Direct/3694/display/redirect>
Changes:
------------------------------------------
[...truncated 610.97 KB...]
pymongo==3.13.0
PyMySQL==1.0.2
pyparsing==3.0.9
pytest==7.2.1
pytest-forked==1.4.0
pytest-timeout==2.1.0
pytest-xdist==2.5.0
python-dateutil==2.8.2
python-snappy==0.6.1
pytz==2022.7.1
PyYAML==6.0
regex==2022.10.31
requests==2.28.2
requests-mock==1.10.0
requests-oauthlib==1.3.1
rsa==4.9
scikit-learn==1.0.2
scipy==1.7.3
setuptools==67.0.0
six==1.16.0
sortedcontainers==2.4.0
soupsieve==2.3.2.post1
SQLAlchemy==1.4.46
sqlparse==0.4.3
tenacity==5.1.5
tensorboard==2.11.2
tensorboard-data-server==0.6.1
tensorboard-plugin-wit==1.8.1
tensorflow==2.11.0
tensorflow-estimator==2.11.0
tensorflow-io-gcs-filesystem==0.30.0
termcolor==2.2.0
testcontainers==3.7.1
threadpoolctl==3.1.0
tomli==2.0.1
tqdm==4.64.1
typing_extensions==4.4.0
uritemplate==4.1.1
urllib3==1.26.14
websocket-client==1.4.2
Werkzeug==2.2.2
wheel==0.38.4
wrapt==1.14.1
zipp==3.11.0
zstandard==0.19.0
Removing intermediate container 4b22e3572165
---> a2e014df391b
Step 17/32 : COPY target/LICENSE /opt/apache/beam/
---> cefd434a6a45
Step 18/32 : COPY target/LICENSE.python /opt/apache/beam/
---> ac45a45ff71d
Step 19/32 : COPY target/NOTICE /opt/apache/beam/
---> 6ca44eabaf21
Step 20/32 : COPY target/launcher/linux_amd64/boot /opt/apache/beam/
---> a71be34c4a89
Step 21/32 : ENTRYPOINT ["/opt/apache/beam/boot"]
---> Running in d71ac146c41f
Removing intermediate container d71ac146c41f
---> 7acf95ebfa22
Step 22/32 : FROM beam as third_party_licenses
---> 7acf95ebfa22
Step 23/32 : ARG pull_licenses
---> Running in d197ef852b17
Removing intermediate container d197ef852b17
---> 0bb3881254f7
Step 24/32 : COPY target/license_scripts /tmp/license_scripts/
---> 4fcdda659c10
Step 25/32 : COPY target/LICENSE target/go-licenses/* /opt/apache/beam/third_party_licenses/golang/
---> 641219f4d730
Step 26/32 : RUN rm /opt/apache/beam/third_party_licenses/golang/LICENSE
---> Running in 6eff62884189
Removing intermediate container 6eff62884189
---> b1e62665f984
Step 27/32 : COPY target/license_scripts /tmp/license_scripts/
---> 44849768204f
Step 28/32 : RUN if [ "$pull_licenses" = "true" ] ; then pip install 'pip-licenses<4.0.0' pyyaml tenacity && python /tmp/license_scripts/pull_licenses_py.py ; fi
---> Running in 055d56b1903c
Collecting pip-licenses<4.0.0
Downloading pip_licenses-3.5.5-py3-none-any.whl (17 kB)
Requirement already satisfied: pyyaml in /usr/local/lib/python3.7/site-packages (6.0)
Requirement already satisfied: tenacity in /usr/local/lib/python3.7/site-packages (5.1.5)
Collecting PTable
Downloading PTable-0.9.2.tar.gz (31 kB)
Preparing metadata (setup.py): started
Preparing metadata (setup.py): finished with status 'done'
Requirement already satisfied: six>=1.9.0 in /usr/local/lib/python3.7/site-packages (from tenacity) (1.16.0)
Building wheels for collected packages: PTable
Building wheel for PTable (setup.py): started
Building wheel for PTable (setup.py): finished with status 'done'
Created wheel for PTable: filename=PTable-0.9.2-py3-none-any.whl size=22908 sha256=584c1d397824526d37bd174083b36427109512c153501d8f54fc71b45bfa519a
Stored in directory: /root/.cache/pip/wheels/33/df/2f/674985b3f8a2de3f96357d1eadef5110f74fa91b3785e52a54
Successfully built PTable
Installing collected packages: PTable, pip-licenses
Successfully installed PTable-0.9.2 pip-licenses-3.5.5
[91mWARNING: Running pip as the 'root' user can result in broken permissions and conflicting behaviour with the system package manager. It is recommended to use a virtual environment instead: https://pip.pypa.io/warnings/venv
[0m[91mERROR:root:Error occurred when pull license for flatbuffers from {'license': 'https://raw.githubusercontent.com/google/flatbuffers/master/LICENSE.txt'}.
[0m[91mTraceback (most recent call last):
File "/tmp/license_scripts/pull_licenses_py.py", line 98, in pull_from_url
headers={'User-Agent': 'Apache Beam'}))
File "/usr/local/lib/python3.7/urllib/request.py", line 222, in urlopen
return opener.open(url, data, timeout)
File "/usr/local/lib/python3.7/urllib/request.py", line 531, in open
response = meth(req, response)
File "/usr/local/lib/python3.7/urllib/request.py", line 641, in http_response
'http', request, response, code, msg, hdrs)
File "/usr/local/lib/python3.7/urllib/request.py", line 569, in error
return self._call_chain(*args)
File "/usr/local/lib/python3.7/urllib/request.py", line 503, in _call_chain
result = func(*args)
File "/usr/local/lib/python3.7/urllib/request.py", line 649, in http_error_default
raise HTTPError(req.full_url, code, msg, hdrs, fp)
urllib.error.HTTPError: HTTP Error 404: Not Found
ERROR:root:Error occurred when pull license for flatbuffers from {'license': 'https://raw.githubusercontent.com/google/flatbuffers/master/LICENSE.txt'}.
[0m[91mTraceback (most recent call last):
File "/tmp/license_scripts/pull_licenses_py.py", line 98, in pull_from_url
headers={'User-Agent': 'Apache Beam'}))
File "/usr/local/lib/python3.7/urllib/request.py", line 222, in urlopen
return opener.open(url, data, timeout)
File "/usr/local/lib/python3.7/urllib/request.py", line 531, in open
response = meth(req, response)
File "/usr/local/lib/python3.7/urllib/request.py", line 641, in http_response
'http', request, response, code, msg, hdrs)
File "/usr/local/lib/python3.7/urllib/request.py", line 569, in error
return self._call_chain(*args)
File "/usr/local/lib/python3.7/urllib/request.py", line 503, in _call_chain
result = func(*args)
File "/usr/local/lib/python3.7/urllib/request.py", line 649, in http_error_default
raise HTTPError(req.full_url, code, msg, hdrs, fp)
urllib.error.HTTPError: HTTP Error 404: Not Found
ERROR:root:Error occurred when pull license for flatbuffers from {'license': 'https://raw.githubusercontent.com/google/flatbuffers/master/LICENSE.txt'}.
[0m[91mTraceback (most recent call last):
File "/tmp/license_scripts/pull_licenses_py.py", line 98, in pull_from_url
headers={'User-Agent': 'Apache Beam'}))
File "/usr/local/lib/python3.7/urllib/request.py", line 222, in urlopen
return opener.open(url, data, timeout)
File "/usr/local/lib/python3.7/urllib/request.py", line 531, in open
response = meth(req, response)
File "/usr/local/lib/python3.7/urllib/request.py", line 641, in http_response
'http', request, response, code, msg, hdrs)
File "/usr/local/lib/python3.7/urllib/request.py", line 569, in error
return self._call_chain(*args)
File "/usr/local/lib/python3.7/urllib/request.py", line 503, in _call_chain
result = func(*args)
File "/usr/local/lib/python3.7/urllib/request.py", line 649, in http_error_default
raise HTTPError(req.full_url, code, msg, hdrs, fp)
urllib.error.HTTPError: HTTP Error 404: Not Found
ERROR:root:Error occurred when pull license for flatbuffers from {'license': 'https://raw.githubusercontent.com/google/flatbuffers/master/LICENSE.txt'}.
[0m[91mTraceback (most recent call last):
File "/tmp/license_scripts/pull_licenses_py.py", line 98, in pull_from_url
headers={'User-Agent': 'Apache Beam'}))
File "/usr/local/lib/python3.7/urllib/request.py", line 222, in urlopen
return opener.open(url, data, timeout)
File "/usr/local/lib/python3.7/urllib/request.py", line 531, in open
response = meth(req, response)
File "/usr/local/lib/python3.7/urllib/request.py", line 641, in http_response
'http', request, response, code, msg, hdrs)
File "/usr/local/lib/python3.7/urllib/request.py", line 569, in error
return self._call_chain(*args)
File "/usr/local/lib/python3.7/urllib/request.py", line 503, in _call_chain
result = func(*args)
File "/usr/local/lib/python3.7/urllib/request.py", line 649, in http_error_default
raise HTTPError(req.full_url, code, msg, hdrs, fp)
urllib.error.HTTPError: HTTP Error 404: Not Found
ERROR:root:Error occurred when pull license for flatbuffers from {'license': 'https://raw.githubusercontent.com/google/flatbuffers/master/LICENSE.txt'}.
[0mSkip pulling license for bs4
[91mTraceback (most recent call last):
File "/tmp/license_scripts/pull_licenses_py.py", line 98, in pull_from_url
headers={'User-Agent': 'Apache Beam'}))
File "/usr/local/lib/python3.7/urllib/request.py", line 222, in urlopen
return opener.open(url, data, timeout)
File "/usr/local/lib/python3.7/urllib/request.py", line 531, in open
response = meth(req, response)
File "/usr/local/lib/python3.7/urllib/request.py", line 641, in http_response
'http', request, response, code, msg, hdrs)
File "/usr/local/lib/python3.7/urllib/request.py", line 569, in error
return self._call_chain(*args)
File "/usr/local/lib/python3.7/urllib/request.py", line 503, in _call_chain
result = func(*args)
File "/usr/local/lib/python3.7/urllib/request.py", line 649, in http_error_default
raise HTTPError(req.full_url, code, msg, hdrs, fp)
urllib.error.HTTPError: HTTP Error 404: Not Found
[0m[91mTraceback (most recent call last):
File "/tmp/license_scripts/pull_licenses_py.py", line 176, in <module>
pull_from_url(dep['Name'].lower(), dep_config['pip_dependencies'])):
File "/usr/local/lib/python3.7/site-packages/tenacity/__init__.py", line 293, in wrapped_f
return self.call(f, *args, **kw)
File "/usr/local/lib/python3.7/site-packages/tenacity/__init__.py", line 359, in call
do = self.iter(retry_state=retry_state)
File "/usr/local/lib/python3.7/site-packages/tenacity/__init__.py", line 332, in iter
raise retry_exc.reraise()
File "/usr/local/lib/python3.7/site-packages/tenacity/__init__.py", line 168, in reraise
raise self.last_attempt.result()
File "/usr/local/lib/python3.7/concurrent/futures/_base.py", line 428, in result
return self.__get_result()
File "/usr/local/lib/python3.7/concurrent/futures/_base.py", line 384, in __get_result
raise self._exception
File "/usr/local/lib/python3.7/site-packages/tenacity/__init__.py", line 362, in call
result = fn(*args, **kwargs)
File "/tmp/license_scripts/pull_licenses_py.py", line 98, in pull_from_url
headers={'User-Agent': 'Apache Beam'}))
File "/usr/local/lib/python3.7/urllib/request.py", line 222, in urlopen
return opener.open(url, data, timeout)
File "/usr/local/lib/python3.7/urllib/request.py", line 531, in open
response = meth(req, response)
File "/usr/local/lib/python3.7/urllib/request.py", line 641, in http_response
'http', request, response, code, msg, hdrs)
File "/usr/local/lib/python3.7/urllib/request.py", line 569, in error
return self._call_chain(*args)
File "/usr/local/lib/python3.7/urllib/request.py", line 503, in _call_chain
result = func(*args)
File "/usr/local/lib/python3.7/urllib/request.py", line 649, in http_error_default
raise HTTPError(req.full_url, code, msg, hdrs, fp)
urllib.error.HTTPError: HTTP Error 404: Not Found
[0mThe command '/bin/sh -c if [ "$pull_licenses" = "true" ] ; then pip install 'pip-licenses<4.0.0' pyyaml tenacity && python /tmp/license_scripts/pull_licenses_py.py ; fi' returned a non-zero code: 1
> Task :sdks:python:container:py37:docker FAILED
> Task :sdks:python:test-suites:direct:xlang:fnApiJobServerCleanup
Killing process at 4012692
FAILURE: Build failed with an exception.
* What went wrong:
Execution failed for task ':sdks:python:container:py37:docker'.
> Process 'command 'docker'' finished with non-zero exit value 1
* Try:
> Run with --stacktrace option to get the stack trace.
> Run with --info or --debug option to get more log output.
* Get more help at https://help.gradle.org
Deprecated Gradle features were used in this build, making it incompatible with Gradle 8.0.
You can use '--warning-mode all' to show the individual deprecation warnings and determine if they come from your own scripts or plugins.
See https://docs.gradle.org/7.5.1/userguide/command_line_interface.html#sec:command_line_warnings
Execution optimizations have been disabled for 1 invalid unit(s) of work during this build to ensure correctness.
Please consult deprecation warnings for more details.
BUILD FAILED in 15m 22s
242 actionable tasks: 163 executed, 67 from cache, 12 up-to-date
Publishing build scan...
https://gradle.com/s/o7g7ua35esllm
Build step 'Invoke Gradle script' changed build result to FAILURE
Build step 'Invoke Gradle script' marked build as failure
---------------------------------------------------------------------
To unsubscribe, e-mail: builds-unsubscribe@beam.apache.org
For additional commands, e-mail: builds-help@beam.apache.org