You are viewing a plain text version of this content. The canonical link for it is here.
Posted to dev@zookeeper.apache.org by Apache Jenkins Server <je...@builds.apache.org> on 2016/09/06 09:09:20 UTC

ZooKeeper_branch35_jdk7 - Build # 650 - Failure

See https://builds.apache.org/job/ZooKeeper_branch35_jdk7/650/

###################################################################################
########################## LAST 60 LINES OF THE CONSOLE ###########################
[...truncated 414159 lines...]
    [junit] 	at org.jboss.netty.channel.socket.nio.AbstractNioWorker.writeFromTaskLoop(AbstractNioWorker.java:151)
    [junit] 	at org.jboss.netty.channel.socket.nio.AbstractNioChannel$WriteTask.run(AbstractNioChannel.java:315)
    [junit] 	at org.jboss.netty.channel.socket.nio.AbstractNioSelector.processTaskQueue(AbstractNioSelector.java:391)
    [junit] 	at org.jboss.netty.channel.socket.nio.AbstractNioSelector.run(AbstractNioSelector.java:315)
    [junit] 	at org.jboss.netty.channel.socket.nio.AbstractNioWorker.run(AbstractNioWorker.java:89)
    [junit] 	at org.jboss.netty.channel.socket.nio.NioWorker.run(NioWorker.java:178)
    [junit] 	at org.jboss.netty.util.ThreadRenamingRunnable.run(ThreadRenamingRunnable.java:108)
    [junit] 	at org.jboss.netty.util.internal.DeadLockProofWorker$1.run(DeadLockProofWorker.java:42)
    [junit] 	at java.util.concurrent.ThreadPoolExecutor.runWorker(ThreadPoolExecutor.java:1145)
    [junit] 	at java.util.concurrent.ThreadPoolExecutor$Worker.run(ThreadPoolExecutor.java:615)
    [junit] 	at java.lang.Thread.run(Thread.java:745)
    [junit] 2016-09-06 09:08:49,101 [myid:] - INFO  [SyncThread:0:MBeanRegistry@128] - Unregister MBean [org.apache.ZooKeeperService:name0=StandaloneServer_port22238,name1=Connections,name2=127.0.0.1,name3=0x100914031930000]
    [junit] 2016-09-06 09:08:49,201 [myid:] - INFO  [main:ZooKeeper@1313] - Session: 0x100914031930000 closed
    [junit] 2016-09-06 09:08:49,201 [myid:] - INFO  [main:JUnit4ZKTestRunner$LoggedInvokeMethod@82] - Memory used 140841
    [junit] 2016-09-06 09:08:49,201 [myid:] - INFO  [main-EventThread:ClientCnxn$EventThread@513] - EventThread shut down for session: 0x100914031930000
    [junit] 2016-09-06 09:08:49,201 [myid:] - INFO  [main:JUnit4ZKTestRunner$LoggedInvokeMethod@87] - Number of threads 1644
    [junit] 2016-09-06 09:08:49,202 [myid:] - INFO  [main:JUnit4ZKTestRunner$LoggedInvokeMethod@102] - FINISHED TEST METHOD testWatcherAutoResetWithLocal
    [junit] 2016-09-06 09:08:49,202 [myid:] - INFO  [main:ClientBase@543] - tearDown starting
    [junit] 2016-09-06 09:08:49,202 [myid:] - INFO  [main:ClientBase@513] - STOPPING server
    [junit] 2016-09-06 09:08:49,202 [myid:] - INFO  [main:NettyServerCnxnFactory@464] - shutdown called 0.0.0.0/0.0.0.0:22238
    [junit] 2016-09-06 09:08:49,205 [myid:] - INFO  [main:ZooKeeperServer@529] - shutting down
    [junit] 2016-09-06 09:08:49,205 [myid:] - ERROR [main:ZooKeeperServer@501] - ZKShutdownHandler is not registered, so ZooKeeper server won't take any action on ERROR or SHUTDOWN server state changes
    [junit] 2016-09-06 09:08:49,205 [myid:] - INFO  [main:SessionTrackerImpl@232] - Shutting down
    [junit] 2016-09-06 09:08:49,206 [myid:] - INFO  [main:PrepRequestProcessor@965] - Shutting down
    [junit] 2016-09-06 09:08:49,206 [myid:] - INFO  [main:SyncRequestProcessor@191] - Shutting down
    [junit] 2016-09-06 09:08:49,206 [myid:] - INFO  [ProcessThread(sid:0 cport:22238)::PrepRequestProcessor@154] - PrepRequestProcessor exited loop!
    [junit] 2016-09-06 09:08:49,206 [myid:] - INFO  [SyncThread:0:SyncRequestProcessor@169] - SyncRequestProcessor exited!
    [junit] 2016-09-06 09:08:49,206 [myid:] - INFO  [main:FinalRequestProcessor@479] - shutdown of request processor complete
    [junit] 2016-09-06 09:08:49,206 [myid:] - INFO  [main:MBeanRegistry@128] - Unregister MBean [org.apache.ZooKeeperService:name0=StandaloneServer_port22238,name1=InMemoryDataTree]
    [junit] 2016-09-06 09:08:49,206 [myid:] - INFO  [main:MBeanRegistry@128] - Unregister MBean [org.apache.ZooKeeperService:name0=StandaloneServer_port22238]
    [junit] 2016-09-06 09:08:49,207 [myid:] - INFO  [main:FourLetterWordMain@85] - connecting to 127.0.0.1 22238
    [junit] 2016-09-06 09:08:49,207 [myid:] - INFO  [main:JMXEnv@146] - ensureOnly:[]
    [junit] 2016-09-06 09:08:49,213 [myid:] - INFO  [main:ClientBase@568] - fdcount after test is: 4818 at start it was 4823
    [junit] 2016-09-06 09:08:49,213 [myid:] - INFO  [main:ZKTestCase$1@65] - SUCCEEDED testWatcherAutoResetWithLocal
    [junit] 2016-09-06 09:08:49,213 [myid:] - INFO  [main:ZKTestCase$1@60] - FINISHED testWatcherAutoResetWithLocal
    [junit] Tests run: 101, Failures: 0, Errors: 0, Skipped: 0, Time elapsed: 495.535 sec, Thread: 5, Class: org.apache.zookeeper.test.NioNettySuiteTest
    [junit] 2016-09-06 09:08:49,547 [myid:127.0.0.1:22115] - INFO  [main-SendThread(127.0.0.1:22115):ClientCnxn$SendThread@1113] - Opening socket connection to server 127.0.0.1/127.0.0.1:22115. Will not attempt to authenticate using SASL (unknown error)
    [junit] 2016-09-06 09:08:49,548 [myid:127.0.0.1:22115] - WARN  [main-SendThread(127.0.0.1:22115):ClientCnxn$SendThread@1235] - Session 0x100913d1ba80000 for server 127.0.0.1/127.0.0.1:22115, unexpected error, closing socket connection and attempting reconnect
    [junit] java.net.ConnectException: Connection refused
    [junit] 	at sun.nio.ch.SocketChannelImpl.checkConnect(Native Method)
    [junit] 	at sun.nio.ch.SocketChannelImpl.finishConnect(SocketChannelImpl.java:744)
    [junit] 	at org.apache.zookeeper.ClientCnxnSocketNIO.doTransport(ClientCnxnSocketNIO.java:357)
    [junit] 	at org.apache.zookeeper.ClientCnxn$SendThread.run(ClientCnxn.java:1214)

BUILD FAILED
/home/jenkins/jenkins-slave/workspace/ZooKeeper_branch35_jdk7/branch-3.5/build.xml:1322: The following error occurred while executing this line:
/home/jenkins/jenkins-slave/workspace/ZooKeeper_branch35_jdk7/branch-3.5/build.xml:1207: Tests failed!

Total time: 12 minutes 46 seconds
Build step 'Invoke Ant' marked build as failure
Archiving artifacts
Setting JDK_1_7_LATEST__HOME=/home/jenkins/tools/java/latest1.7
Recording test results
Setting JDK_1_7_LATEST__HOME=/home/jenkins/tools/java/latest1.7
Setting JDK_1_7_LATEST__HOME=/home/jenkins/tools/java/latest1.7
Email was triggered for: Failure - Any
Sending email for trigger: Failure - Any
Setting JDK_1_7_LATEST__HOME=/home/jenkins/tools/java/latest1.7
Setting JDK_1_7_LATEST__HOME=/home/jenkins/tools/java/latest1.7



###################################################################################
############################## FAILED TESTS (if any) ##############################
1 tests failed.
FAILED:  org.apache.zookeeper.test.FLEZeroWeightTest.testZeroWeightQuorum

Error Message:
Threads didn't join

Stack Trace:
junit.framework.AssertionFailedError: Threads didn't join
	at org.apache.zookeeper.test.FLEZeroWeightTest.testZeroWeightQuorum(FLEZeroWeightTest.java:167)
	at org.apache.zookeeper.JUnit4ZKTestRunner$LoggedInvokeMethod.evaluate(JUnit4ZKTestRunner.java:79)



ZooKeeper_branch35_jdk7 - Build # 651 - Still Failing

Posted by Apache Jenkins Server <je...@builds.apache.org>.
See https://builds.apache.org/job/ZooKeeper_branch35_jdk7/651/

###################################################################################
########################## LAST 60 LINES OF THE CONSOLE ###########################
[...truncated 451078 lines...]
    [junit] 	at org.jboss.netty.util.internal.DeadLockProofWorker$1.run(DeadLockProofWorker.java:42)
    [junit] 	at java.util.concurrent.ThreadPoolExecutor.runWorker(ThreadPoolExecutor.java:1145)
    [junit] 	at java.util.concurrent.ThreadPoolExecutor$Worker.run(ThreadPoolExecutor.java:615)
    [junit] 	at java.lang.Thread.run(Thread.java:745)
    [junit] 2016-09-07 08:48:25,670 [myid:] - INFO  [SyncThread:0:MBeanRegistry@128] - Unregister MBean [org.apache.ZooKeeperService:name0=StandaloneServer_port16852,name1=Connections,name2=127.0.0.1,name3=0x1009653dd7c0000]
    [junit] 2016-09-07 08:48:25,757 [myid:127.0.0.1:16729] - INFO  [main-SendThread(127.0.0.1:16729):ClientCnxn$SendThread@1113] - Opening socket connection to server 127.0.0.1/127.0.0.1:16729. Will not attempt to authenticate using SASL (unknown error)
    [junit] 2016-09-07 08:48:25,758 [myid:127.0.0.1:16729] - WARN  [main-SendThread(127.0.0.1:16729):ClientCnxn$SendThread@1235] - Session 0x1009650c4840000 for server 127.0.0.1/127.0.0.1:16729, unexpected error, closing socket connection and attempting reconnect
    [junit] java.net.ConnectException: Connection refused
    [junit] 	at sun.nio.ch.SocketChannelImpl.checkConnect(Native Method)
    [junit] 	at sun.nio.ch.SocketChannelImpl.finishConnect(SocketChannelImpl.java:744)
    [junit] 	at org.apache.zookeeper.ClientCnxnSocketNIO.doTransport(ClientCnxnSocketNIO.java:357)
    [junit] 	at org.apache.zookeeper.ClientCnxn$SendThread.run(ClientCnxn.java:1214)
    [junit] 2016-09-07 08:48:25,770 [myid:] - INFO  [main:ZooKeeper@1313] - Session: 0x1009653dd7c0000 closed
    [junit] 2016-09-07 08:48:25,770 [myid:] - INFO  [main:JUnit4ZKTestRunner$LoggedInvokeMethod@82] - Memory used 181356
    [junit] 2016-09-07 08:48:25,770 [myid:] - INFO  [main:JUnit4ZKTestRunner$LoggedInvokeMethod@87] - Number of threads 1644
    [junit] 2016-09-07 08:48:25,771 [myid:] - INFO  [main:JUnit4ZKTestRunner$LoggedInvokeMethod@102] - FINISHED TEST METHOD testWatcherAutoResetWithLocal
    [junit] 2016-09-07 08:48:25,771 [myid:] - INFO  [main:ClientBase@543] - tearDown starting
    [junit] 2016-09-07 08:48:25,771 [myid:] - INFO  [main:ClientBase@513] - STOPPING server
    [junit] 2016-09-07 08:48:25,771 [myid:] - INFO  [main:NettyServerCnxnFactory@464] - shutdown called 0.0.0.0/0.0.0.0:16852
    [junit] 2016-09-07 08:48:25,770 [myid:] - INFO  [main-EventThread:ClientCnxn$EventThread@513] - EventThread shut down for session: 0x1009653dd7c0000
    [junit] 2016-09-07 08:48:25,777 [myid:] - INFO  [main:ZooKeeperServer@529] - shutting down
    [junit] 2016-09-07 08:48:25,778 [myid:] - ERROR [main:ZooKeeperServer@501] - ZKShutdownHandler is not registered, so ZooKeeper server won't take any action on ERROR or SHUTDOWN server state changes
    [junit] 2016-09-07 08:48:25,778 [myid:] - INFO  [main:SessionTrackerImpl@232] - Shutting down
    [junit] 2016-09-07 08:48:25,778 [myid:] - INFO  [main:PrepRequestProcessor@965] - Shutting down
    [junit] 2016-09-07 08:48:25,778 [myid:] - INFO  [main:SyncRequestProcessor@191] - Shutting down
    [junit] 2016-09-07 08:48:25,778 [myid:] - INFO  [ProcessThread(sid:0 cport:16852)::PrepRequestProcessor@154] - PrepRequestProcessor exited loop!
    [junit] 2016-09-07 08:48:25,778 [myid:] - INFO  [SyncThread:0:SyncRequestProcessor@169] - SyncRequestProcessor exited!
    [junit] 2016-09-07 08:48:25,779 [myid:] - INFO  [main:FinalRequestProcessor@479] - shutdown of request processor complete
    [junit] 2016-09-07 08:48:25,779 [myid:] - INFO  [main:MBeanRegistry@128] - Unregister MBean [org.apache.ZooKeeperService:name0=StandaloneServer_port16852,name1=InMemoryDataTree]
    [junit] 2016-09-07 08:48:25,779 [myid:] - INFO  [main:MBeanRegistry@128] - Unregister MBean [org.apache.ZooKeeperService:name0=StandaloneServer_port16852]
    [junit] 2016-09-07 08:48:25,779 [myid:] - INFO  [main:FourLetterWordMain@85] - connecting to 127.0.0.1 16852
    [junit] 2016-09-07 08:48:25,780 [myid:] - INFO  [main:JMXEnv@146] - ensureOnly:[]
    [junit] 2016-09-07 08:48:25,785 [myid:] - INFO  [main:ClientBase@568] - fdcount after test is: 4822 at start it was 4822
    [junit] 2016-09-07 08:48:25,785 [myid:] - INFO  [main:ZKTestCase$1@65] - SUCCEEDED testWatcherAutoResetWithLocal
    [junit] 2016-09-07 08:48:25,785 [myid:] - INFO  [main:ZKTestCase$1@60] - FINISHED testWatcherAutoResetWithLocal
    [junit] 2016-09-07 08:48:25,788 [myid:127.0.0.1:16735] - INFO  [main-SendThread(127.0.0.1:16735):ClientCnxn$SendThread@1113] - Opening socket connection to server 127.0.0.1/127.0.0.1:16735. Will not attempt to authenticate using SASL (unknown error)
    [junit] 2016-09-07 08:48:25,789 [myid:127.0.0.1:16735] - WARN  [main-SendThread(127.0.0.1:16735):ClientCnxn$SendThread@1235] - Session 0x3009650c4870000 for server 127.0.0.1/127.0.0.1:16735, unexpected error, closing socket connection and attempting reconnect
    [junit] java.net.ConnectException: Connection refused
    [junit] 	at sun.nio.ch.SocketChannelImpl.checkConnect(Native Method)
    [junit] 	at sun.nio.ch.SocketChannelImpl.finishConnect(SocketChannelImpl.java:744)
    [junit] 	at org.apache.zookeeper.ClientCnxnSocketNIO.doTransport(ClientCnxnSocketNIO.java:357)
    [junit] 	at org.apache.zookeeper.ClientCnxn$SendThread.run(ClientCnxn.java:1214)
    [junit] Tests run: 101, Failures: 0, Errors: 0, Skipped: 0, Time elapsed: 445.86 sec, Thread: 3, Class: org.apache.zookeeper.test.NioNettySuiteTest

BUILD FAILED
/home/jenkins/jenkins-slave/workspace/ZooKeeper_branch35_jdk7/branch-3.5/build.xml:1322: The following error occurred while executing this line:
/home/jenkins/jenkins-slave/workspace/ZooKeeper_branch35_jdk7/branch-3.5/build.xml:1207: Tests failed!

Total time: 10 minutes 27 seconds
Build step 'Invoke Ant' marked build as failure
Archiving artifacts
Setting JDK_1_7_LATEST__HOME=/home/jenkins/tools/java/latest1.7
Recording test results
Setting JDK_1_7_LATEST__HOME=/home/jenkins/tools/java/latest1.7
Setting JDK_1_7_LATEST__HOME=/home/jenkins/tools/java/latest1.7
Email was triggered for: Failure - Any
Sending email for trigger: Failure - Any
Setting JDK_1_7_LATEST__HOME=/home/jenkins/tools/java/latest1.7
Setting JDK_1_7_LATEST__HOME=/home/jenkins/tools/java/latest1.7



###################################################################################
############################## FAILED TESTS (if any) ##############################
1 tests failed.
FAILED:  org.apache.zookeeper.server.quorum.ReconfigRecoveryTest.testCurrentObserverIsParticipantInNewConfig

Error Message:
waiting for server 2 being up

Stack Trace:
junit.framework.AssertionFailedError: waiting for server 2 being up
	at org.apache.zookeeper.server.quorum.ReconfigRecoveryTest.testCurrentObserverIsParticipantInNewConfig(ReconfigRecoveryTest.java:529)
	at org.apache.zookeeper.JUnit4ZKTestRunner$LoggedInvokeMethod.evaluate(JUnit4ZKTestRunner.java:79)