You are viewing a plain text version of this content. The canonical link for it is here.
Posted to builds@beam.apache.org by Apache Jenkins Server <je...@builds.apache.org> on 2022/08/14 23:36:09 UTC
Build failed in Jenkins: beam_PostCommit_XVR_Direct #3016
See <https://ci-beam.apache.org/job/beam_PostCommit_XVR_Direct/3016/display/redirect?page=changes>
Changes:
[noreply] fix minor unreachable code caused by log.Fatal (#22618)
------------------------------------------
[...truncated 1.42 MB...]
INFO root:environments.py:304 Python SDK container image set to "apache/beam_python3.7_sdk:2.42.0.dev" for Docker environment
INFO apache_beam.runners.portability.fn_api_runner.translations:translations.py:714 ==================== <function pack_combiners at 0x7f89b299fe60> ====================
INFO apache_beam.runners.portability.fn_api_runner.translations:translations.py:714 ==================== <function lift_combiners at 0x7f89b299fef0> ====================
INFO apache_beam.runners.portability.fn_api_runner.translations:translations.py:714 ==================== <function sort_stages at 0x7f89b29a0680> ====================
INFO apache_beam.runners.portability.portable_runner:portable_runner.py:583 Job state changed to STOPPED
INFO apache_beam.runners.portability.portable_runner:portable_runner.py:583 Job state changed to STARTING
INFO apache_beam.runners.portability.portable_runner:portable_runner.py:583 Job state changed to RUNNING
INFO root:portable_runner.py:577 Default Python SDK image for environment is apache/beam_python3.7_sdk:2.42.0.dev
INFO root:portable_runner.py:577 ==================== <function annotate_downstream_side_inputs at 0x7efe04765050> ====================
INFO root:portable_runner.py:577 ==================== <function fix_side_input_pcoll_coders at 0x7efe04765170> ====================
INFO root:portable_runner.py:577 ==================== <function pack_combiners at 0x7efe04765680> ====================
INFO root:portable_runner.py:577 ==================== <function lift_combiners at 0x7efe04765710> ====================
INFO root:portable_runner.py:577 ==================== <function expand_sdf at 0x7efe047658c0> ====================
INFO root:portable_runner.py:577 ==================== <function expand_gbk at 0x7efe04765950> ====================
INFO root:portable_runner.py:577 ==================== <function sink_flattens at 0x7efe04765a70> ====================
INFO root:portable_runner.py:577 ==================== <function greedily_fuse at 0x7efe04765b00> ====================
INFO root:portable_runner.py:577 ==================== <function read_to_impulse at 0x7efe04765b90> ====================
INFO root:portable_runner.py:577 ==================== <function impulse_to_input at 0x7efe04765c20> ====================
INFO root:portable_runner.py:577 ==================== <function sort_stages at 0x7efe04765e60> ====================
INFO root:portable_runner.py:577 ==================== <function add_impulse_to_dangling_transforms at 0x7efe04765f80> ====================
INFO root:portable_runner.py:577 ==================== <function setup_timer_mapping at 0x7efe04765dd0> ====================
INFO root:portable_runner.py:577 ==================== <function populate_data_channel_coders at 0x7efe04765ef0> ====================
INFO root:portable_runner.py:577 starting control server on port 46109
INFO root:portable_runner.py:577 starting data server on port 34197
INFO root:portable_runner.py:577 starting state server on port 40605
INFO root:portable_runner.py:577 starting logging server on port 39889
INFO root:portable_runner.py:577 Created Worker handler <apache_beam.runners.portability.fn_api_runner.worker_handlers.DockerSdkWorkerHandler object at 0x7efe174265d0> for environment ref_Environment_default_environment_2 (beam:env:docker:v1, b'\n$apache/beam_python3.7_sdk:2.42.0.dev')
INFO root:portable_runner.py:577 Attempting to pull image apache/beam_python3.7_sdk:2.42.0.dev
INFO root:portable_runner.py:577 Unable to pull image apache/beam_python3.7_sdk:2.42.0.dev, defaulting to local image if it exists
INFO root:portable_runner.py:577 Waiting for docker to start up. Current status is running
INFO root:portable_runner.py:577 Docker container is running. container_id = b'637edf9b1db4b856bbc20d6fad7d0de4cfade694629a760ac214d0fa8062a474', worker_id = worker_81
INFO root:portable_runner.py:577 Created Worker handler <apache_beam.runners.portability.fn_api_runner.worker_handlers.DockerSdkWorkerHandler object at 0x7efe17469a10> for environment external_7beam:env:docker:v1 (beam:env:docker:v1, b'\n apache/beam_java8_sdk:2.42.0.dev')
INFO root:portable_runner.py:577 Attempting to pull image apache/beam_java8_sdk:2.42.0.dev
INFO root:portable_runner.py:577 Unable to pull image apache/beam_java8_sdk:2.42.0.dev, defaulting to local image if it exists
INFO root:portable_runner.py:577 Waiting for docker to start up. Current status is running
INFO root:portable_runner.py:577 Docker container is running. container_id = b'7af1fb7b4f789dc3e46e15a2080e078c0e87ee02d74ee51e8c2b226ba7b8d658', worker_id = worker_82
INFO root:portable_runner.py:577 Completed job in 11.857288360595703 seconds with state DONE.
INFO apache_beam.runners.portability.portable_runner:portable_runner.py:583 Job state changed to DONE
PASSED [ 77%]
apache_beam/transforms/sql_test.py::SqlTransformTest::test_windowing_before_sql
-------------------------------- live log call ---------------------------------
INFO apache_beam.utils.subprocess_server:subprocess_server.py:254 Using pre-built snapshot at <https://ci-beam.apache.org/job/beam_PostCommit_XVR_Direct/ws/src/sdks/java/extensions/sql/expansion-service/build/libs/beam-sdks-java-extensions-sql-expansion-service-2.42.0-SNAPSHOT.jar>
INFO root:external.py:773 Starting a JAR-based expansion service from JAR <https://ci-beam.apache.org/job/beam_PostCommit_XVR_Direct/ws/src/sdks/java/extensions/sql/expansion-service/build/libs/beam-sdks-java-extensions-sql-expansion-service-2.42.0-SNAPSHOT.jar>
INFO apache_beam.utils.subprocess_server:subprocess_server.py:116 Starting service with ['java' '-jar' '<https://ci-beam.apache.org/job/beam_PostCommit_XVR_Direct/ws/src/sdks/java/extensions/sql/expansion-service/build/libs/beam-sdks-java-extensions-sql-expansion-service-2.42.0-SNAPSHOT.jar'> '60061' '--filesToStage=<https://ci-beam.apache.org/job/beam_PostCommit_XVR_Direct/ws/src/sdks/java/extensions/sql/expansion-service/build/libs/beam-sdks-java-extensions-sql-expansion-service-2.42.0-SNAPSHOT.jar']>
INFO apache_beam.utils.subprocess_server:subprocess_server.py:132 Starting expansion service at localhost:60061
INFO apache_beam.utils.subprocess_server:subprocess_server.py:132 Aug 14, 2022 11:35:11 PM org.apache.beam.sdk.expansion.service.ExpansionService loadRegisteredTransforms
INFO apache_beam.utils.subprocess_server:subprocess_server.py:132 INFO: Registering external transforms: [beam:external:java:sql:v1, beam:transform:org.apache.beam:pubsub_read:v1, beam:transform:org.apache.beam:pubsub_write:v1, beam:transform:org.apache.beam:pubsublite_write:v1, beam:transform:org.apache.beam:pubsublite_read:v1, beam:transform:org.apache.beam:spanner_insert:v1, beam:transform:org.apache.beam:spanner_update:v1, beam:transform:org.apache.beam:spanner_replace:v1, beam:transform:org.apache.beam:spanner_insert_or_update:v1, beam:transform:org.apache.beam:spanner_delete:v1, beam:transform:org.apache.beam:spanner_read:v1, beam:transform:org.apache.beam:kafka_read_with_metadata:v1, beam:transform:org.apache.beam:kafka_read_without_metadata:v1, beam:transform:org.apache.beam:kafka_write:v1, beam:external:java:generate_sequence:v1]
INFO apache_beam.utils.subprocess_server:subprocess_server.py:132 beam:external:java:sql:v1: org.apache.beam.sdk.expansion.service.ExpansionService$ExternalTransformRegistrarLoader$1@47eaca72
INFO apache_beam.utils.subprocess_server:subprocess_server.py:132 beam:transform:org.apache.beam:pubsub_read:v1: org.apache.beam.sdk.expansion.service.ExpansionService$ExternalTransformRegistrarLoader$1@55141def
INFO apache_beam.utils.subprocess_server:subprocess_server.py:132 beam:transform:org.apache.beam:pubsub_write:v1: org.apache.beam.sdk.expansion.service.ExpansionService$ExternalTransformRegistrarLoader$1@55182842
INFO apache_beam.utils.subprocess_server:subprocess_server.py:132 beam:transform:org.apache.beam:pubsublite_write:v1: org.apache.beam.sdk.expansion.service.ExpansionService$ExternalTransformRegistrarLoader$1@3270d194
INFO apache_beam.utils.subprocess_server:subprocess_server.py:132 beam:transform:org.apache.beam:pubsublite_read:v1: org.apache.beam.sdk.expansion.service.ExpansionService$ExternalTransformRegistrarLoader$1@235834f2
INFO apache_beam.utils.subprocess_server:subprocess_server.py:132 beam:transform:org.apache.beam:spanner_insert:v1: org.apache.beam.sdk.expansion.service.ExpansionService$ExternalTransformRegistrarLoader$1@5656be13
INFO apache_beam.utils.subprocess_server:subprocess_server.py:132 beam:transform:org.apache.beam:spanner_update:v1: org.apache.beam.sdk.expansion.service.ExpansionService$ExternalTransformRegistrarLoader$1@4218d6a3
INFO apache_beam.utils.subprocess_server:subprocess_server.py:132 beam:transform:org.apache.beam:spanner_replace:v1: org.apache.beam.sdk.expansion.service.ExpansionService$ExternalTransformRegistrarLoader$1@76505305
INFO apache_beam.utils.subprocess_server:subprocess_server.py:132 beam:transform:org.apache.beam:spanner_insert_or_update:v1: org.apache.beam.sdk.expansion.service.ExpansionService$ExternalTransformRegistrarLoader$1@14cd1699
INFO apache_beam.utils.subprocess_server:subprocess_server.py:132 beam:transform:org.apache.beam:spanner_delete:v1: org.apache.beam.sdk.expansion.service.ExpansionService$ExternalTransformRegistrarLoader$1@77888435
INFO apache_beam.utils.subprocess_server:subprocess_server.py:132 beam:transform:org.apache.beam:spanner_read:v1: org.apache.beam.sdk.expansion.service.ExpansionService$ExternalTransformRegistrarLoader$1@73a1e9a9
INFO apache_beam.utils.subprocess_server:subprocess_server.py:132 beam:transform:org.apache.beam:kafka_read_with_metadata:v1: org.apache.beam.sdk.expansion.service.ExpansionService$ExternalTransformRegistrarLoader$1@71d44a3
INFO apache_beam.utils.subprocess_server:subprocess_server.py:132 beam:transform:org.apache.beam:kafka_read_without_metadata:v1: org.apache.beam.sdk.expansion.service.ExpansionService$ExternalTransformRegistrarLoader$1@7b98f307
INFO apache_beam.utils.subprocess_server:subprocess_server.py:132 beam:transform:org.apache.beam:kafka_write:v1: org.apache.beam.sdk.expansion.service.ExpansionService$ExternalTransformRegistrarLoader$1@4802796d
INFO apache_beam.utils.subprocess_server:subprocess_server.py:132 beam:external:java:generate_sequence:v1: org.apache.beam.sdk.expansion.service.ExpansionService$ExternalTransformRegistrarLoader$1@34123d65
INFO apache_beam.utils.subprocess_server:subprocess_server.py:132 Aug 14, 2022 11:35:12 PM org.apache.beam.sdk.expansion.service.ExpansionService expand
INFO apache_beam.utils.subprocess_server:subprocess_server.py:132 INFO: Expanding 'SqlTransform(beam:external:java:sql:v1)' with URN 'beam:external:java:sql:v1'
INFO apache_beam.utils.subprocess_server:subprocess_server.py:132 Aug 14, 2022 11:35:12 PM org.apache.beam.sdk.expansion.service.ExpansionService$ExternalTransformRegistrarLoader payloadToConfig
INFO apache_beam.utils.subprocess_server:subprocess_server.py:132 WARNING: Configuration class 'org.apache.beam.sdk.extensions.sql.expansion.ExternalSqlTransformRegistrar$Configuration' has no schema registered. Attempting to construct with setter approach.
INFO apache_beam.utils.subprocess_server:subprocess_server.py:132 Aug 14, 2022 11:35:12 PM org.apache.beam.sdk.expansion.service.ExpansionService$ExternalTransformRegistrarLoader payloadToConfig
INFO apache_beam.utils.subprocess_server:subprocess_server.py:132 WARNING: Configuration class 'org.apache.beam.sdk.extensions.sql.expansion.ExternalSqlTransformRegistrar$Configuration' has no schema registered. Attempting to construct with setter approach.
INFO apache_beam.utils.subprocess_server:subprocess_server.py:132 Aug 14, 2022 11:35:14 PM org.apache.beam.sdk.extensions.sql.impl.CalciteQueryPlanner convertToBeamRel
INFO apache_beam.utils.subprocess_server:subprocess_server.py:132 INFO: SQL:
INFO apache_beam.utils.subprocess_server:subprocess_server.py:132 SELECT COUNT(*) AS `count`
INFO apache_beam.utils.subprocess_server:subprocess_server.py:132 FROM `beam`.`PCOLLECTION` AS `PCOLLECTION`
INFO apache_beam.utils.subprocess_server:subprocess_server.py:132 Aug 14, 2022 11:35:14 PM org.apache.beam.sdk.extensions.sql.impl.CalciteQueryPlanner convertToBeamRel
INFO apache_beam.utils.subprocess_server:subprocess_server.py:132 INFO: SQLPlan>
INFO apache_beam.utils.subprocess_server:subprocess_server.py:132 LogicalAggregate(group=[{}], count=[COUNT()])
INFO apache_beam.utils.subprocess_server:subprocess_server.py:132 BeamIOSourceRel(table=[[beam, PCOLLECTION]])
INFO apache_beam.utils.subprocess_server:subprocess_server.py:132
INFO apache_beam.utils.subprocess_server:subprocess_server.py:132 Aug 14, 2022 11:35:14 PM org.apache.beam.sdk.extensions.sql.impl.CalciteQueryPlanner convertToBeamRel
INFO apache_beam.utils.subprocess_server:subprocess_server.py:132 INFO: BEAMPlan>
INFO apache_beam.utils.subprocess_server:subprocess_server.py:132 BeamAggregationRel(group=[{}], count=[COUNT()])
INFO apache_beam.utils.subprocess_server:subprocess_server.py:132 BeamIOSourceRel(table=[[beam, PCOLLECTION]])
INFO apache_beam.utils.subprocess_server:subprocess_server.py:132
INFO root:environments.py:376 Default Python SDK image for environment is apache/beam_python3.7_sdk:2.42.0.dev
INFO root:environments.py:299 No image given, using default Python SDK image
INFO root:environments.py:376 Default Python SDK image for environment is apache/beam_python3.7_sdk:2.42.0.dev
INFO root:environments.py:304 Python SDK container image set to "apache/beam_python3.7_sdk:2.42.0.dev" for Docker environment
INFO apache_beam.runners.portability.fn_api_runner.translations:translations.py:714 ==================== <function pack_combiners at 0x7f89b299fe60> ====================
INFO apache_beam.runners.portability.fn_api_runner.translations:translations.py:714 ==================== <function lift_combiners at 0x7f89b299fef0> ====================
INFO apache_beam.runners.portability.fn_api_runner.translations:translations.py:714 ==================== <function sort_stages at 0x7f89b29a0680> ====================
INFO apache_beam.runners.portability.portable_runner:portable_runner.py:583 Job state changed to STOPPED
INFO apache_beam.runners.portability.portable_runner:portable_runner.py:583 Job state changed to STARTING
INFO apache_beam.runners.portability.portable_runner:portable_runner.py:583 Job state changed to RUNNING
INFO root:portable_runner.py:577 Default Python SDK image for environment is apache/beam_python3.7_sdk:2.42.0.dev
INFO root:portable_runner.py:577 ==================== <function annotate_downstream_side_inputs at 0x7efe04765050> ====================
INFO root:portable_runner.py:577 ==================== <function fix_side_input_pcoll_coders at 0x7efe04765170> ====================
INFO root:portable_runner.py:577 ==================== <function pack_combiners at 0x7efe04765680> ====================
INFO root:portable_runner.py:577 ==================== <function lift_combiners at 0x7efe04765710> ====================
INFO root:portable_runner.py:577 ==================== <function expand_sdf at 0x7efe047658c0> ====================
INFO root:portable_runner.py:577 ==================== <function expand_gbk at 0x7efe04765950> ====================
INFO root:portable_runner.py:577 ==================== <function sink_flattens at 0x7efe04765a70> ====================
INFO root:portable_runner.py:577 ==================== <function greedily_fuse at 0x7efe04765b00> ====================
INFO root:portable_runner.py:577 ==================== <function read_to_impulse at 0x7efe04765b90> ====================
INFO root:portable_runner.py:577 ==================== <function impulse_to_input at 0x7efe04765c20> ====================
INFO root:portable_runner.py:577 ==================== <function sort_stages at 0x7efe04765e60> ====================
INFO root:portable_runner.py:577 ==================== <function add_impulse_to_dangling_transforms at 0x7efe04765f80> ====================
INFO root:portable_runner.py:577 ==================== <function setup_timer_mapping at 0x7efe04765dd0> ====================
INFO root:portable_runner.py:577 ==================== <function populate_data_channel_coders at 0x7efe04765ef0> ====================
INFO root:portable_runner.py:577 starting control server on port 38755
INFO root:portable_runner.py:577 starting data server on port 46275
INFO root:portable_runner.py:577 starting state server on port 39855
INFO root:portable_runner.py:577 starting logging server on port 41405
INFO root:portable_runner.py:577 Created Worker handler <apache_beam.runners.portability.fn_api_runner.worker_handlers.DockerSdkWorkerHandler object at 0x7efe174e0d90> for environment ref_Environment_default_environment_2 (beam:env:docker:v1, b'\n$apache/beam_python3.7_sdk:2.42.0.dev')
INFO root:portable_runner.py:577 Attempting to pull image apache/beam_python3.7_sdk:2.42.0.dev
INFO root:portable_runner.py:577 Unable to pull image apache/beam_python3.7_sdk:2.42.0.dev, defaulting to local image if it exists
INFO root:portable_runner.py:577 Waiting for docker to start up. Current status is running
INFO root:portable_runner.py:577 Docker container is running. container_id = b'105919ee588b388c84670bc039712171ed2b8e4b5c5f2a991d2109d2bf69e9f1', worker_id = worker_83
INFO root:portable_runner.py:577 Created Worker handler <apache_beam.runners.portability.fn_api_runner.worker_handlers.DockerSdkWorkerHandler object at 0x7efe17516b50> for environment external_8beam:env:docker:v1 (beam:env:docker:v1, b'\n apache/beam_java8_sdk:2.42.0.dev')
INFO root:portable_runner.py:577 Attempting to pull image apache/beam_java8_sdk:2.42.0.dev
INFO root:portable_runner.py:577 Unable to pull image apache/beam_java8_sdk:2.42.0.dev, defaulting to local image if it exists
INFO root:portable_runner.py:577 Waiting for docker to start up. Current status is running
INFO root:portable_runner.py:577 Docker container is running. container_id = b'0285e5dd3a540bc130e99f6c71825760fa875035b4c7cd1932f6231970430a7d', worker_id = worker_84
INFO root:portable_runner.py:577 Completed job in 11.607980966567993 seconds with state DONE.
INFO apache_beam.runners.portability.portable_runner:portable_runner.py:583 Job state changed to DONE
PASSED [ 88%]
apache_beam/transforms/sql_test.py::SqlTransformTest::test_zetasql_generate_data
-------------------------------- live log call ---------------------------------
INFO apache_beam.utils.subprocess_server:subprocess_server.py:254 Using pre-built snapshot at <https://ci-beam.apache.org/job/beam_PostCommit_XVR_Direct/ws/src/sdks/java/extensions/sql/expansion-service/build/libs/beam-sdks-java-extensions-sql-expansion-service-2.42.0-SNAPSHOT.jar>
INFO root:external.py:773 Starting a JAR-based expansion service from JAR <https://ci-beam.apache.org/job/beam_PostCommit_XVR_Direct/ws/src/sdks/java/extensions/sql/expansion-service/build/libs/beam-sdks-java-extensions-sql-expansion-service-2.42.0-SNAPSHOT.jar>
INFO apache_beam.utils.subprocess_server:subprocess_server.py:116 Starting service with ['java' '-jar' '<https://ci-beam.apache.org/job/beam_PostCommit_XVR_Direct/ws/src/sdks/java/extensions/sql/expansion-service/build/libs/beam-sdks-java-extensions-sql-expansion-service-2.42.0-SNAPSHOT.jar'> '53499' '--filesToStage=<https://ci-beam.apache.org/job/beam_PostCommit_XVR_Direct/ws/src/sdks/java/extensions/sql/expansion-service/build/libs/beam-sdks-java-extensions-sql-expansion-service-2.42.0-SNAPSHOT.jar']>
INFO apache_beam.utils.subprocess_server:subprocess_server.py:132 Starting expansion service at localhost:53499
INFO apache_beam.utils.subprocess_server:subprocess_server.py:132 Aug 14, 2022 11:35:35 PM org.apache.beam.sdk.expansion.service.ExpansionService loadRegisteredTransforms
INFO apache_beam.utils.subprocess_server:subprocess_server.py:132 INFO: Registering external transforms: [beam:external:java:sql:v1, beam:transform:org.apache.beam:pubsub_read:v1, beam:transform:org.apache.beam:pubsub_write:v1, beam:transform:org.apache.beam:pubsublite_write:v1, beam:transform:org.apache.beam:pubsublite_read:v1, beam:transform:org.apache.beam:spanner_insert:v1, beam:transform:org.apache.beam:spanner_update:v1, beam:transform:org.apache.beam:spanner_replace:v1, beam:transform:org.apache.beam:spanner_insert_or_update:v1, beam:transform:org.apache.beam:spanner_delete:v1, beam:transform:org.apache.beam:spanner_read:v1, beam:transform:org.apache.beam:kafka_read_with_metadata:v1, beam:transform:org.apache.beam:kafka_read_without_metadata:v1, beam:transform:org.apache.beam:kafka_write:v1, beam:external:java:generate_sequence:v1]
INFO apache_beam.utils.subprocess_server:subprocess_server.py:132 beam:external:java:sql:v1: org.apache.beam.sdk.expansion.service.ExpansionService$ExternalTransformRegistrarLoader$1@47eaca72
INFO apache_beam.utils.subprocess_server:subprocess_server.py:132 beam:transform:org.apache.beam:pubsub_read:v1: org.apache.beam.sdk.expansion.service.ExpansionService$ExternalTransformRegistrarLoader$1@55141def
INFO apache_beam.utils.subprocess_server:subprocess_server.py:132 beam:transform:org.apache.beam:pubsub_write:v1: org.apache.beam.sdk.expansion.service.ExpansionService$ExternalTransformRegistrarLoader$1@55182842
INFO apache_beam.utils.subprocess_server:subprocess_server.py:132 beam:transform:org.apache.beam:pubsublite_write:v1: org.apache.beam.sdk.expansion.service.ExpansionService$ExternalTransformRegistrarLoader$1@3270d194
INFO apache_beam.utils.subprocess_server:subprocess_server.py:132 beam:transform:org.apache.beam:pubsublite_read:v1: org.apache.beam.sdk.expansion.service.ExpansionService$ExternalTransformRegistrarLoader$1@235834f2
INFO apache_beam.utils.subprocess_server:subprocess_server.py:132 beam:transform:org.apache.beam:spanner_insert:v1: org.apache.beam.sdk.expansion.service.ExpansionService$ExternalTransformRegistrarLoader$1@5656be13
INFO apache_beam.utils.subprocess_server:subprocess_server.py:132 beam:transform:org.apache.beam:spanner_update:v1: org.apache.beam.sdk.expansion.service.ExpansionService$ExternalTransformRegistrarLoader$1@4218d6a3
INFO apache_beam.utils.subprocess_server:subprocess_server.py:132 beam:transform:org.apache.beam:spanner_replace:v1: org.apache.beam.sdk.expansion.service.ExpansionService$ExternalTransformRegistrarLoader$1@76505305
INFO apache_beam.utils.subprocess_server:subprocess_server.py:132 beam:transform:org.apache.beam:spanner_insert_or_update:v1: org.apache.beam.sdk.expansion.service.ExpansionService$ExternalTransformRegistrarLoader$1@14cd1699
INFO apache_beam.utils.subprocess_server:subprocess_server.py:132 beam:transform:org.apache.beam:spanner_delete:v1: org.apache.beam.sdk.expansion.service.ExpansionService$ExternalTransformRegistrarLoader$1@77888435
INFO apache_beam.utils.subprocess_server:subprocess_server.py:132 beam:transform:org.apache.beam:spanner_read:v1: org.apache.beam.sdk.expansion.service.ExpansionService$ExternalTransformRegistrarLoader$1@73a1e9a9
INFO apache_beam.utils.subprocess_server:subprocess_server.py:132 beam:transform:org.apache.beam:kafka_read_with_metadata:v1: org.apache.beam.sdk.expansion.service.ExpansionService$ExternalTransformRegistrarLoader$1@71d44a3
INFO apache_beam.utils.subprocess_server:subprocess_server.py:132 beam:transform:org.apache.beam:kafka_read_without_metadata:v1: org.apache.beam.sdk.expansion.service.ExpansionService$ExternalTransformRegistrarLoader$1@7b98f307
INFO apache_beam.utils.subprocess_server:subprocess_server.py:132 beam:transform:org.apache.beam:kafka_write:v1: org.apache.beam.sdk.expansion.service.ExpansionService$ExternalTransformRegistrarLoader$1@4802796d
INFO apache_beam.utils.subprocess_server:subprocess_server.py:132 beam:external:java:generate_sequence:v1: org.apache.beam.sdk.expansion.service.ExpansionService$ExternalTransformRegistrarLoader$1@34123d65
INFO apache_beam.utils.subprocess_server:subprocess_server.py:132 Aug 14, 2022 11:35:36 PM org.apache.beam.sdk.expansion.service.ExpansionService expand
INFO apache_beam.utils.subprocess_server:subprocess_server.py:132 INFO: Expanding 'SqlTransform(beam:external:java:sql:v1)' with URN 'beam:external:java:sql:v1'
INFO apache_beam.utils.subprocess_server:subprocess_server.py:132 Aug 14, 2022 11:35:36 PM org.apache.beam.sdk.expansion.service.ExpansionService$ExternalTransformRegistrarLoader payloadToConfig
INFO apache_beam.utils.subprocess_server:subprocess_server.py:132 WARNING: Configuration class 'org.apache.beam.sdk.extensions.sql.expansion.ExternalSqlTransformRegistrar$Configuration' has no schema registered. Attempting to construct with setter approach.
INFO apache_beam.utils.subprocess_server:subprocess_server.py:132 Aug 14, 2022 11:35:37 PM org.apache.beam.sdk.expansion.service.ExpansionService$ExternalTransformRegistrarLoader payloadToConfig
INFO apache_beam.utils.subprocess_server:subprocess_server.py:132 WARNING: Configuration class 'org.apache.beam.sdk.extensions.sql.expansion.ExternalSqlTransformRegistrar$Configuration' has no schema registered. Attempting to construct with setter approach.
INFO apache_beam.utils.subprocess_server:subprocess_server.py:132 Aug 14, 2022 11:35:39 PM com.google.zetasql.io.grpc.NameResolverRegistry getDefaultRegistry
INFO apache_beam.utils.subprocess_server:subprocess_server.py:132 WARNING: No NameResolverProviders found via ServiceLoader, including for DNS. This is probably due to a broken build. If using ProGuard, check your configuration
INFO apache_beam.utils.subprocess_server:subprocess_server.py:132 Aug 14, 2022 11:35:40 PM org.apache.beam.sdk.extensions.sql.zetasql.ZetaSQLQueryPlanner convertToBeamRelInternal
INFO apache_beam.utils.subprocess_server:subprocess_server.py:132 INFO: BEAMPlan>
INFO apache_beam.utils.subprocess_server:subprocess_server.py:132 BeamZetaSqlCalcRel(expr#0=[{inputs}], expr#1=[1:BIGINT], expr#2=['foo':VARCHAR], expr#3=[3.1400000000000001243E0:DOUBLE], int=[$t1], str=[$t2], flt=[$t3])
INFO apache_beam.utils.subprocess_server:subprocess_server.py:132 BeamValuesRel(tuples=[[{ 0 }]])
INFO apache_beam.utils.subprocess_server:subprocess_server.py:132
INFO root:environments.py:376 Default Python SDK image for environment is apache/beam_python3.7_sdk:2.42.0.dev
INFO root:environments.py:299 No image given, using default Python SDK image
INFO root:environments.py:376 Default Python SDK image for environment is apache/beam_python3.7_sdk:2.42.0.dev
INFO root:environments.py:304 Python SDK container image set to "apache/beam_python3.7_sdk:2.42.0.dev" for Docker environment
INFO apache_beam.runners.portability.fn_api_runner.translations:translations.py:714 ==================== <function pack_combiners at 0x7f89b299fe60> ====================
INFO apache_beam.runners.portability.fn_api_runner.translations:translations.py:714 ==================== <function lift_combiners at 0x7f89b299fef0> ====================
INFO apache_beam.runners.portability.fn_api_runner.translations:translations.py:714 ==================== <function sort_stages at 0x7f89b29a0680> ====================
INFO apache_beam.runners.portability.portable_runner:portable_runner.py:583 Job state changed to STOPPED
INFO apache_beam.runners.portability.portable_runner:portable_runner.py:583 Job state changed to STARTING
INFO apache_beam.runners.portability.portable_runner:portable_runner.py:583 Job state changed to RUNNING
INFO root:portable_runner.py:577 Default Python SDK image for environment is apache/beam_python3.7_sdk:2.42.0.dev
INFO root:portable_runner.py:577 ==================== <function annotate_downstream_side_inputs at 0x7efe04765050> ====================
INFO root:portable_runner.py:577 ==================== <function fix_side_input_pcoll_coders at 0x7efe04765170> ====================
INFO root:portable_runner.py:577 ==================== <function pack_combiners at 0x7efe04765680> ====================
INFO root:portable_runner.py:577 ==================== <function lift_combiners at 0x7efe04765710> ====================
INFO root:portable_runner.py:577 ==================== <function expand_sdf at 0x7efe047658c0> ====================
INFO root:portable_runner.py:577 ==================== <function expand_gbk at 0x7efe04765950> ====================
INFO root:portable_runner.py:577 ==================== <function sink_flattens at 0x7efe04765a70> ====================
INFO root:portable_runner.py:577 ==================== <function greedily_fuse at 0x7efe04765b00> ====================
INFO root:portable_runner.py:577 ==================== <function read_to_impulse at 0x7efe04765b90> ====================
INFO root:portable_runner.py:577 ==================== <function impulse_to_input at 0x7efe04765c20> ====================
INFO root:portable_runner.py:577 ==================== <function sort_stages at 0x7efe04765e60> ====================
INFO root:portable_runner.py:577 ==================== <function add_impulse_to_dangling_transforms at 0x7efe04765f80> ====================
INFO root:portable_runner.py:577 ==================== <function setup_timer_mapping at 0x7efe04765dd0> ====================
INFO root:portable_runner.py:577 ==================== <function populate_data_channel_coders at 0x7efe04765ef0> ====================
INFO root:portable_runner.py:577 starting control server on port 39567
INFO root:portable_runner.py:577 starting data server on port 46311
INFO root:portable_runner.py:577 starting state server on port 41683
INFO root:portable_runner.py:577 starting logging server on port 42523
INFO root:portable_runner.py:577 Created Worker handler <apache_beam.runners.portability.fn_api_runner.worker_handlers.DockerSdkWorkerHandler object at 0x7efe0465d950> for environment ref_Environment_default_environment_2 (beam:env:docker:v1, b'\n$apache/beam_python3.7_sdk:2.42.0.dev')
INFO root:portable_runner.py:577 Attempting to pull image apache/beam_python3.7_sdk:2.42.0.dev
INFO root:portable_runner.py:577 Unable to pull image apache/beam_python3.7_sdk:2.42.0.dev, defaulting to local image if it exists
INFO root:portable_runner.py:577 Waiting for docker to start up. Current status is running
INFO root:portable_runner.py:577 Docker container is running. container_id = b'c3017bc9a26e9ddab0166e25718e624b50a5e1b8609b2a8a646cbcc34463079b', worker_id = worker_85
INFO root:portable_runner.py:577 Created Worker handler <apache_beam.runners.portability.fn_api_runner.worker_handlers.DockerSdkWorkerHandler object at 0x7efe04636550> for environment external_9beam:env:docker:v1 (beam:env:docker:v1, b'\n apache/beam_java8_sdk:2.42.0.dev')
INFO root:portable_runner.py:577 Attempting to pull image apache/beam_java8_sdk:2.42.0.dev
INFO root:portable_runner.py:577 Unable to pull image apache/beam_java8_sdk:2.42.0.dev, defaulting to local image if it exists
INFO root:portable_runner.py:577 Waiting for docker to start up. Current status is running
INFO root:portable_runner.py:577 Docker container is running. container_id = b'17b3744b6b12e1de79d19a5df66d6ae43d540a88179cdf4039ddbdf229b9a93d', worker_id = worker_86
INFO root:portable_runner.py:577 Completed job in 14.24433183670044 seconds with state DONE.
INFO apache_beam.runners.portability.portable_runner:portable_runner.py:583 Job state changed to DONE
PASSED [100%]
=============================== warnings summary ===============================
../../build/gradleenv/1922375555/lib/python3.7/site-packages/hdfs/config.py:15
<https://ci-beam.apache.org/job/beam_PostCommit_XVR_Direct/ws/src/build/gradleenv/1922375555/lib/python3.7/site-packages/hdfs/config.py>:15: DeprecationWarning: the imp module is deprecated in favour of importlib; see the module's documentation for alternative uses
from imp import load_source
-- Docs: https://docs.pytest.org/en/stable/how-to/capture-warnings.html
- generated xml file: <https://ci-beam.apache.org/job/beam_PostCommit_XVR_Direct/ws/src/sdks/python/pytest_xlangSqlValidateRunner.xml> -
===== 9 passed, 2 skipped, 6541 deselected, 1 warning in 234.11s (0:03:54) =====
> Task :sdks:python:test-suites:direct:xlang:validatesCrossLanguageRunnerCleanup
Stopping expansion service pid: 2721079.
Stopping expansion service pid: 2721080.
> Task :sdks:python:test-suites:direct:xlang:fnApiJobServerCleanup
Killing process at 2718338
FAILURE: Build failed with an exception.
* What went wrong:
Execution failed for task ':sdks:python:test-suites:direct:xlang:validatesCrossLanguageRunnerJavaUsingPython'.
> There were failing tests. See the report at: file://<https://ci-beam.apache.org/job/beam_PostCommit_XVR_Direct/ws/src/sdks/python/test-suites/direct/xlang/build/reports/tests/validatesCrossLanguageRunnerJavaUsingPython/index.html>
* Try:
> Run with --stacktrace option to get the stack trace.
> Run with --info or --debug option to get more log output.
> Run with --scan to get full insights.
* Get more help at https://help.gradle.org
Deprecated Gradle features were used in this build, making it incompatible with Gradle 8.0.
You can use '--warning-mode all' to show the individual deprecation warnings and determine if they come from your own scripts or plugins.
See https://docs.gradle.org/7.4/userguide/command_line_interface.html#sec:command_line_warnings
Execution optimizations have been disabled for 1 invalid unit(s) of work during this build to ensure correctness.
Please consult deprecation warnings for more details.
BUILD FAILED in 25m 29s
247 actionable tasks: 162 executed, 73 from cache, 12 up-to-date
Publishing build scan...
https://gradle.com/s/7hiw7d2yccpiy
Build step 'Invoke Gradle script' changed build result to FAILURE
Build step 'Invoke Gradle script' marked build as failure
---------------------------------------------------------------------
To unsubscribe, e-mail: builds-unsubscribe@beam.apache.org
For additional commands, e-mail: builds-help@beam.apache.org
Jenkins build is back to normal : beam_PostCommit_XVR_Direct #3025
Posted by Apache Jenkins Server <je...@builds.apache.org>.
See <https://ci-beam.apache.org/job/beam_PostCommit_XVR_Direct/3025/display/redirect?page=changes>
---------------------------------------------------------------------
To unsubscribe, e-mail: builds-unsubscribe@beam.apache.org
For additional commands, e-mail: builds-help@beam.apache.org
Build failed in Jenkins: beam_PostCommit_XVR_Direct #3024
Posted by Apache Jenkins Server <je...@builds.apache.org>.
See <https://ci-beam.apache.org/job/beam_PostCommit_XVR_Direct/3024/display/redirect?page=changes>
Changes:
[noreply] [BEAM-13015, #21250] Remove looking up thread local metrics container
[noreply] [fixes #22731] Publish nightly snapshot of legacy Dataflow worker jar.
------------------------------------------
[...truncated 839.58 KB...]
>
>
>
coders: <
key: "ZCNlEJivxnVarIntCoder"
value: <
spec: <
urn: "beam:coders:javasdk:0.1"
payload: "\202SNAPPY\000\000\000\000\001\000\000\000\001\000\000\000\210\330\001\350\254\355\000\005sr\000&org.apache.beam.sdk.coders.VarIntCoder\300K2\332\251KVh\002\000\000xrr5\000\024Atomic\0055 \307\354\265\314\205tPF\002\0055\000*jj\000$Structured\0059\034s\277\022\016\325\3246\021\t9\000 j9\000\005/0C\335\325\211\256\274~\370\002\000\000xp"
>
>
>
coders: <
key: "ZCNlEJivxnVoidCoder"
value: <
spec: <
urn: "beam:coders:javasdk:0.1"
payload: "\202SNAPPY\000\000\000\000\001\000\000\000\001\000\000\000\210\326\001\350\254\355\000\005sr\000$org.apache.beam.sdk.coders.VoidCoder\271\277U\233\350\r\257U\002\000\000xr\000&j3\000\024Atomic\0055 \307\354\265\314\205tPF\002\0055\000*j5\000$Structured\0059\034s\277\022\016\325\3246\021\t9\000 j9\000\005/0C\335\325\211\256\274~\370\002\000\000xp"
>
>
>
coders: <
key: "c0"
value: <
spec: <
urn: "beam:coder:bytes:v1"
>
>
>
coders: <
key: "c1"
value: <
spec: <
urn: "beam:coder:global_window:v1"
>
>
>
coders: <
key: "c2"
value: <
spec: <
urn: "beam:coder:row:v1"
payload: "\n\r\n\007role_id\032\002\020\003\022$abc5e222-ab8f-4f6f-800a-a58bb0f45675"
>
>
>
environments: <
key: "ZCNlEJivxnbeam:env:docker:v1"
value: <
urn: "beam:env:docker:v1"
payload: "\n apache/beam_java8_sdk:2.42.0.dev"
capabilities: "beam:coder:bytes:v1"
capabilities: "beam:coder:bool:v1"
capabilities: "beam:coder:varint:v1"
capabilities: "beam:coder:string_utf8:v1"
capabilities: "beam:coder:iterable:v1"
capabilities: "beam:coder:timer:v1"
capabilities: "beam:coder:kv:v1"
capabilities: "beam:coder:length_prefix:v1"
capabilities: "beam:coder:global_window:v1"
capabilities: "beam:coder:interval_window:v1"
capabilities: "beam:coder:custom_window:v1"
capabilities: "beam:coder:windowed_value:v1"
capabilities: "beam:coder:double:v1"
capabilities: "beam:coder:row:v1"
capabilities: "beam:coder:param_windowed_value:v1"
capabilities: "beam:coder:state_backed_iterable:v1"
capabilities: "beam:coder:sharded_key:v1"
capabilities: "beam:coder:nullable:v1"
capabilities: "beam:protocol:multi_core_bundle_processing:v1"
capabilities: "beam:protocol:progress_reporting:v1"
capabilities: "beam:protocol:harness_monitoring_infos:v1"
capabilities: "beam:protocol:control_request_elements_embedding:v1"
capabilities: "beam:protocol:state_caching:v1"
capabilities: "beam:version:sdk_base:apache/beam_java8_sdk:2.42.0.dev"
capabilities: "beam:transform:sdf_truncate_sized_restrictions:v1"
capabilities: "beam:transform:to_string:v1"
dependencies: <
type_urn: "beam:artifact:type:file:v1"
type_payload: "\nL/tmp/artifacts/icedtea-sound-CGRxIE9edPHnbxQhM-L5mp8h21H-ySB79uQtSquPV_Q.jar\022@086471204f5e74f1e76f142133e2f99a9f21db51fec9207bf6e42d4aab8f57f4"
role_urn: "beam:artifact:role:staging_to:v1"
role_payload: "\n=icedtea-sound-CGRxIE9edPHnbxQhM-L5mp8h21H-ySB79uQtSquPV_Q.jar"
>
dependencies: <
type_urn: "beam:artifact:type:file:v1"
type_payload: "\nF/tmp/artifacts/jaccess-FBI0Bb27lF3oEBieWAi7SP8X1zBR8k4BJQOVpsoK9a0.jar\022@14123405bdbb945de810189e5808bb48ff17d73051f24e01250395a6ca0af5ad"
role_urn: "beam:artifact:role:staging_to:v1"
role_payload: "\n7jaccess-FBI0Bb27lF3oEBieWAi7SP8X1zBR8k4BJQOVpsoK9a0.jar"
>
dependencies: <
type_urn: "beam:artifact:type:file:v1"
type_payload: "\nI/tmp/artifacts/localedata-kJ2mc8rBH5-IklhfR1XzNotlIQ_mnVMA-pgaXv2r8Ag.jar\022@909da673cac11f9f8892585f4755f3368b65210fe69d5300fa981a5efdabf008"
role_urn: "beam:artifact:role:staging_to:v1"
role_payload: "\n:localedata-kJ2mc8rBH5-IklhfR1XzNotlIQ_mnVMA-pgaXv2r8Ag.jar"
>
dependencies: <
type_urn: "beam:artifact:type:file:v1"
type_payload: "\nF/tmp/artifacts/nashorn-B0CAb3QpJET_6VsT3hcC_89VtvhV616H8N2bHAIaqWo.jar\022@0740806f74292444ffe95b13de1702ffcf55b6f855eb5e87f0dd9b1c021aa96a"
role_urn: "beam:artifact:role:staging_to:v1"
role_payload: "\n7nashorn-B0CAb3QpJET_6VsT3hcC_89VtvhV616H8N2bHAIaqWo.jar"
>
dependencies: <
type_urn: "beam:artifact:type:file:v1"
type_payload: "\nG/tmp/artifacts/cldrdata-gclqV9lOGqQOKesG-a6TAUTGEYlyIDqpyd4M_k7gtWo.jar\022@81c96a57d94e1aa40e29eb06f9ae930144c6118972203aa9c9de0cfe4ee0b56a"
role_urn: "beam:artifact:role:staging_to:v1"
role_payload: "\n8cldrdata-gclqV9lOGqQOKesG-a6TAUTGEYlyIDqpyd4M_k7gtWo.jar"
>
dependencies: <
type_urn: "beam:artifact:type:file:v1"
type_payload: "\nD/tmp/artifacts/dnsns-byzoQxdXengTvA5IlbH9gSIzfhNQElRYltuMJN0vjcc.jar\022@6f2ce84317577a7813bc0e4895b1fd8122337e135012545896db8c24dd2f8dc7"
role_urn: "beam:artifact:role:staging_to:v1"
role_payload: "\n5dnsns-byzoQxdXengTvA5IlbH9gSIzfhNQElRYltuMJN0vjcc.jar"
>
dependencies: <
type_urn: "beam:artifact:type:file:v1"
type_payload: "\n\203\001/tmp/artifacts/beam-sdks-java-extensions-schemaio-expansion-service-2.42.0-SNAPSHOT-tspKzIeu8ngAGpggVreVyvUKbAF_wqHiSp-oDjCpAfw.jar\022@b6ca4acc87aef278001a982056b795caf50a6c017fc2a1e24a9fa80e30a901fc"
role_urn: "beam:artifact:role:staging_to:v1"
role_payload: "\ntbeam-sdks-java-extensions-schemaio-expansion-service-2.42.0-SNAPSHOT-tspKzIeu8ngAGpggVreVyvUKbAF_wqHiSp-oDjCpAfw.jar"
>
>
>
environments: <
key: "go"
value: <
urn: "beam:env:docker:v1"
payload: "\n\026apache/beam_go_sdk:dev"
capabilities: "beam:protocol:progress_reporting:v1"
capabilities: "beam:protocol:multi_core_bundle_processing:v1"
capabilities: "beam:transform:sdf_truncate_sized_restrictions:v1"
capabilities: "beam:protocol:worker_status:v1"
capabilities: "beam:protocol:monitoring_info_short_ids:v1"
capabilities: "beam:version:sdk_base:go"
capabilities: "beam:coder:bytes:v1"
capabilities: "beam:coder:bool:v1"
capabilities: "beam:coder:varint:v1"
capabilities: "beam:coder:double:v1"
capabilities: "beam:coder:string_utf8:v1"
capabilities: "beam:coder:length_prefix:v1"
capabilities: "beam:coder:kv:v1"
capabilities: "beam:coder:iterable:v1"
capabilities: "beam:coder:state_backed_iterable:v1"
capabilities: "beam:coder:windowed_value:v1"
capabilities: "beam:coder:global_window:v1"
capabilities: "beam:coder:interval_window:v1"
capabilities: "beam:coder:row:v1"
capabilities: "beam:coder:nullable:v1"
dependencies: <
type_urn: "beam:artifact:type:file:v1"
role_urn: "beam:artifact:role:go_worker_binary:v1"
>
>
>
>
root_transform_ids: "e2"
root_transform_ids: "e3"
root_transform_ids: "s1"
root_transform_ids: "s3"
requirements: "beam:requirement:pardo:splittable_dofn:v1"
2022/08/16 23:25:51 Cross-compiling <https://ci-beam.apache.org/job/beam_PostCommit_XVR_Direct/ws/src/sdks/go/test/integration/io/xlang/jdbc/jdbc_test.go> as /tmp/worker-4-1660692351869348255
2022/08/16 23:25:54 Prepared job with id: go-testjdbcio_postgresreadwrite-620-b61c0045-b4ad-4a31-9fa2-84c746fe4db0 and staging token: go-testjdbcio_postgresreadwrite-620-b61c0045-b4ad-4a31-9fa2-84c746fe4db0
2022/08/16 23:25:54 Staged binary artifact with token:
2022/08/16 23:25:54 Submitted job: go-testjdbcio_postgresreadwrite-620-b61c0045-b4ad-4a31-9fa2-84c746fe4db0
2022/08/16 23:25:54 2022-08-16 23:25:54. (1): Default Python SDK image for environment is apache/beam_python3.7_sdk:2.42.0.dev
2022/08/16 23:25:54 Job state: STOPPED
2022/08/16 23:25:54 Job state: STARTING
2022/08/16 23:25:54 Job state: RUNNING
2022/08/16 23:25:54 2022-08-16 23:25:54. (2): ==================== <function annotate_downstream_side_inputs at 0x7f05648f0050> ====================
2022/08/16 23:25:54 2022-08-16 23:25:54. (3): ==================== <function fix_side_input_pcoll_coders at 0x7f05648f0170> ====================
2022/08/16 23:25:54 2022-08-16 23:25:54. (4): ==================== <function pack_combiners at 0x7f05648f0680> ====================
2022/08/16 23:25:54 2022-08-16 23:25:54. (5): ==================== <function lift_combiners at 0x7f05648f0710> ====================
2022/08/16 23:25:54 2022-08-16 23:25:54. (6): ==================== <function expand_sdf at 0x7f05648f08c0> ====================
2022/08/16 23:25:54 2022-08-16 23:25:54. (7): ==================== <function expand_gbk at 0x7f05648f0950> ====================
2022/08/16 23:25:54 2022-08-16 23:25:54. (8): ==================== <function sink_flattens at 0x7f05648f0a70> ====================
2022/08/16 23:25:54 2022-08-16 23:25:54. (9): ==================== <function greedily_fuse at 0x7f05648f0b00> ====================
2022/08/16 23:25:54 2022-08-16 23:25:54. (10): ==================== <function read_to_impulse at 0x7f05648f0b90> ====================
2022/08/16 23:25:54 2022-08-16 23:25:54. (11): ==================== <function impulse_to_input at 0x7f05648f0c20> ====================
2022/08/16 23:25:54 2022-08-16 23:25:54. (12): ==================== <function sort_stages at 0x7f05648f0e60> ====================
2022/08/16 23:25:54 2022-08-16 23:25:54. (13): ==================== <function add_impulse_to_dangling_transforms at 0x7f05648f0f80> ====================
2022/08/16 23:25:54 2022-08-16 23:25:54. (14): ==================== <function setup_timer_mapping at 0x7f05648f0dd0> ====================
2022/08/16 23:25:54 2022-08-16 23:25:54. (15): ==================== <function populate_data_channel_coders at 0x7f05648f0ef0> ====================
2022/08/16 23:25:54 2022-08-16 23:25:54. (16): starting control server on port 40369
2022/08/16 23:25:54 2022-08-16 23:25:54. (17): starting data server on port 35513
2022/08/16 23:25:54 2022-08-16 23:25:54. (18): starting state server on port 35889
2022/08/16 23:25:54 2022-08-16 23:25:54. (19): starting logging server on port 34037
2022/08/16 23:25:54 2022-08-16 23:25:54. (20): Created Worker handler <apache_beam.runners.portability.fn_api_runner.worker_handlers.DockerSdkWorkerHandler object at 0x7f056464dc50> for environment ZCNlEJivxnbeam:env:docker:v1 (beam:env:docker:v1, b'\n apache/beam_java8_sdk:2.42.0.dev')
2022/08/16 23:25:57 2022-08-16 23:25:57. (21): Attempting to pull image apache/beam_java8_sdk:2.42.0.dev
2022/08/16 23:25:57 2022-08-16 23:25:57. (22): Unable to pull image apache/beam_java8_sdk:2.42.0.dev, defaulting to local image if it exists
2022/08/16 23:25:59 2022-08-16 23:25:59. (23): Waiting for docker to start up. Current status is running
2022/08/16 23:25:59 2022-08-16 23:25:59. (24): Docker container is running. container_id = b'1ace8b7edf57949cdc48d25a41a25cc0f54518bf8295d91afc973751dc97eb95', worker_id = worker_17
2022/08/16 23:26:00 2022-08-16 23:26:00. (25): Created Worker handler <apache_beam.runners.portability.fn_api_runner.worker_handlers.DockerSdkWorkerHandler object at 0x7f056466cfd0> for environment go (beam:env:docker:v1, b'\n\x16apache/beam_go_sdk:dev')
2022/08/16 23:26:02 2022-08-16 23:26:02. (26): Attempting to pull image apache/beam_go_sdk:dev
2022/08/16 23:26:03 2022-08-16 23:26:03. (27): Unable to pull image apache/beam_go_sdk:dev, defaulting to local image if it exists
2022/08/16 23:26:04 2022-08-16 23:26:04. (28): Waiting for docker to start up. Current status is running
2022/08/16 23:26:04 2022-08-16 23:26:04. (29): Docker container is running. container_id = b'db5f750e450f461b0cbfdd7bf8a27ea0044bead79e59ad599d8ecbcfe300a26c', worker_id = worker_19
2022/08/16 23:26:09 2022-08-16 23:26:09. (30): Completed job in 14.663540363311768 seconds with state DONE.
2022/08/16 23:26:09 Job state: DONE
--- PASS: TestJDBCIO_PostgresReadWrite (45.47s)
PASS
ok github.com/apache/beam/sdks/v2/go/test/integration/io/xlang/jdbc 109.956s
=== RUN TestKafkaIO_BasicReadWrite
integration.go:264: Test TestKafkaIO_BasicReadWrite is currently filtered for runner portable
--- SKIP: TestKafkaIO_BasicReadWrite (0.00s)
PASS
ok github.com/apache/beam/sdks/v2/go/test/integration/io/xlang/kafka 6.066s
> Task :sdks:python:test-suites:direct:xlang:validatesCrossLanguageRunnerJavaUsingPython
org.apache.beam.runners.core.construction.ValidateRunnerXlangTest$SingleInputOutputTest > test FAILED
java.lang.RuntimeException at ValidateRunnerXlangTest.java:242
java.lang.NullPointerException at Preconditions.java:980
14 tests completed, 1 failed
> Task :sdks:python:test-suites:direct:xlang:validatesCrossLanguageRunnerJavaUsingPython FAILED
> Task :sdks:python:test-suites:direct:xlang:validatesCrossLanguageRunnerPythonUsingJava
> Task :sdks:python:test-suites:direct:xlang:validatesCrossLanguageRunnerPythonUsingSql
> Task :sdks:python:test-suites:direct:xlang:validatesCrossLanguageRunnerCleanup
> Task :sdks:python:test-suites:direct:xlang:fnApiJobServerCleanup
FAILURE: Build failed with an exception.
* What went wrong:
Execution failed for task ':sdks:python:test-suites:direct:xlang:validatesCrossLanguageRunnerJavaUsingPython'.
> There were failing tests. See the report at: file://<https://ci-beam.apache.org/job/beam_PostCommit_XVR_Direct/ws/src/sdks/python/test-suites/direct/xlang/build/reports/tests/validatesCrossLanguageRunnerJavaUsingPython/index.html>
* Try:
> Run with --stacktrace option to get the stack trace.
> Run with --info or --debug option to get more log output.
> Run with --scan to get full insights.
* Get more help at https://help.gradle.org
Deprecated Gradle features were used in this build, making it incompatible with Gradle 8.0.
You can use '--warning-mode all' to show the individual deprecation warnings and determine if they come from your own scripts or plugins.
See https://docs.gradle.org/7.4/userguide/command_line_interface.html#sec:command_line_warnings
Execution optimizations have been disabled for 1 invalid unit(s) of work during this build to ensure correctness.
Please consult deprecation warnings for more details.
BUILD FAILED in 31m 31s
247 actionable tasks: 186 executed, 49 from cache, 12 up-to-date
Publishing build scan...
https://gradle.com/s/hehlld25qgtug
Build step 'Invoke Gradle script' changed build result to FAILURE
Build step 'Invoke Gradle script' marked build as failure
---------------------------------------------------------------------
To unsubscribe, e-mail: builds-unsubscribe@beam.apache.org
For additional commands, e-mail: builds-help@beam.apache.org
Build failed in Jenkins: beam_PostCommit_XVR_Direct #3023
Posted by Apache Jenkins Server <je...@builds.apache.org>.
See <https://ci-beam.apache.org/job/beam_PostCommit_XVR_Direct/3023/display/redirect?page=changes>
Changes:
[noreply] Handle single-precision float values in the standard coders tests
------------------------------------------
[...truncated 842.58 KB...]
>
>
>
coders: <
key: "FZJAmnzfpoVarIntCoder"
value: <
spec: <
urn: "beam:coders:javasdk:0.1"
payload: "\202SNAPPY\000\000\000\000\001\000\000\000\001\000\000\000\210\330\001\350\254\355\000\005sr\000&org.apache.beam.sdk.coders.VarIntCoder\300K2\332\251KVh\002\000\000xrr5\000\024Atomic\0055 \307\354\265\314\205tPF\002\0055\000*jj\000$Structured\0059\034s\277\022\016\325\3246\021\t9\000 j9\000\005/0C\335\325\211\256\274~\370\002\000\000xp"
>
>
>
coders: <
key: "FZJAmnzfpoVoidCoder"
value: <
spec: <
urn: "beam:coders:javasdk:0.1"
payload: "\202SNAPPY\000\000\000\000\001\000\000\000\001\000\000\000\210\326\001\350\254\355\000\005sr\000$org.apache.beam.sdk.coders.VoidCoder\271\277U\233\350\r\257U\002\000\000xr\000&j3\000\024Atomic\0055 \307\354\265\314\205tPF\002\0055\000*j5\000$Structured\0059\034s\277\022\016\325\3246\021\t9\000 j9\000\005/0C\335\325\211\256\274~\370\002\000\000xp"
>
>
>
coders: <
key: "c0"
value: <
spec: <
urn: "beam:coder:bytes:v1"
>
>
>
coders: <
key: "c1"
value: <
spec: <
urn: "beam:coder:global_window:v1"
>
>
>
coders: <
key: "c2"
value: <
spec: <
urn: "beam:coder:row:v1"
payload: "\n\r\n\007role_id\032\002\020\003\022$abc5e222-ab8f-4f6f-800a-a58bb0f45675"
>
>
>
environments: <
key: "FZJAmnzfpobeam:env:docker:v1"
value: <
urn: "beam:env:docker:v1"
payload: "\n apache/beam_java8_sdk:2.42.0.dev"
capabilities: "beam:coder:bytes:v1"
capabilities: "beam:coder:bool:v1"
capabilities: "beam:coder:varint:v1"
capabilities: "beam:coder:string_utf8:v1"
capabilities: "beam:coder:iterable:v1"
capabilities: "beam:coder:timer:v1"
capabilities: "beam:coder:kv:v1"
capabilities: "beam:coder:length_prefix:v1"
capabilities: "beam:coder:global_window:v1"
capabilities: "beam:coder:interval_window:v1"
capabilities: "beam:coder:custom_window:v1"
capabilities: "beam:coder:windowed_value:v1"
capabilities: "beam:coder:double:v1"
capabilities: "beam:coder:row:v1"
capabilities: "beam:coder:param_windowed_value:v1"
capabilities: "beam:coder:state_backed_iterable:v1"
capabilities: "beam:coder:sharded_key:v1"
capabilities: "beam:coder:nullable:v1"
capabilities: "beam:protocol:multi_core_bundle_processing:v1"
capabilities: "beam:protocol:progress_reporting:v1"
capabilities: "beam:protocol:harness_monitoring_infos:v1"
capabilities: "beam:protocol:control_request_elements_embedding:v1"
capabilities: "beam:protocol:state_caching:v1"
capabilities: "beam:version:sdk_base:apache/beam_java8_sdk:2.42.0.dev"
capabilities: "beam:transform:sdf_truncate_sized_restrictions:v1"
capabilities: "beam:transform:to_string:v1"
dependencies: <
type_urn: "beam:artifact:type:file:v1"
type_payload: "\nL/tmp/artifacts/icedtea-sound-CGRxIE9edPHnbxQhM-L5mp8h21H-ySB79uQtSquPV_Q.jar\022@086471204f5e74f1e76f142133e2f99a9f21db51fec9207bf6e42d4aab8f57f4"
role_urn: "beam:artifact:role:staging_to:v1"
role_payload: "\n=icedtea-sound-CGRxIE9edPHnbxQhM-L5mp8h21H-ySB79uQtSquPV_Q.jar"
>
dependencies: <
type_urn: "beam:artifact:type:file:v1"
type_payload: "\nF/tmp/artifacts/jaccess-FBI0Bb27lF3oEBieWAi7SP8X1zBR8k4BJQOVpsoK9a0.jar\022@14123405bdbb945de810189e5808bb48ff17d73051f24e01250395a6ca0af5ad"
role_urn: "beam:artifact:role:staging_to:v1"
role_payload: "\n7jaccess-FBI0Bb27lF3oEBieWAi7SP8X1zBR8k4BJQOVpsoK9a0.jar"
>
dependencies: <
type_urn: "beam:artifact:type:file:v1"
type_payload: "\nI/tmp/artifacts/localedata-kJ2mc8rBH5-IklhfR1XzNotlIQ_mnVMA-pgaXv2r8Ag.jar\022@909da673cac11f9f8892585f4755f3368b65210fe69d5300fa981a5efdabf008"
role_urn: "beam:artifact:role:staging_to:v1"
role_payload: "\n:localedata-kJ2mc8rBH5-IklhfR1XzNotlIQ_mnVMA-pgaXv2r8Ag.jar"
>
dependencies: <
type_urn: "beam:artifact:type:file:v1"
type_payload: "\nF/tmp/artifacts/nashorn-B0CAb3QpJET_6VsT3hcC_89VtvhV616H8N2bHAIaqWo.jar\022@0740806f74292444ffe95b13de1702ffcf55b6f855eb5e87f0dd9b1c021aa96a"
role_urn: "beam:artifact:role:staging_to:v1"
role_payload: "\n7nashorn-B0CAb3QpJET_6VsT3hcC_89VtvhV616H8N2bHAIaqWo.jar"
>
dependencies: <
type_urn: "beam:artifact:type:file:v1"
type_payload: "\nG/tmp/artifacts/cldrdata-gclqV9lOGqQOKesG-a6TAUTGEYlyIDqpyd4M_k7gtWo.jar\022@81c96a57d94e1aa40e29eb06f9ae930144c6118972203aa9c9de0cfe4ee0b56a"
role_urn: "beam:artifact:role:staging_to:v1"
role_payload: "\n8cldrdata-gclqV9lOGqQOKesG-a6TAUTGEYlyIDqpyd4M_k7gtWo.jar"
>
dependencies: <
type_urn: "beam:artifact:type:file:v1"
type_payload: "\nD/tmp/artifacts/dnsns-byzoQxdXengTvA5IlbH9gSIzfhNQElRYltuMJN0vjcc.jar\022@6f2ce84317577a7813bc0e4895b1fd8122337e135012545896db8c24dd2f8dc7"
role_urn: "beam:artifact:role:staging_to:v1"
role_payload: "\n5dnsns-byzoQxdXengTvA5IlbH9gSIzfhNQElRYltuMJN0vjcc.jar"
>
dependencies: <
type_urn: "beam:artifact:type:file:v1"
type_payload: "\n\203\001/tmp/artifacts/beam-sdks-java-extensions-schemaio-expansion-service-2.42.0-SNAPSHOT-zzwHqZGN3wuL-1HwtI-94hEP-XBwpvK21LFz6mZ-W30.jar\022@cf3c07a9918ddf0b8bfb51f0b48fbde2110ff97070a6f2b6d4b173ea667e5b7d"
role_urn: "beam:artifact:role:staging_to:v1"
role_payload: "\ntbeam-sdks-java-extensions-schemaio-expansion-service-2.42.0-SNAPSHOT-zzwHqZGN3wuL-1HwtI-94hEP-XBwpvK21LFz6mZ-W30.jar"
>
>
>
environments: <
key: "go"
value: <
urn: "beam:env:docker:v1"
payload: "\n\026apache/beam_go_sdk:dev"
capabilities: "beam:protocol:progress_reporting:v1"
capabilities: "beam:protocol:multi_core_bundle_processing:v1"
capabilities: "beam:transform:sdf_truncate_sized_restrictions:v1"
capabilities: "beam:protocol:worker_status:v1"
capabilities: "beam:protocol:monitoring_info_short_ids:v1"
capabilities: "beam:version:sdk_base:go"
capabilities: "beam:coder:bytes:v1"
capabilities: "beam:coder:bool:v1"
capabilities: "beam:coder:varint:v1"
capabilities: "beam:coder:double:v1"
capabilities: "beam:coder:string_utf8:v1"
capabilities: "beam:coder:length_prefix:v1"
capabilities: "beam:coder:kv:v1"
capabilities: "beam:coder:iterable:v1"
capabilities: "beam:coder:state_backed_iterable:v1"
capabilities: "beam:coder:windowed_value:v1"
capabilities: "beam:coder:global_window:v1"
capabilities: "beam:coder:interval_window:v1"
capabilities: "beam:coder:row:v1"
capabilities: "beam:coder:nullable:v1"
dependencies: <
type_urn: "beam:artifact:type:file:v1"
role_urn: "beam:artifact:role:go_worker_binary:v1"
>
>
>
>
root_transform_ids: "s1"
root_transform_ids: "e2"
root_transform_ids: "e3"
root_transform_ids: "s3"
requirements: "beam:requirement:pardo:splittable_dofn:v1"
2022/08/16 17:21:40 Cross-compiling <https://ci-beam.apache.org/job/beam_PostCommit_XVR_Direct/ws/src/sdks/go/test/integration/io/xlang/jdbc/jdbc_test.go> as /tmp/worker-4-1660670500281037934
2022/08/16 17:21:42 Prepared job with id: go-testjdbcio_postgresreadwrite-28-b55e3ad3-92d6-4160-abb7-6025730715e2 and staging token: go-testjdbcio_postgresreadwrite-28-b55e3ad3-92d6-4160-abb7-6025730715e2
2022/08/16 17:21:42 Staged binary artifact with token:
2022/08/16 17:21:42 Submitted job: go-testjdbcio_postgresreadwrite-28-b55e3ad3-92d6-4160-abb7-6025730715e2
2022/08/16 17:21:42 2022-08-16 17:21:42. (1): Default Python SDK image for environment is apache/beam_python3.7_sdk:2.42.0.dev
2022/08/16 17:21:42 Job state: STOPPED
2022/08/16 17:21:42 Job state: STARTING
2022/08/16 17:21:42 Job state: RUNNING
2022/08/16 17:21:42 2022-08-16 17:21:42. (2): ==================== <function annotate_downstream_side_inputs at 0x7f9141132050> ====================
2022/08/16 17:21:42 2022-08-16 17:21:42. (3): ==================== <function fix_side_input_pcoll_coders at 0x7f9141132170> ====================
2022/08/16 17:21:42 2022-08-16 17:21:42. (4): ==================== <function pack_combiners at 0x7f9141132680> ====================
2022/08/16 17:21:42 2022-08-16 17:21:42. (5): ==================== <function lift_combiners at 0x7f9141132710> ====================
2022/08/16 17:21:42 2022-08-16 17:21:42. (6): ==================== <function expand_sdf at 0x7f91411328c0> ====================
2022/08/16 17:21:42 2022-08-16 17:21:42. (7): ==================== <function expand_gbk at 0x7f9141132950> ====================
2022/08/16 17:21:42 2022-08-16 17:21:42. (8): ==================== <function sink_flattens at 0x7f9141132a70> ====================
2022/08/16 17:21:42 2022-08-16 17:21:42. (9): ==================== <function greedily_fuse at 0x7f9141132b00> ====================
2022/08/16 17:21:42 2022-08-16 17:21:42. (10): ==================== <function read_to_impulse at 0x7f9141132b90> ====================
2022/08/16 17:21:42 2022-08-16 17:21:42. (11): ==================== <function impulse_to_input at 0x7f9141132c20> ====================
2022/08/16 17:21:42 2022-08-16 17:21:42. (12): ==================== <function sort_stages at 0x7f9141132e60> ====================
2022/08/16 17:21:42 2022-08-16 17:21:42. (13): ==================== <function add_impulse_to_dangling_transforms at 0x7f9141132f80> ====================
2022/08/16 17:21:42 2022-08-16 17:21:42. (14): ==================== <function setup_timer_mapping at 0x7f9141132dd0> ====================
2022/08/16 17:21:42 2022-08-16 17:21:42. (15): ==================== <function populate_data_channel_coders at 0x7f9141132ef0> ====================
2022/08/16 17:21:42 2022-08-16 17:21:42. (16): starting control server on port 37083
2022/08/16 17:21:42 2022-08-16 17:21:42. (17): starting data server on port 33067
2022/08/16 17:21:42 2022-08-16 17:21:42. (18): starting state server on port 46457
2022/08/16 17:21:42 2022-08-16 17:21:42. (19): starting logging server on port 45651
2022/08/16 17:21:42 2022-08-16 17:21:42. (20): Created Worker handler <apache_beam.runners.portability.fn_api_runner.worker_handlers.DockerSdkWorkerHandler object at 0x7f91267b2810> for environment FZJAmnzfpobeam:env:docker:v1 (beam:env:docker:v1, b'\n apache/beam_java8_sdk:2.42.0.dev')
2022/08/16 17:21:43 2022-08-16 17:21:43. (21): Attempting to pull image apache/beam_java8_sdk:2.42.0.dev
2022/08/16 17:21:43 2022-08-16 17:21:43. (22): Unable to pull image apache/beam_java8_sdk:2.42.0.dev, defaulting to local image if it exists
2022/08/16 17:21:44 2022-08-16 17:21:44. (23): Waiting for docker to start up. Current status is running
2022/08/16 17:21:44 2022-08-16 17:21:44. (24): Docker container is running. container_id = b'ed669a90b9d406c2ce4ad13b73e78067c8a6199d60cbbf2a9a85ed9f2d070f63', worker_id = worker_16
2022/08/16 17:21:45 2022-08-16 17:21:45. (25): Created Worker handler <apache_beam.runners.portability.fn_api_runner.worker_handlers.DockerSdkWorkerHandler object at 0x7f9124765ed0> for environment go (beam:env:docker:v1, b'\n\x16apache/beam_go_sdk:dev')
2022/08/16 17:21:45 2022-08-16 17:21:45. (26): Attempting to pull image apache/beam_go_sdk:dev
2022/08/16 17:21:45 2022-08-16 17:21:45. (27): Unable to pull image apache/beam_go_sdk:dev, defaulting to local image if it exists
2022/08/16 17:21:47 2022-08-16 17:21:47. (28): Waiting for docker to start up. Current status is running
2022/08/16 17:21:47 2022-08-16 17:21:47. (29): Docker container is running. container_id = b'55ff92294a4937ba79adcd64755f493c4bdd40ce610ec644bb4a12eda00c54f0', worker_id = worker_17
2022/08/16 17:21:56 2022-08-16 17:21:56. (30): Completed job in 13.344265460968018 seconds with state DONE.
2022/08/16 17:21:56 Job state: DONE
--- PASS: TestJDBCIO_PostgresReadWrite (36.34s)
PASS
ok github.com/apache/beam/sdks/v2/go/test/integration/io/xlang/jdbc 85.197s
=== RUN TestKafkaIO_BasicReadWrite
integration.go:264: Test TestKafkaIO_BasicReadWrite is currently filtered for runner portable
--- SKIP: TestKafkaIO_BasicReadWrite (0.00s)
PASS
ok github.com/apache/beam/sdks/v2/go/test/integration/io/xlang/kafka 6.035s
> Task :sdks:python:test-suites:direct:xlang:validatesCrossLanguageRunnerJavaUsingPython
org.apache.beam.runners.core.construction.ValidateRunnerXlangTest$SingleInputOutputTest > test FAILED
java.lang.RuntimeException at ValidateRunnerXlangTest.java:242
java.lang.NullPointerException at Preconditions.java:980
14 tests completed, 1 failed
> Task :sdks:python:test-suites:direct:xlang:validatesCrossLanguageRunnerJavaUsingPython FAILED
> Task :sdks:python:test-suites:direct:xlang:validatesCrossLanguageRunnerPythonUsingJava
> Task :sdks:python:test-suites:direct:xlang:validatesCrossLanguageRunnerPythonUsingSql
> Task :sdks:python:test-suites:direct:xlang:validatesCrossLanguageRunnerCleanup
> Task :sdks:python:test-suites:direct:xlang:fnApiJobServerCleanup
FAILURE: Build failed with an exception.
* What went wrong:
Execution failed for task ':sdks:python:test-suites:direct:xlang:validatesCrossLanguageRunnerJavaUsingPython'.
> There were failing tests. See the report at: file://<https://ci-beam.apache.org/job/beam_PostCommit_XVR_Direct/ws/src/sdks/python/test-suites/direct/xlang/build/reports/tests/validatesCrossLanguageRunnerJavaUsingPython/index.html>
* Try:
> Run with --stacktrace option to get the stack trace.
> Run with --info or --debug option to get more log output.
> Run with --scan to get full insights.
* Get more help at https://help.gradle.org
Deprecated Gradle features were used in this build, making it incompatible with Gradle 8.0.
You can use '--warning-mode all' to show the individual deprecation warnings and determine if they come from your own scripts or plugins.
See https://docs.gradle.org/7.4/userguide/command_line_interface.html#sec:command_line_warnings
Execution optimizations have been disabled for 1 invalid unit(s) of work during this build to ensure correctness.
Please consult deprecation warnings for more details.
BUILD FAILED in 25m 47s
247 actionable tasks: 162 executed, 73 from cache, 12 up-to-date
Publishing build scan...
https://gradle.com/s/5mfr5mtlrvq2q
Build step 'Invoke Gradle script' changed build result to FAILURE
Build step 'Invoke Gradle script' marked build as failure
---------------------------------------------------------------------
To unsubscribe, e-mail: builds-unsubscribe@beam.apache.org
For additional commands, e-mail: builds-help@beam.apache.org
Build failed in Jenkins: beam_PostCommit_XVR_Direct #3022
Posted by Apache Jenkins Server <je...@builds.apache.org>.
See <https://ci-beam.apache.org/job/beam_PostCommit_XVR_Direct/3022/display/redirect>
Changes:
------------------------------------------
[...truncated 1.43 MB...]
INFO root:environments.py:304 Python SDK container image set to "apache/beam_python3.7_sdk:2.42.0.dev" for Docker environment
INFO apache_beam.runners.portability.fn_api_runner.translations:translations.py:714 ==================== <function pack_combiners at 0x7f3c10193e60> ====================
INFO apache_beam.runners.portability.fn_api_runner.translations:translations.py:714 ==================== <function lift_combiners at 0x7f3c10193ef0> ====================
INFO apache_beam.runners.portability.fn_api_runner.translations:translations.py:714 ==================== <function sort_stages at 0x7f3c10195680> ====================
INFO apache_beam.runners.portability.portable_runner:portable_runner.py:583 Job state changed to STOPPED
INFO apache_beam.runners.portability.portable_runner:portable_runner.py:583 Job state changed to STARTING
INFO apache_beam.runners.portability.portable_runner:portable_runner.py:583 Job state changed to RUNNING
INFO root:portable_runner.py:577 Default Python SDK image for environment is apache/beam_python3.7_sdk:2.42.0.dev
INFO root:portable_runner.py:577 ==================== <function annotate_downstream_side_inputs at 0x7f32f2e00050> ====================
INFO root:portable_runner.py:577 ==================== <function fix_side_input_pcoll_coders at 0x7f32f2e00170> ====================
INFO root:portable_runner.py:577 ==================== <function pack_combiners at 0x7f32f2e00680> ====================
INFO root:portable_runner.py:577 ==================== <function lift_combiners at 0x7f32f2e00710> ====================
INFO root:portable_runner.py:577 ==================== <function expand_sdf at 0x7f32f2e008c0> ====================
INFO root:portable_runner.py:577 ==================== <function expand_gbk at 0x7f32f2e00950> ====================
INFO root:portable_runner.py:577 ==================== <function sink_flattens at 0x7f32f2e00a70> ====================
INFO root:portable_runner.py:577 ==================== <function greedily_fuse at 0x7f32f2e00b00> ====================
INFO root:portable_runner.py:577 ==================== <function read_to_impulse at 0x7f32f2e00b90> ====================
INFO root:portable_runner.py:577 ==================== <function impulse_to_input at 0x7f32f2e00c20> ====================
INFO root:portable_runner.py:577 ==================== <function sort_stages at 0x7f32f2e00e60> ====================
INFO root:portable_runner.py:577 ==================== <function add_impulse_to_dangling_transforms at 0x7f32f2e00f80> ====================
INFO root:portable_runner.py:577 ==================== <function setup_timer_mapping at 0x7f32f2e00dd0> ====================
INFO root:portable_runner.py:577 ==================== <function populate_data_channel_coders at 0x7f32f2e00ef0> ====================
INFO root:portable_runner.py:577 starting control server on port 34377
INFO root:portable_runner.py:577 starting data server on port 45169
INFO root:portable_runner.py:577 starting state server on port 40069
INFO root:portable_runner.py:577 starting logging server on port 34837
INFO root:portable_runner.py:577 Created Worker handler <apache_beam.runners.portability.fn_api_runner.worker_handlers.DockerSdkWorkerHandler object at 0x7f3309ba6410> for environment ref_Environment_default_environment_2 (beam:env:docker:v1, b'\n$apache/beam_python3.7_sdk:2.42.0.dev')
INFO root:portable_runner.py:577 Attempting to pull image apache/beam_python3.7_sdk:2.42.0.dev
INFO root:portable_runner.py:577 Unable to pull image apache/beam_python3.7_sdk:2.42.0.dev, defaulting to local image if it exists
INFO root:portable_runner.py:577 Waiting for docker to start up. Current status is running
INFO root:portable_runner.py:577 Docker container is running. container_id = b'1f86d9a6c8e98dfe89a77cc43e2f922be6b879d2cbcc4fbcee0530de5bea6964', worker_id = worker_81
INFO root:portable_runner.py:577 Created Worker handler <apache_beam.runners.portability.fn_api_runner.worker_handlers.DockerSdkWorkerHandler object at 0x7f32f2d54c10> for environment external_7beam:env:docker:v1 (beam:env:docker:v1, b'\n apache/beam_java8_sdk:2.42.0.dev')
INFO root:portable_runner.py:577 Attempting to pull image apache/beam_java8_sdk:2.42.0.dev
INFO root:portable_runner.py:577 Unable to pull image apache/beam_java8_sdk:2.42.0.dev, defaulting to local image if it exists
INFO root:portable_runner.py:577 Waiting for docker to start up. Current status is running
INFO root:portable_runner.py:577 Docker container is running. container_id = b'05ac8f77bab0970ba907bab10123cb77bcd09f4f0675102284da177867b338d3', worker_id = worker_82
INFO root:portable_runner.py:577 Completed job in 13.03980278968811 seconds with state DONE.
INFO apache_beam.runners.portability.portable_runner:portable_runner.py:583 Job state changed to DONE
PASSED [ 77%]
apache_beam/transforms/sql_test.py::SqlTransformTest::test_windowing_before_sql
-------------------------------- live log call ---------------------------------
INFO apache_beam.utils.subprocess_server:subprocess_server.py:254 Using pre-built snapshot at <https://ci-beam.apache.org/job/beam_PostCommit_XVR_Direct/ws/src/sdks/java/extensions/sql/expansion-service/build/libs/beam-sdks-java-extensions-sql-expansion-service-2.42.0-SNAPSHOT.jar>
INFO root:external.py:773 Starting a JAR-based expansion service from JAR <https://ci-beam.apache.org/job/beam_PostCommit_XVR_Direct/ws/src/sdks/java/extensions/sql/expansion-service/build/libs/beam-sdks-java-extensions-sql-expansion-service-2.42.0-SNAPSHOT.jar>
INFO apache_beam.utils.subprocess_server:subprocess_server.py:116 Starting service with ['java' '-jar' '<https://ci-beam.apache.org/job/beam_PostCommit_XVR_Direct/ws/src/sdks/java/extensions/sql/expansion-service/build/libs/beam-sdks-java-extensions-sql-expansion-service-2.42.0-SNAPSHOT.jar'> '34753' '--filesToStage=<https://ci-beam.apache.org/job/beam_PostCommit_XVR_Direct/ws/src/sdks/java/extensions/sql/expansion-service/build/libs/beam-sdks-java-extensions-sql-expansion-service-2.42.0-SNAPSHOT.jar']>
INFO apache_beam.utils.subprocess_server:subprocess_server.py:132 Starting expansion service at localhost:34753
INFO apache_beam.utils.subprocess_server:subprocess_server.py:132 Aug 16, 2022 11:35:23 AM org.apache.beam.sdk.expansion.service.ExpansionService loadRegisteredTransforms
INFO apache_beam.utils.subprocess_server:subprocess_server.py:132 INFO: Registering external transforms: [beam:external:java:sql:v1, beam:transform:org.apache.beam:pubsub_read:v1, beam:transform:org.apache.beam:pubsub_write:v1, beam:transform:org.apache.beam:pubsublite_write:v1, beam:transform:org.apache.beam:pubsublite_read:v1, beam:transform:org.apache.beam:spanner_insert:v1, beam:transform:org.apache.beam:spanner_update:v1, beam:transform:org.apache.beam:spanner_replace:v1, beam:transform:org.apache.beam:spanner_insert_or_update:v1, beam:transform:org.apache.beam:spanner_delete:v1, beam:transform:org.apache.beam:spanner_read:v1, beam:transform:org.apache.beam:kafka_read_with_metadata:v1, beam:transform:org.apache.beam:kafka_read_without_metadata:v1, beam:transform:org.apache.beam:kafka_write:v1, beam:external:java:generate_sequence:v1]
INFO apache_beam.utils.subprocess_server:subprocess_server.py:132 beam:external:java:sql:v1: org.apache.beam.sdk.expansion.service.ExpansionService$ExternalTransformRegistrarLoader$1@47eaca72
INFO apache_beam.utils.subprocess_server:subprocess_server.py:132 beam:transform:org.apache.beam:pubsub_read:v1: org.apache.beam.sdk.expansion.service.ExpansionService$ExternalTransformRegistrarLoader$1@55141def
INFO apache_beam.utils.subprocess_server:subprocess_server.py:132 beam:transform:org.apache.beam:pubsub_write:v1: org.apache.beam.sdk.expansion.service.ExpansionService$ExternalTransformRegistrarLoader$1@55182842
INFO apache_beam.utils.subprocess_server:subprocess_server.py:132 beam:transform:org.apache.beam:pubsublite_write:v1: org.apache.beam.sdk.expansion.service.ExpansionService$ExternalTransformRegistrarLoader$1@3270d194
INFO apache_beam.utils.subprocess_server:subprocess_server.py:132 beam:transform:org.apache.beam:pubsublite_read:v1: org.apache.beam.sdk.expansion.service.ExpansionService$ExternalTransformRegistrarLoader$1@235834f2
INFO apache_beam.utils.subprocess_server:subprocess_server.py:132 beam:transform:org.apache.beam:spanner_insert:v1: org.apache.beam.sdk.expansion.service.ExpansionService$ExternalTransformRegistrarLoader$1@5656be13
INFO apache_beam.utils.subprocess_server:subprocess_server.py:132 beam:transform:org.apache.beam:spanner_update:v1: org.apache.beam.sdk.expansion.service.ExpansionService$ExternalTransformRegistrarLoader$1@4218d6a3
INFO apache_beam.utils.subprocess_server:subprocess_server.py:132 beam:transform:org.apache.beam:spanner_replace:v1: org.apache.beam.sdk.expansion.service.ExpansionService$ExternalTransformRegistrarLoader$1@76505305
INFO apache_beam.utils.subprocess_server:subprocess_server.py:132 beam:transform:org.apache.beam:spanner_insert_or_update:v1: org.apache.beam.sdk.expansion.service.ExpansionService$ExternalTransformRegistrarLoader$1@14cd1699
INFO apache_beam.utils.subprocess_server:subprocess_server.py:132 beam:transform:org.apache.beam:spanner_delete:v1: org.apache.beam.sdk.expansion.service.ExpansionService$ExternalTransformRegistrarLoader$1@77888435
INFO apache_beam.utils.subprocess_server:subprocess_server.py:132 beam:transform:org.apache.beam:spanner_read:v1: org.apache.beam.sdk.expansion.service.ExpansionService$ExternalTransformRegistrarLoader$1@73a1e9a9
INFO apache_beam.utils.subprocess_server:subprocess_server.py:132 beam:transform:org.apache.beam:kafka_read_with_metadata:v1: org.apache.beam.sdk.expansion.service.ExpansionService$ExternalTransformRegistrarLoader$1@71d44a3
INFO apache_beam.utils.subprocess_server:subprocess_server.py:132 beam:transform:org.apache.beam:kafka_read_without_metadata:v1: org.apache.beam.sdk.expansion.service.ExpansionService$ExternalTransformRegistrarLoader$1@7b98f307
INFO apache_beam.utils.subprocess_server:subprocess_server.py:132 beam:transform:org.apache.beam:kafka_write:v1: org.apache.beam.sdk.expansion.service.ExpansionService$ExternalTransformRegistrarLoader$1@4802796d
INFO apache_beam.utils.subprocess_server:subprocess_server.py:132 beam:external:java:generate_sequence:v1: org.apache.beam.sdk.expansion.service.ExpansionService$ExternalTransformRegistrarLoader$1@34123d65
INFO apache_beam.utils.subprocess_server:subprocess_server.py:132 Aug 16, 2022 11:35:24 AM org.apache.beam.sdk.expansion.service.ExpansionService expand
INFO apache_beam.utils.subprocess_server:subprocess_server.py:132 INFO: Expanding 'SqlTransform(beam:external:java:sql:v1)' with URN 'beam:external:java:sql:v1'
INFO apache_beam.utils.subprocess_server:subprocess_server.py:132 Aug 16, 2022 11:35:25 AM org.apache.beam.sdk.expansion.service.ExpansionService$ExternalTransformRegistrarLoader payloadToConfig
INFO apache_beam.utils.subprocess_server:subprocess_server.py:132 WARNING: Configuration class 'org.apache.beam.sdk.extensions.sql.expansion.ExternalSqlTransformRegistrar$Configuration' has no schema registered. Attempting to construct with setter approach.
INFO apache_beam.utils.subprocess_server:subprocess_server.py:132 Aug 16, 2022 11:35:25 AM org.apache.beam.sdk.expansion.service.ExpansionService$ExternalTransformRegistrarLoader payloadToConfig
INFO apache_beam.utils.subprocess_server:subprocess_server.py:132 WARNING: Configuration class 'org.apache.beam.sdk.extensions.sql.expansion.ExternalSqlTransformRegistrar$Configuration' has no schema registered. Attempting to construct with setter approach.
INFO apache_beam.utils.subprocess_server:subprocess_server.py:132 Aug 16, 2022 11:35:26 AM org.apache.beam.sdk.extensions.sql.impl.CalciteQueryPlanner convertToBeamRel
INFO apache_beam.utils.subprocess_server:subprocess_server.py:132 INFO: SQL:
INFO apache_beam.utils.subprocess_server:subprocess_server.py:132 SELECT COUNT(*) AS `count`
INFO apache_beam.utils.subprocess_server:subprocess_server.py:132 FROM `beam`.`PCOLLECTION` AS `PCOLLECTION`
INFO apache_beam.utils.subprocess_server:subprocess_server.py:132 Aug 16, 2022 11:35:27 AM org.apache.beam.sdk.extensions.sql.impl.CalciteQueryPlanner convertToBeamRel
INFO apache_beam.utils.subprocess_server:subprocess_server.py:132 INFO: SQLPlan>
INFO apache_beam.utils.subprocess_server:subprocess_server.py:132 LogicalAggregate(group=[{}], count=[COUNT()])
INFO apache_beam.utils.subprocess_server:subprocess_server.py:132 BeamIOSourceRel(table=[[beam, PCOLLECTION]])
INFO apache_beam.utils.subprocess_server:subprocess_server.py:132
INFO apache_beam.utils.subprocess_server:subprocess_server.py:132 Aug 16, 2022 11:35:27 AM org.apache.beam.sdk.extensions.sql.impl.CalciteQueryPlanner convertToBeamRel
INFO apache_beam.utils.subprocess_server:subprocess_server.py:132 INFO: BEAMPlan>
INFO apache_beam.utils.subprocess_server:subprocess_server.py:132 BeamAggregationRel(group=[{}], count=[COUNT()])
INFO apache_beam.utils.subprocess_server:subprocess_server.py:132 BeamIOSourceRel(table=[[beam, PCOLLECTION]])
INFO apache_beam.utils.subprocess_server:subprocess_server.py:132
INFO root:environments.py:376 Default Python SDK image for environment is apache/beam_python3.7_sdk:2.42.0.dev
INFO root:environments.py:299 No image given, using default Python SDK image
INFO root:environments.py:376 Default Python SDK image for environment is apache/beam_python3.7_sdk:2.42.0.dev
INFO root:environments.py:304 Python SDK container image set to "apache/beam_python3.7_sdk:2.42.0.dev" for Docker environment
INFO apache_beam.runners.portability.fn_api_runner.translations:translations.py:714 ==================== <function pack_combiners at 0x7f3c10193e60> ====================
INFO apache_beam.runners.portability.fn_api_runner.translations:translations.py:714 ==================== <function lift_combiners at 0x7f3c10193ef0> ====================
INFO apache_beam.runners.portability.fn_api_runner.translations:translations.py:714 ==================== <function sort_stages at 0x7f3c10195680> ====================
INFO apache_beam.runners.portability.portable_runner:portable_runner.py:583 Job state changed to STOPPED
INFO apache_beam.runners.portability.portable_runner:portable_runner.py:583 Job state changed to STARTING
INFO apache_beam.runners.portability.portable_runner:portable_runner.py:583 Job state changed to RUNNING
INFO root:portable_runner.py:577 Default Python SDK image for environment is apache/beam_python3.7_sdk:2.42.0.dev
INFO root:portable_runner.py:577 ==================== <function annotate_downstream_side_inputs at 0x7f32f2e00050> ====================
INFO root:portable_runner.py:577 ==================== <function fix_side_input_pcoll_coders at 0x7f32f2e00170> ====================
INFO root:portable_runner.py:577 ==================== <function pack_combiners at 0x7f32f2e00680> ====================
INFO root:portable_runner.py:577 ==================== <function lift_combiners at 0x7f32f2e00710> ====================
INFO root:portable_runner.py:577 ==================== <function expand_sdf at 0x7f32f2e008c0> ====================
INFO root:portable_runner.py:577 ==================== <function expand_gbk at 0x7f32f2e00950> ====================
INFO root:portable_runner.py:577 ==================== <function sink_flattens at 0x7f32f2e00a70> ====================
INFO root:portable_runner.py:577 ==================== <function greedily_fuse at 0x7f32f2e00b00> ====================
INFO root:portable_runner.py:577 ==================== <function read_to_impulse at 0x7f32f2e00b90> ====================
INFO root:portable_runner.py:577 ==================== <function impulse_to_input at 0x7f32f2e00c20> ====================
INFO root:portable_runner.py:577 ==================== <function sort_stages at 0x7f32f2e00e60> ====================
INFO root:portable_runner.py:577 ==================== <function add_impulse_to_dangling_transforms at 0x7f32f2e00f80> ====================
INFO root:portable_runner.py:577 ==================== <function setup_timer_mapping at 0x7f32f2e00dd0> ====================
INFO root:portable_runner.py:577 ==================== <function populate_data_channel_coders at 0x7f32f2e00ef0> ====================
INFO root:portable_runner.py:577 starting control server on port 34433
INFO root:portable_runner.py:577 starting data server on port 33967
INFO root:portable_runner.py:577 starting state server on port 44015
INFO root:portable_runner.py:577 starting logging server on port 35083
INFO root:portable_runner.py:577 Created Worker handler <apache_beam.runners.portability.fn_api_runner.worker_handlers.DockerSdkWorkerHandler object at 0x7f32d3fa7ad0> for environment ref_Environment_default_environment_2 (beam:env:docker:v1, b'\n$apache/beam_python3.7_sdk:2.42.0.dev')
INFO root:portable_runner.py:577 Attempting to pull image apache/beam_python3.7_sdk:2.42.0.dev
INFO root:portable_runner.py:577 Unable to pull image apache/beam_python3.7_sdk:2.42.0.dev, defaulting to local image if it exists
INFO root:portable_runner.py:577 Waiting for docker to start up. Current status is running
INFO root:portable_runner.py:577 Docker container is running. container_id = b'36b182d07667a57b3984a6b29fe227945f019a29754d7cdef2777132aa9c55d6', worker_id = worker_83
INFO root:portable_runner.py:577 Created Worker handler <apache_beam.runners.portability.fn_api_runner.worker_handlers.DockerSdkWorkerHandler object at 0x7f32d3f9d750> for environment external_8beam:env:docker:v1 (beam:env:docker:v1, b'\n apache/beam_java8_sdk:2.42.0.dev')
INFO root:portable_runner.py:577 Attempting to pull image apache/beam_java8_sdk:2.42.0.dev
INFO root:portable_runner.py:577 Unable to pull image apache/beam_java8_sdk:2.42.0.dev, defaulting to local image if it exists
INFO root:portable_runner.py:577 Waiting for docker to start up. Current status is running
INFO root:portable_runner.py:577 Docker container is running. container_id = b'843f1e25954d79ae9908093440ccb1aaf4e5f363ffb2d4648f049092592915f9', worker_id = worker_84
INFO root:portable_runner.py:577 Completed job in 12.779886722564697 seconds with state DONE.
INFO apache_beam.runners.portability.portable_runner:portable_runner.py:583 Job state changed to DONE
PASSED [ 88%]
apache_beam/transforms/sql_test.py::SqlTransformTest::test_zetasql_generate_data
-------------------------------- live log call ---------------------------------
INFO apache_beam.utils.subprocess_server:subprocess_server.py:254 Using pre-built snapshot at <https://ci-beam.apache.org/job/beam_PostCommit_XVR_Direct/ws/src/sdks/java/extensions/sql/expansion-service/build/libs/beam-sdks-java-extensions-sql-expansion-service-2.42.0-SNAPSHOT.jar>
INFO root:external.py:773 Starting a JAR-based expansion service from JAR <https://ci-beam.apache.org/job/beam_PostCommit_XVR_Direct/ws/src/sdks/java/extensions/sql/expansion-service/build/libs/beam-sdks-java-extensions-sql-expansion-service-2.42.0-SNAPSHOT.jar>
INFO apache_beam.utils.subprocess_server:subprocess_server.py:116 Starting service with ['java' '-jar' '<https://ci-beam.apache.org/job/beam_PostCommit_XVR_Direct/ws/src/sdks/java/extensions/sql/expansion-service/build/libs/beam-sdks-java-extensions-sql-expansion-service-2.42.0-SNAPSHOT.jar'> '46481' '--filesToStage=<https://ci-beam.apache.org/job/beam_PostCommit_XVR_Direct/ws/src/sdks/java/extensions/sql/expansion-service/build/libs/beam-sdks-java-extensions-sql-expansion-service-2.42.0-SNAPSHOT.jar']>
INFO apache_beam.utils.subprocess_server:subprocess_server.py:132 Starting expansion service at localhost:46481
INFO apache_beam.utils.subprocess_server:subprocess_server.py:132 Aug 16, 2022 11:35:48 AM org.apache.beam.sdk.expansion.service.ExpansionService loadRegisteredTransforms
INFO apache_beam.utils.subprocess_server:subprocess_server.py:132 INFO: Registering external transforms: [beam:external:java:sql:v1, beam:transform:org.apache.beam:pubsub_read:v1, beam:transform:org.apache.beam:pubsub_write:v1, beam:transform:org.apache.beam:pubsublite_write:v1, beam:transform:org.apache.beam:pubsublite_read:v1, beam:transform:org.apache.beam:spanner_insert:v1, beam:transform:org.apache.beam:spanner_update:v1, beam:transform:org.apache.beam:spanner_replace:v1, beam:transform:org.apache.beam:spanner_insert_or_update:v1, beam:transform:org.apache.beam:spanner_delete:v1, beam:transform:org.apache.beam:spanner_read:v1, beam:transform:org.apache.beam:kafka_read_with_metadata:v1, beam:transform:org.apache.beam:kafka_read_without_metadata:v1, beam:transform:org.apache.beam:kafka_write:v1, beam:external:java:generate_sequence:v1]
INFO apache_beam.utils.subprocess_server:subprocess_server.py:132 beam:external:java:sql:v1: org.apache.beam.sdk.expansion.service.ExpansionService$ExternalTransformRegistrarLoader$1@47eaca72
INFO apache_beam.utils.subprocess_server:subprocess_server.py:132 beam:transform:org.apache.beam:pubsub_read:v1: org.apache.beam.sdk.expansion.service.ExpansionService$ExternalTransformRegistrarLoader$1@55141def
INFO apache_beam.utils.subprocess_server:subprocess_server.py:132 beam:transform:org.apache.beam:pubsub_write:v1: org.apache.beam.sdk.expansion.service.ExpansionService$ExternalTransformRegistrarLoader$1@55182842
INFO apache_beam.utils.subprocess_server:subprocess_server.py:132 beam:transform:org.apache.beam:pubsublite_write:v1: org.apache.beam.sdk.expansion.service.ExpansionService$ExternalTransformRegistrarLoader$1@3270d194
INFO apache_beam.utils.subprocess_server:subprocess_server.py:132 beam:transform:org.apache.beam:pubsublite_read:v1: org.apache.beam.sdk.expansion.service.ExpansionService$ExternalTransformRegistrarLoader$1@235834f2
INFO apache_beam.utils.subprocess_server:subprocess_server.py:132 beam:transform:org.apache.beam:spanner_insert:v1: org.apache.beam.sdk.expansion.service.ExpansionService$ExternalTransformRegistrarLoader$1@5656be13
INFO apache_beam.utils.subprocess_server:subprocess_server.py:132 beam:transform:org.apache.beam:spanner_update:v1: org.apache.beam.sdk.expansion.service.ExpansionService$ExternalTransformRegistrarLoader$1@4218d6a3
INFO apache_beam.utils.subprocess_server:subprocess_server.py:132 beam:transform:org.apache.beam:spanner_replace:v1: org.apache.beam.sdk.expansion.service.ExpansionService$ExternalTransformRegistrarLoader$1@76505305
INFO apache_beam.utils.subprocess_server:subprocess_server.py:132 beam:transform:org.apache.beam:spanner_insert_or_update:v1: org.apache.beam.sdk.expansion.service.ExpansionService$ExternalTransformRegistrarLoader$1@14cd1699
INFO apache_beam.utils.subprocess_server:subprocess_server.py:132 beam:transform:org.apache.beam:spanner_delete:v1: org.apache.beam.sdk.expansion.service.ExpansionService$ExternalTransformRegistrarLoader$1@77888435
INFO apache_beam.utils.subprocess_server:subprocess_server.py:132 beam:transform:org.apache.beam:spanner_read:v1: org.apache.beam.sdk.expansion.service.ExpansionService$ExternalTransformRegistrarLoader$1@73a1e9a9
INFO apache_beam.utils.subprocess_server:subprocess_server.py:132 beam:transform:org.apache.beam:kafka_read_with_metadata:v1: org.apache.beam.sdk.expansion.service.ExpansionService$ExternalTransformRegistrarLoader$1@71d44a3
INFO apache_beam.utils.subprocess_server:subprocess_server.py:132 beam:transform:org.apache.beam:kafka_read_without_metadata:v1: org.apache.beam.sdk.expansion.service.ExpansionService$ExternalTransformRegistrarLoader$1@7b98f307
INFO apache_beam.utils.subprocess_server:subprocess_server.py:132 beam:transform:org.apache.beam:kafka_write:v1: org.apache.beam.sdk.expansion.service.ExpansionService$ExternalTransformRegistrarLoader$1@4802796d
INFO apache_beam.utils.subprocess_server:subprocess_server.py:132 beam:external:java:generate_sequence:v1: org.apache.beam.sdk.expansion.service.ExpansionService$ExternalTransformRegistrarLoader$1@34123d65
INFO apache_beam.utils.subprocess_server:subprocess_server.py:132 Aug 16, 2022 11:35:49 AM org.apache.beam.sdk.expansion.service.ExpansionService expand
INFO apache_beam.utils.subprocess_server:subprocess_server.py:132 INFO: Expanding 'SqlTransform(beam:external:java:sql:v1)' with URN 'beam:external:java:sql:v1'
INFO apache_beam.utils.subprocess_server:subprocess_server.py:132 Aug 16, 2022 11:35:49 AM org.apache.beam.sdk.expansion.service.ExpansionService$ExternalTransformRegistrarLoader payloadToConfig
INFO apache_beam.utils.subprocess_server:subprocess_server.py:132 WARNING: Configuration class 'org.apache.beam.sdk.extensions.sql.expansion.ExternalSqlTransformRegistrar$Configuration' has no schema registered. Attempting to construct with setter approach.
INFO apache_beam.utils.subprocess_server:subprocess_server.py:132 Aug 16, 2022 11:35:50 AM org.apache.beam.sdk.expansion.service.ExpansionService$ExternalTransformRegistrarLoader payloadToConfig
INFO apache_beam.utils.subprocess_server:subprocess_server.py:132 WARNING: Configuration class 'org.apache.beam.sdk.extensions.sql.expansion.ExternalSqlTransformRegistrar$Configuration' has no schema registered. Attempting to construct with setter approach.
INFO apache_beam.utils.subprocess_server:subprocess_server.py:132 Aug 16, 2022 11:35:52 AM com.google.zetasql.io.grpc.NameResolverRegistry getDefaultRegistry
INFO apache_beam.utils.subprocess_server:subprocess_server.py:132 WARNING: No NameResolverProviders found via ServiceLoader, including for DNS. This is probably due to a broken build. If using ProGuard, check your configuration
INFO apache_beam.utils.subprocess_server:subprocess_server.py:132 Aug 16, 2022 11:35:53 AM org.apache.beam.sdk.extensions.sql.zetasql.ZetaSQLQueryPlanner convertToBeamRelInternal
INFO apache_beam.utils.subprocess_server:subprocess_server.py:132 INFO: BEAMPlan>
INFO apache_beam.utils.subprocess_server:subprocess_server.py:132 BeamZetaSqlCalcRel(expr#0=[{inputs}], expr#1=[1:BIGINT], expr#2=['foo':VARCHAR], expr#3=[3.1400000000000001243E0:DOUBLE], int=[$t1], str=[$t2], flt=[$t3])
INFO apache_beam.utils.subprocess_server:subprocess_server.py:132 BeamValuesRel(tuples=[[{ 0 }]])
INFO apache_beam.utils.subprocess_server:subprocess_server.py:132
INFO root:environments.py:376 Default Python SDK image for environment is apache/beam_python3.7_sdk:2.42.0.dev
INFO root:environments.py:299 No image given, using default Python SDK image
INFO root:environments.py:376 Default Python SDK image for environment is apache/beam_python3.7_sdk:2.42.0.dev
INFO root:environments.py:304 Python SDK container image set to "apache/beam_python3.7_sdk:2.42.0.dev" for Docker environment
INFO apache_beam.runners.portability.fn_api_runner.translations:translations.py:714 ==================== <function pack_combiners at 0x7f3c10193e60> ====================
INFO apache_beam.runners.portability.fn_api_runner.translations:translations.py:714 ==================== <function lift_combiners at 0x7f3c10193ef0> ====================
INFO apache_beam.runners.portability.fn_api_runner.translations:translations.py:714 ==================== <function sort_stages at 0x7f3c10195680> ====================
INFO apache_beam.runners.portability.portable_runner:portable_runner.py:583 Job state changed to STOPPED
INFO apache_beam.runners.portability.portable_runner:portable_runner.py:583 Job state changed to STARTING
INFO apache_beam.runners.portability.portable_runner:portable_runner.py:583 Job state changed to RUNNING
INFO root:portable_runner.py:577 Default Python SDK image for environment is apache/beam_python3.7_sdk:2.42.0.dev
INFO root:portable_runner.py:577 ==================== <function annotate_downstream_side_inputs at 0x7f32f2e00050> ====================
INFO root:portable_runner.py:577 ==================== <function fix_side_input_pcoll_coders at 0x7f32f2e00170> ====================
INFO root:portable_runner.py:577 ==================== <function pack_combiners at 0x7f32f2e00680> ====================
INFO root:portable_runner.py:577 ==================== <function lift_combiners at 0x7f32f2e00710> ====================
INFO root:portable_runner.py:577 ==================== <function expand_sdf at 0x7f32f2e008c0> ====================
INFO root:portable_runner.py:577 ==================== <function expand_gbk at 0x7f32f2e00950> ====================
INFO root:portable_runner.py:577 ==================== <function sink_flattens at 0x7f32f2e00a70> ====================
INFO root:portable_runner.py:577 ==================== <function greedily_fuse at 0x7f32f2e00b00> ====================
INFO root:portable_runner.py:577 ==================== <function read_to_impulse at 0x7f32f2e00b90> ====================
INFO root:portable_runner.py:577 ==================== <function impulse_to_input at 0x7f32f2e00c20> ====================
INFO root:portable_runner.py:577 ==================== <function sort_stages at 0x7f32f2e00e60> ====================
INFO root:portable_runner.py:577 ==================== <function add_impulse_to_dangling_transforms at 0x7f32f2e00f80> ====================
INFO root:portable_runner.py:577 ==================== <function setup_timer_mapping at 0x7f32f2e00dd0> ====================
INFO root:portable_runner.py:577 ==================== <function populate_data_channel_coders at 0x7f32f2e00ef0> ====================
INFO root:portable_runner.py:577 starting control server on port 45775
INFO root:portable_runner.py:577 starting data server on port 46325
INFO root:portable_runner.py:577 starting state server on port 34693
INFO root:portable_runner.py:577 starting logging server on port 42819
INFO root:portable_runner.py:577 Created Worker handler <apache_beam.runners.portability.fn_api_runner.worker_handlers.DockerSdkWorkerHandler object at 0x7f3309b38d90> for environment external_9beam:env:docker:v1 (beam:env:docker:v1, b'\n apache/beam_java8_sdk:2.42.0.dev')
INFO root:portable_runner.py:577 Attempting to pull image apache/beam_java8_sdk:2.42.0.dev
INFO root:portable_runner.py:577 Unable to pull image apache/beam_java8_sdk:2.42.0.dev, defaulting to local image if it exists
INFO root:portable_runner.py:577 Waiting for docker to start up. Current status is running
INFO root:portable_runner.py:577 Docker container is running. container_id = b'f7aead1f7876541ff3a11b0dda9f7a290a2a4c3c25d13f65edac0b5575134b18', worker_id = worker_85
INFO root:portable_runner.py:577 Created Worker handler <apache_beam.runners.portability.fn_api_runner.worker_handlers.DockerSdkWorkerHandler object at 0x7f32d3f97590> for environment ref_Environment_default_environment_2 (beam:env:docker:v1, b'\n$apache/beam_python3.7_sdk:2.42.0.dev')
INFO root:portable_runner.py:577 Attempting to pull image apache/beam_python3.7_sdk:2.42.0.dev
INFO root:portable_runner.py:577 Unable to pull image apache/beam_python3.7_sdk:2.42.0.dev, defaulting to local image if it exists
INFO root:portable_runner.py:577 Waiting for docker to start up. Current status is running
INFO root:portable_runner.py:577 Docker container is running. container_id = b'ba9f0a8857dc7bf85a87891925b41206d9647eaf32850231b5ce6a37901e71d3', worker_id = worker_86
INFO root:portable_runner.py:577 Completed job in 12.011942148208618 seconds with state DONE.
INFO apache_beam.runners.portability.portable_runner:portable_runner.py:583 Job state changed to DONE
PASSED [100%]
=============================== warnings summary ===============================
../../build/gradleenv/1922375555/lib/python3.7/site-packages/hdfs/config.py:15
<https://ci-beam.apache.org/job/beam_PostCommit_XVR_Direct/ws/src/build/gradleenv/1922375555/lib/python3.7/site-packages/hdfs/config.py>:15: DeprecationWarning: the imp module is deprecated in favour of importlib; see the module's documentation for alternative uses
from imp import load_source
-- Docs: https://docs.pytest.org/en/stable/how-to/capture-warnings.html
- generated xml file: <https://ci-beam.apache.org/job/beam_PostCommit_XVR_Direct/ws/src/sdks/python/pytest_xlangSqlValidateRunner.xml> -
===== 9 passed, 2 skipped, 6541 deselected, 1 warning in 241.84s (0:04:01) =====
> Task :sdks:python:test-suites:direct:xlang:validatesCrossLanguageRunnerCleanup
Stopping expansion service pid: 248819.
Stopping expansion service pid: 248820.
> Task :sdks:python:test-suites:direct:xlang:fnApiJobServerCleanup
Killing process at 245495
FAILURE: Build failed with an exception.
* What went wrong:
Execution failed for task ':sdks:python:test-suites:direct:xlang:validatesCrossLanguageRunnerJavaUsingPython'.
> There were failing tests. See the report at: file://<https://ci-beam.apache.org/job/beam_PostCommit_XVR_Direct/ws/src/sdks/python/test-suites/direct/xlang/build/reports/tests/validatesCrossLanguageRunnerJavaUsingPython/index.html>
* Try:
> Run with --stacktrace option to get the stack trace.
> Run with --info or --debug option to get more log output.
> Run with --scan to get full insights.
* Get more help at https://help.gradle.org
Deprecated Gradle features were used in this build, making it incompatible with Gradle 8.0.
You can use '--warning-mode all' to show the individual deprecation warnings and determine if they come from your own scripts or plugins.
See https://docs.gradle.org/7.4/userguide/command_line_interface.html#sec:command_line_warnings
Execution optimizations have been disabled for 1 invalid unit(s) of work during this build to ensure correctness.
Please consult deprecation warnings for more details.
BUILD FAILED in 25m 49s
247 actionable tasks: 165 executed, 70 from cache, 12 up-to-date
Publishing build scan...
https://gradle.com/s/lut7hu3hkge7o
Build step 'Invoke Gradle script' changed build result to FAILURE
Build step 'Invoke Gradle script' marked build as failure
---------------------------------------------------------------------
To unsubscribe, e-mail: builds-unsubscribe@beam.apache.org
For additional commands, e-mail: builds-help@beam.apache.org
Build failed in Jenkins: beam_PostCommit_XVR_Direct #3021
Posted by Apache Jenkins Server <je...@builds.apache.org>.
See <https://ci-beam.apache.org/job/beam_PostCommit_XVR_Direct/3021/display/redirect?page=changes>
Changes:
[noreply] Implement KafkaSchemaTransformReadConfiguration (#22403)
------------------------------------------
[...truncated 1.42 MB...]
INFO root:environments.py:304 Python SDK container image set to "apache/beam_python3.7_sdk:2.42.0.dev" for Docker environment
INFO apache_beam.runners.portability.fn_api_runner.translations:translations.py:714 ==================== <function pack_combiners at 0x7f615f2e4e60> ====================
INFO apache_beam.runners.portability.fn_api_runner.translations:translations.py:714 ==================== <function lift_combiners at 0x7f615f2e4ef0> ====================
INFO apache_beam.runners.portability.fn_api_runner.translations:translations.py:714 ==================== <function sort_stages at 0x7f615f2e6680> ====================
INFO apache_beam.runners.portability.portable_runner:portable_runner.py:583 Job state changed to STOPPED
INFO apache_beam.runners.portability.portable_runner:portable_runner.py:583 Job state changed to STARTING
INFO apache_beam.runners.portability.portable_runner:portable_runner.py:583 Job state changed to RUNNING
INFO root:portable_runner.py:577 Default Python SDK image for environment is apache/beam_python3.7_sdk:2.42.0.dev
INFO root:portable_runner.py:577 ==================== <function annotate_downstream_side_inputs at 0x7f7a91b42050> ====================
INFO root:portable_runner.py:577 ==================== <function fix_side_input_pcoll_coders at 0x7f7a91b42170> ====================
INFO root:portable_runner.py:577 ==================== <function pack_combiners at 0x7f7a91b42680> ====================
INFO root:portable_runner.py:577 ==================== <function lift_combiners at 0x7f7a91b42710> ====================
INFO root:portable_runner.py:577 ==================== <function expand_sdf at 0x7f7a91b428c0> ====================
INFO root:portable_runner.py:577 ==================== <function expand_gbk at 0x7f7a91b42950> ====================
INFO root:portable_runner.py:577 ==================== <function sink_flattens at 0x7f7a91b42a70> ====================
INFO root:portable_runner.py:577 ==================== <function greedily_fuse at 0x7f7a91b42b00> ====================
INFO root:portable_runner.py:577 ==================== <function read_to_impulse at 0x7f7a91b42b90> ====================
INFO root:portable_runner.py:577 ==================== <function impulse_to_input at 0x7f7a91b42c20> ====================
INFO root:portable_runner.py:577 ==================== <function sort_stages at 0x7f7a91b42e60> ====================
INFO root:portable_runner.py:577 ==================== <function add_impulse_to_dangling_transforms at 0x7f7a91b42f80> ====================
INFO root:portable_runner.py:577 ==================== <function setup_timer_mapping at 0x7f7a91b42dd0> ====================
INFO root:portable_runner.py:577 ==================== <function populate_data_channel_coders at 0x7f7a91b42ef0> ====================
INFO root:portable_runner.py:577 starting control server on port 42121
INFO root:portable_runner.py:577 starting data server on port 44281
INFO root:portable_runner.py:577 starting state server on port 36893
INFO root:portable_runner.py:577 starting logging server on port 35109
INFO root:portable_runner.py:577 Created Worker handler <apache_beam.runners.portability.fn_api_runner.worker_handlers.DockerSdkWorkerHandler object at 0x7f7aa882cb10> for environment ref_Environment_default_environment_2 (beam:env:docker:v1, b'\n$apache/beam_python3.7_sdk:2.42.0.dev')
INFO root:portable_runner.py:577 Attempting to pull image apache/beam_python3.7_sdk:2.42.0.dev
INFO root:portable_runner.py:577 Unable to pull image apache/beam_python3.7_sdk:2.42.0.dev, defaulting to local image if it exists
INFO root:portable_runner.py:577 Waiting for docker to start up. Current status is running
INFO root:portable_runner.py:577 Docker container is running. container_id = b'58649cd91814831239d311e1f46a119b0bae7defe43c3ddf127f4723b7a84f58', worker_id = worker_81
INFO root:portable_runner.py:577 Created Worker handler <apache_beam.runners.portability.fn_api_runner.worker_handlers.DockerSdkWorkerHandler object at 0x7f7aa8831810> for environment external_7beam:env:docker:v1 (beam:env:docker:v1, b'\n apache/beam_java8_sdk:2.42.0.dev')
INFO root:portable_runner.py:577 Attempting to pull image apache/beam_java8_sdk:2.42.0.dev
INFO root:portable_runner.py:577 Unable to pull image apache/beam_java8_sdk:2.42.0.dev, defaulting to local image if it exists
INFO root:portable_runner.py:577 Waiting for docker to start up. Current status is running
INFO root:portable_runner.py:577 Docker container is running. container_id = b'b31949a96f8196c7c138ecb1786e97a23e196d1f7bd5d89d371dab78b80cf83d', worker_id = worker_82
INFO root:portable_runner.py:577 Completed job in 16.47204828262329 seconds with state DONE.
INFO apache_beam.runners.portability.portable_runner:portable_runner.py:583 Job state changed to DONE
PASSED [ 77%]
apache_beam/transforms/sql_test.py::SqlTransformTest::test_windowing_before_sql
-------------------------------- live log call ---------------------------------
INFO apache_beam.utils.subprocess_server:subprocess_server.py:254 Using pre-built snapshot at <https://ci-beam.apache.org/job/beam_PostCommit_XVR_Direct/ws/src/sdks/java/extensions/sql/expansion-service/build/libs/beam-sdks-java-extensions-sql-expansion-service-2.42.0-SNAPSHOT.jar>
INFO root:external.py:773 Starting a JAR-based expansion service from JAR <https://ci-beam.apache.org/job/beam_PostCommit_XVR_Direct/ws/src/sdks/java/extensions/sql/expansion-service/build/libs/beam-sdks-java-extensions-sql-expansion-service-2.42.0-SNAPSHOT.jar>
INFO apache_beam.utils.subprocess_server:subprocess_server.py:116 Starting service with ['java' '-jar' '<https://ci-beam.apache.org/job/beam_PostCommit_XVR_Direct/ws/src/sdks/java/extensions/sql/expansion-service/build/libs/beam-sdks-java-extensions-sql-expansion-service-2.42.0-SNAPSHOT.jar'> '58029' '--filesToStage=<https://ci-beam.apache.org/job/beam_PostCommit_XVR_Direct/ws/src/sdks/java/extensions/sql/expansion-service/build/libs/beam-sdks-java-extensions-sql-expansion-service-2.42.0-SNAPSHOT.jar']>
INFO apache_beam.utils.subprocess_server:subprocess_server.py:132 Starting expansion service at localhost:58029
INFO apache_beam.utils.subprocess_server:subprocess_server.py:132 Aug 16, 2022 5:34:26 AM org.apache.beam.sdk.expansion.service.ExpansionService loadRegisteredTransforms
INFO apache_beam.utils.subprocess_server:subprocess_server.py:132 INFO: Registering external transforms: [beam:external:java:sql:v1, beam:transform:org.apache.beam:pubsub_read:v1, beam:transform:org.apache.beam:pubsub_write:v1, beam:transform:org.apache.beam:pubsublite_write:v1, beam:transform:org.apache.beam:pubsublite_read:v1, beam:transform:org.apache.beam:spanner_insert:v1, beam:transform:org.apache.beam:spanner_update:v1, beam:transform:org.apache.beam:spanner_replace:v1, beam:transform:org.apache.beam:spanner_insert_or_update:v1, beam:transform:org.apache.beam:spanner_delete:v1, beam:transform:org.apache.beam:spanner_read:v1, beam:transform:org.apache.beam:kafka_read_with_metadata:v1, beam:transform:org.apache.beam:kafka_read_without_metadata:v1, beam:transform:org.apache.beam:kafka_write:v1, beam:external:java:generate_sequence:v1]
INFO apache_beam.utils.subprocess_server:subprocess_server.py:132 beam:external:java:sql:v1: org.apache.beam.sdk.expansion.service.ExpansionService$ExternalTransformRegistrarLoader$1@47eaca72
INFO apache_beam.utils.subprocess_server:subprocess_server.py:132 beam:transform:org.apache.beam:pubsub_read:v1: org.apache.beam.sdk.expansion.service.ExpansionService$ExternalTransformRegistrarLoader$1@55141def
INFO apache_beam.utils.subprocess_server:subprocess_server.py:132 beam:transform:org.apache.beam:pubsub_write:v1: org.apache.beam.sdk.expansion.service.ExpansionService$ExternalTransformRegistrarLoader$1@55182842
INFO apache_beam.utils.subprocess_server:subprocess_server.py:132 beam:transform:org.apache.beam:pubsublite_write:v1: org.apache.beam.sdk.expansion.service.ExpansionService$ExternalTransformRegistrarLoader$1@3270d194
INFO apache_beam.utils.subprocess_server:subprocess_server.py:132 beam:transform:org.apache.beam:pubsublite_read:v1: org.apache.beam.sdk.expansion.service.ExpansionService$ExternalTransformRegistrarLoader$1@235834f2
INFO apache_beam.utils.subprocess_server:subprocess_server.py:132 beam:transform:org.apache.beam:spanner_insert:v1: org.apache.beam.sdk.expansion.service.ExpansionService$ExternalTransformRegistrarLoader$1@5656be13
INFO apache_beam.utils.subprocess_server:subprocess_server.py:132 beam:transform:org.apache.beam:spanner_update:v1: org.apache.beam.sdk.expansion.service.ExpansionService$ExternalTransformRegistrarLoader$1@4218d6a3
INFO apache_beam.utils.subprocess_server:subprocess_server.py:132 beam:transform:org.apache.beam:spanner_replace:v1: org.apache.beam.sdk.expansion.service.ExpansionService$ExternalTransformRegistrarLoader$1@76505305
INFO apache_beam.utils.subprocess_server:subprocess_server.py:132 beam:transform:org.apache.beam:spanner_insert_or_update:v1: org.apache.beam.sdk.expansion.service.ExpansionService$ExternalTransformRegistrarLoader$1@14cd1699
INFO apache_beam.utils.subprocess_server:subprocess_server.py:132 beam:transform:org.apache.beam:spanner_delete:v1: org.apache.beam.sdk.expansion.service.ExpansionService$ExternalTransformRegistrarLoader$1@77888435
INFO apache_beam.utils.subprocess_server:subprocess_server.py:132 beam:transform:org.apache.beam:spanner_read:v1: org.apache.beam.sdk.expansion.service.ExpansionService$ExternalTransformRegistrarLoader$1@73a1e9a9
INFO apache_beam.utils.subprocess_server:subprocess_server.py:132 beam:transform:org.apache.beam:kafka_read_with_metadata:v1: org.apache.beam.sdk.expansion.service.ExpansionService$ExternalTransformRegistrarLoader$1@71d44a3
INFO apache_beam.utils.subprocess_server:subprocess_server.py:132 beam:transform:org.apache.beam:kafka_read_without_metadata:v1: org.apache.beam.sdk.expansion.service.ExpansionService$ExternalTransformRegistrarLoader$1@7b98f307
INFO apache_beam.utils.subprocess_server:subprocess_server.py:132 beam:transform:org.apache.beam:kafka_write:v1: org.apache.beam.sdk.expansion.service.ExpansionService$ExternalTransformRegistrarLoader$1@4802796d
INFO apache_beam.utils.subprocess_server:subprocess_server.py:132 beam:external:java:generate_sequence:v1: org.apache.beam.sdk.expansion.service.ExpansionService$ExternalTransformRegistrarLoader$1@34123d65
INFO apache_beam.utils.subprocess_server:subprocess_server.py:132 Aug 16, 2022 5:34:28 AM org.apache.beam.sdk.expansion.service.ExpansionService expand
INFO apache_beam.utils.subprocess_server:subprocess_server.py:132 INFO: Expanding 'SqlTransform(beam:external:java:sql:v1)' with URN 'beam:external:java:sql:v1'
INFO apache_beam.utils.subprocess_server:subprocess_server.py:132 Aug 16, 2022 5:34:28 AM org.apache.beam.sdk.expansion.service.ExpansionService$ExternalTransformRegistrarLoader payloadToConfig
INFO apache_beam.utils.subprocess_server:subprocess_server.py:132 WARNING: Configuration class 'org.apache.beam.sdk.extensions.sql.expansion.ExternalSqlTransformRegistrar$Configuration' has no schema registered. Attempting to construct with setter approach.
INFO apache_beam.utils.subprocess_server:subprocess_server.py:132 Aug 16, 2022 5:34:28 AM org.apache.beam.sdk.expansion.service.ExpansionService$ExternalTransformRegistrarLoader payloadToConfig
INFO apache_beam.utils.subprocess_server:subprocess_server.py:132 WARNING: Configuration class 'org.apache.beam.sdk.extensions.sql.expansion.ExternalSqlTransformRegistrar$Configuration' has no schema registered. Attempting to construct with setter approach.
INFO apache_beam.utils.subprocess_server:subprocess_server.py:132 Aug 16, 2022 5:34:30 AM org.apache.beam.sdk.extensions.sql.impl.CalciteQueryPlanner convertToBeamRel
INFO apache_beam.utils.subprocess_server:subprocess_server.py:132 INFO: SQL:
INFO apache_beam.utils.subprocess_server:subprocess_server.py:132 SELECT COUNT(*) AS `count`
INFO apache_beam.utils.subprocess_server:subprocess_server.py:132 FROM `beam`.`PCOLLECTION` AS `PCOLLECTION`
INFO apache_beam.utils.subprocess_server:subprocess_server.py:132 Aug 16, 2022 5:34:30 AM org.apache.beam.sdk.extensions.sql.impl.CalciteQueryPlanner convertToBeamRel
INFO apache_beam.utils.subprocess_server:subprocess_server.py:132 INFO: SQLPlan>
INFO apache_beam.utils.subprocess_server:subprocess_server.py:132 LogicalAggregate(group=[{}], count=[COUNT()])
INFO apache_beam.utils.subprocess_server:subprocess_server.py:132 BeamIOSourceRel(table=[[beam, PCOLLECTION]])
INFO apache_beam.utils.subprocess_server:subprocess_server.py:132
INFO apache_beam.utils.subprocess_server:subprocess_server.py:132 Aug 16, 2022 5:34:31 AM org.apache.beam.sdk.extensions.sql.impl.CalciteQueryPlanner convertToBeamRel
INFO apache_beam.utils.subprocess_server:subprocess_server.py:132 INFO: BEAMPlan>
INFO apache_beam.utils.subprocess_server:subprocess_server.py:132 BeamAggregationRel(group=[{}], count=[COUNT()])
INFO apache_beam.utils.subprocess_server:subprocess_server.py:132 BeamIOSourceRel(table=[[beam, PCOLLECTION]])
INFO apache_beam.utils.subprocess_server:subprocess_server.py:132
INFO root:environments.py:376 Default Python SDK image for environment is apache/beam_python3.7_sdk:2.42.0.dev
INFO root:environments.py:299 No image given, using default Python SDK image
INFO root:environments.py:376 Default Python SDK image for environment is apache/beam_python3.7_sdk:2.42.0.dev
INFO root:environments.py:304 Python SDK container image set to "apache/beam_python3.7_sdk:2.42.0.dev" for Docker environment
INFO apache_beam.runners.portability.fn_api_runner.translations:translations.py:714 ==================== <function pack_combiners at 0x7f615f2e4e60> ====================
INFO apache_beam.runners.portability.fn_api_runner.translations:translations.py:714 ==================== <function lift_combiners at 0x7f615f2e4ef0> ====================
INFO apache_beam.runners.portability.fn_api_runner.translations:translations.py:714 ==================== <function sort_stages at 0x7f615f2e6680> ====================
INFO apache_beam.runners.portability.portable_runner:portable_runner.py:583 Job state changed to STOPPED
INFO apache_beam.runners.portability.portable_runner:portable_runner.py:583 Job state changed to STARTING
INFO apache_beam.runners.portability.portable_runner:portable_runner.py:583 Job state changed to RUNNING
INFO root:portable_runner.py:577 Default Python SDK image for environment is apache/beam_python3.7_sdk:2.42.0.dev
INFO root:portable_runner.py:577 ==================== <function annotate_downstream_side_inputs at 0x7f7a91b42050> ====================
INFO root:portable_runner.py:577 ==================== <function fix_side_input_pcoll_coders at 0x7f7a91b42170> ====================
INFO root:portable_runner.py:577 ==================== <function pack_combiners at 0x7f7a91b42680> ====================
INFO root:portable_runner.py:577 ==================== <function lift_combiners at 0x7f7a91b42710> ====================
INFO root:portable_runner.py:577 ==================== <function expand_sdf at 0x7f7a91b428c0> ====================
INFO root:portable_runner.py:577 ==================== <function expand_gbk at 0x7f7a91b42950> ====================
INFO root:portable_runner.py:577 ==================== <function sink_flattens at 0x7f7a91b42a70> ====================
INFO root:portable_runner.py:577 ==================== <function greedily_fuse at 0x7f7a91b42b00> ====================
INFO root:portable_runner.py:577 ==================== <function read_to_impulse at 0x7f7a91b42b90> ====================
INFO root:portable_runner.py:577 ==================== <function impulse_to_input at 0x7f7a91b42c20> ====================
INFO root:portable_runner.py:577 ==================== <function sort_stages at 0x7f7a91b42e60> ====================
INFO root:portable_runner.py:577 ==================== <function add_impulse_to_dangling_transforms at 0x7f7a91b42f80> ====================
INFO root:portable_runner.py:577 ==================== <function setup_timer_mapping at 0x7f7a91b42dd0> ====================
INFO root:portable_runner.py:577 ==================== <function populate_data_channel_coders at 0x7f7a91b42ef0> ====================
INFO root:portable_runner.py:577 starting control server on port 42569
INFO root:portable_runner.py:577 starting data server on port 44947
INFO root:portable_runner.py:577 starting state server on port 33801
INFO root:portable_runner.py:577 starting logging server on port 40529
INFO root:portable_runner.py:577 Created Worker handler <apache_beam.runners.portability.fn_api_runner.worker_handlers.DockerSdkWorkerHandler object at 0x7f7aa8831290> for environment ref_Environment_default_environment_2 (beam:env:docker:v1, b'\n$apache/beam_python3.7_sdk:2.42.0.dev')
INFO root:portable_runner.py:577 Attempting to pull image apache/beam_python3.7_sdk:2.42.0.dev
INFO root:portable_runner.py:577 Unable to pull image apache/beam_python3.7_sdk:2.42.0.dev, defaulting to local image if it exists
INFO root:portable_runner.py:577 Waiting for docker to start up. Current status is running
INFO root:portable_runner.py:577 Docker container is running. container_id = b'17adb634b26ddeadd9982fc0eabb48e02db1ffadc739e6d201a49218254f8617', worker_id = worker_83
INFO root:portable_runner.py:577 Created Worker handler <apache_beam.runners.portability.fn_api_runner.worker_handlers.DockerSdkWorkerHandler object at 0x7f7aa8801c90> for environment external_8beam:env:docker:v1 (beam:env:docker:v1, b'\n apache/beam_java8_sdk:2.42.0.dev')
INFO root:portable_runner.py:577 Attempting to pull image apache/beam_java8_sdk:2.42.0.dev
INFO root:portable_runner.py:577 Unable to pull image apache/beam_java8_sdk:2.42.0.dev, defaulting to local image if it exists
INFO root:portable_runner.py:577 Waiting for docker to start up. Current status is running
INFO root:portable_runner.py:577 Docker container is running. container_id = b'5929c4ddcba70eab08fea98a565071b1c589a96862ff3b1c9e4fe1f86b9ec8b8', worker_id = worker_84
INFO root:portable_runner.py:577 Completed job in 17.00624418258667 seconds with state DONE.
INFO apache_beam.runners.portability.portable_runner:portable_runner.py:583 Job state changed to DONE
PASSED [ 88%]
apache_beam/transforms/sql_test.py::SqlTransformTest::test_zetasql_generate_data
-------------------------------- live log call ---------------------------------
INFO apache_beam.utils.subprocess_server:subprocess_server.py:254 Using pre-built snapshot at <https://ci-beam.apache.org/job/beam_PostCommit_XVR_Direct/ws/src/sdks/java/extensions/sql/expansion-service/build/libs/beam-sdks-java-extensions-sql-expansion-service-2.42.0-SNAPSHOT.jar>
INFO root:external.py:773 Starting a JAR-based expansion service from JAR <https://ci-beam.apache.org/job/beam_PostCommit_XVR_Direct/ws/src/sdks/java/extensions/sql/expansion-service/build/libs/beam-sdks-java-extensions-sql-expansion-service-2.42.0-SNAPSHOT.jar>
INFO apache_beam.utils.subprocess_server:subprocess_server.py:116 Starting service with ['java' '-jar' '<https://ci-beam.apache.org/job/beam_PostCommit_XVR_Direct/ws/src/sdks/java/extensions/sql/expansion-service/build/libs/beam-sdks-java-extensions-sql-expansion-service-2.42.0-SNAPSHOT.jar'> '48821' '--filesToStage=<https://ci-beam.apache.org/job/beam_PostCommit_XVR_Direct/ws/src/sdks/java/extensions/sql/expansion-service/build/libs/beam-sdks-java-extensions-sql-expansion-service-2.42.0-SNAPSHOT.jar']>
INFO apache_beam.utils.subprocess_server:subprocess_server.py:132 Starting expansion service at localhost:48821
INFO apache_beam.utils.subprocess_server:subprocess_server.py:132 Aug 16, 2022 5:34:57 AM org.apache.beam.sdk.expansion.service.ExpansionService loadRegisteredTransforms
INFO apache_beam.utils.subprocess_server:subprocess_server.py:132 INFO: Registering external transforms: [beam:external:java:sql:v1, beam:transform:org.apache.beam:pubsub_read:v1, beam:transform:org.apache.beam:pubsub_write:v1, beam:transform:org.apache.beam:pubsublite_write:v1, beam:transform:org.apache.beam:pubsublite_read:v1, beam:transform:org.apache.beam:spanner_insert:v1, beam:transform:org.apache.beam:spanner_update:v1, beam:transform:org.apache.beam:spanner_replace:v1, beam:transform:org.apache.beam:spanner_insert_or_update:v1, beam:transform:org.apache.beam:spanner_delete:v1, beam:transform:org.apache.beam:spanner_read:v1, beam:transform:org.apache.beam:kafka_read_with_metadata:v1, beam:transform:org.apache.beam:kafka_read_without_metadata:v1, beam:transform:org.apache.beam:kafka_write:v1, beam:external:java:generate_sequence:v1]
INFO apache_beam.utils.subprocess_server:subprocess_server.py:132 beam:external:java:sql:v1: org.apache.beam.sdk.expansion.service.ExpansionService$ExternalTransformRegistrarLoader$1@47eaca72
INFO apache_beam.utils.subprocess_server:subprocess_server.py:132 beam:transform:org.apache.beam:pubsub_read:v1: org.apache.beam.sdk.expansion.service.ExpansionService$ExternalTransformRegistrarLoader$1@55141def
INFO apache_beam.utils.subprocess_server:subprocess_server.py:132 beam:transform:org.apache.beam:pubsub_write:v1: org.apache.beam.sdk.expansion.service.ExpansionService$ExternalTransformRegistrarLoader$1@55182842
INFO apache_beam.utils.subprocess_server:subprocess_server.py:132 beam:transform:org.apache.beam:pubsublite_write:v1: org.apache.beam.sdk.expansion.service.ExpansionService$ExternalTransformRegistrarLoader$1@3270d194
INFO apache_beam.utils.subprocess_server:subprocess_server.py:132 beam:transform:org.apache.beam:pubsublite_read:v1: org.apache.beam.sdk.expansion.service.ExpansionService$ExternalTransformRegistrarLoader$1@235834f2
INFO apache_beam.utils.subprocess_server:subprocess_server.py:132 beam:transform:org.apache.beam:spanner_insert:v1: org.apache.beam.sdk.expansion.service.ExpansionService$ExternalTransformRegistrarLoader$1@5656be13
INFO apache_beam.utils.subprocess_server:subprocess_server.py:132 beam:transform:org.apache.beam:spanner_update:v1: org.apache.beam.sdk.expansion.service.ExpansionService$ExternalTransformRegistrarLoader$1@4218d6a3
INFO apache_beam.utils.subprocess_server:subprocess_server.py:132 beam:transform:org.apache.beam:spanner_replace:v1: org.apache.beam.sdk.expansion.service.ExpansionService$ExternalTransformRegistrarLoader$1@76505305
INFO apache_beam.utils.subprocess_server:subprocess_server.py:132 beam:transform:org.apache.beam:spanner_insert_or_update:v1: org.apache.beam.sdk.expansion.service.ExpansionService$ExternalTransformRegistrarLoader$1@14cd1699
INFO apache_beam.utils.subprocess_server:subprocess_server.py:132 beam:transform:org.apache.beam:spanner_delete:v1: org.apache.beam.sdk.expansion.service.ExpansionService$ExternalTransformRegistrarLoader$1@77888435
INFO apache_beam.utils.subprocess_server:subprocess_server.py:132 beam:transform:org.apache.beam:spanner_read:v1: org.apache.beam.sdk.expansion.service.ExpansionService$ExternalTransformRegistrarLoader$1@73a1e9a9
INFO apache_beam.utils.subprocess_server:subprocess_server.py:132 beam:transform:org.apache.beam:kafka_read_with_metadata:v1: org.apache.beam.sdk.expansion.service.ExpansionService$ExternalTransformRegistrarLoader$1@71d44a3
INFO apache_beam.utils.subprocess_server:subprocess_server.py:132 beam:transform:org.apache.beam:kafka_read_without_metadata:v1: org.apache.beam.sdk.expansion.service.ExpansionService$ExternalTransformRegistrarLoader$1@7b98f307
INFO apache_beam.utils.subprocess_server:subprocess_server.py:132 beam:transform:org.apache.beam:kafka_write:v1: org.apache.beam.sdk.expansion.service.ExpansionService$ExternalTransformRegistrarLoader$1@4802796d
INFO apache_beam.utils.subprocess_server:subprocess_server.py:132 beam:external:java:generate_sequence:v1: org.apache.beam.sdk.expansion.service.ExpansionService$ExternalTransformRegistrarLoader$1@34123d65
INFO apache_beam.utils.subprocess_server:subprocess_server.py:132 Aug 16, 2022 5:34:59 AM org.apache.beam.sdk.expansion.service.ExpansionService expand
INFO apache_beam.utils.subprocess_server:subprocess_server.py:132 INFO: Expanding 'SqlTransform(beam:external:java:sql:v1)' with URN 'beam:external:java:sql:v1'
INFO apache_beam.utils.subprocess_server:subprocess_server.py:132 Aug 16, 2022 5:34:59 AM org.apache.beam.sdk.expansion.service.ExpansionService$ExternalTransformRegistrarLoader payloadToConfig
INFO apache_beam.utils.subprocess_server:subprocess_server.py:132 WARNING: Configuration class 'org.apache.beam.sdk.extensions.sql.expansion.ExternalSqlTransformRegistrar$Configuration' has no schema registered. Attempting to construct with setter approach.
INFO apache_beam.utils.subprocess_server:subprocess_server.py:132 Aug 16, 2022 5:34:59 AM org.apache.beam.sdk.expansion.service.ExpansionService$ExternalTransformRegistrarLoader payloadToConfig
INFO apache_beam.utils.subprocess_server:subprocess_server.py:132 WARNING: Configuration class 'org.apache.beam.sdk.extensions.sql.expansion.ExternalSqlTransformRegistrar$Configuration' has no schema registered. Attempting to construct with setter approach.
INFO apache_beam.utils.subprocess_server:subprocess_server.py:132 Aug 16, 2022 5:35:03 AM com.google.zetasql.io.grpc.NameResolverRegistry getDefaultRegistry
INFO apache_beam.utils.subprocess_server:subprocess_server.py:132 WARNING: No NameResolverProviders found via ServiceLoader, including for DNS. This is probably due to a broken build. If using ProGuard, check your configuration
INFO apache_beam.utils.subprocess_server:subprocess_server.py:132 Aug 16, 2022 5:35:05 AM org.apache.beam.sdk.extensions.sql.zetasql.ZetaSQLQueryPlanner convertToBeamRelInternal
INFO apache_beam.utils.subprocess_server:subprocess_server.py:132 INFO: BEAMPlan>
INFO apache_beam.utils.subprocess_server:subprocess_server.py:132 BeamZetaSqlCalcRel(expr#0=[{inputs}], expr#1=[1:BIGINT], expr#2=['foo':VARCHAR], expr#3=[3.1400000000000001243E0:DOUBLE], int=[$t1], str=[$t2], flt=[$t3])
INFO apache_beam.utils.subprocess_server:subprocess_server.py:132 BeamValuesRel(tuples=[[{ 0 }]])
INFO apache_beam.utils.subprocess_server:subprocess_server.py:132
INFO root:environments.py:376 Default Python SDK image for environment is apache/beam_python3.7_sdk:2.42.0.dev
INFO root:environments.py:299 No image given, using default Python SDK image
INFO root:environments.py:376 Default Python SDK image for environment is apache/beam_python3.7_sdk:2.42.0.dev
INFO root:environments.py:304 Python SDK container image set to "apache/beam_python3.7_sdk:2.42.0.dev" for Docker environment
INFO apache_beam.runners.portability.fn_api_runner.translations:translations.py:714 ==================== <function pack_combiners at 0x7f615f2e4e60> ====================
INFO apache_beam.runners.portability.fn_api_runner.translations:translations.py:714 ==================== <function lift_combiners at 0x7f615f2e4ef0> ====================
INFO apache_beam.runners.portability.fn_api_runner.translations:translations.py:714 ==================== <function sort_stages at 0x7f615f2e6680> ====================
INFO apache_beam.runners.portability.portable_runner:portable_runner.py:583 Job state changed to STOPPED
INFO apache_beam.runners.portability.portable_runner:portable_runner.py:583 Job state changed to STARTING
INFO apache_beam.runners.portability.portable_runner:portable_runner.py:583 Job state changed to RUNNING
INFO root:portable_runner.py:577 Default Python SDK image for environment is apache/beam_python3.7_sdk:2.42.0.dev
INFO root:portable_runner.py:577 ==================== <function annotate_downstream_side_inputs at 0x7f7a91b42050> ====================
INFO root:portable_runner.py:577 ==================== <function fix_side_input_pcoll_coders at 0x7f7a91b42170> ====================
INFO root:portable_runner.py:577 ==================== <function pack_combiners at 0x7f7a91b42680> ====================
INFO root:portable_runner.py:577 ==================== <function lift_combiners at 0x7f7a91b42710> ====================
INFO root:portable_runner.py:577 ==================== <function expand_sdf at 0x7f7a91b428c0> ====================
INFO root:portable_runner.py:577 ==================== <function expand_gbk at 0x7f7a91b42950> ====================
INFO root:portable_runner.py:577 ==================== <function sink_flattens at 0x7f7a91b42a70> ====================
INFO root:portable_runner.py:577 ==================== <function greedily_fuse at 0x7f7a91b42b00> ====================
INFO root:portable_runner.py:577 ==================== <function read_to_impulse at 0x7f7a91b42b90> ====================
INFO root:portable_runner.py:577 ==================== <function impulse_to_input at 0x7f7a91b42c20> ====================
INFO root:portable_runner.py:577 ==================== <function sort_stages at 0x7f7a91b42e60> ====================
INFO root:portable_runner.py:577 ==================== <function add_impulse_to_dangling_transforms at 0x7f7a91b42f80> ====================
INFO root:portable_runner.py:577 ==================== <function setup_timer_mapping at 0x7f7a91b42dd0> ====================
INFO root:portable_runner.py:577 ==================== <function populate_data_channel_coders at 0x7f7a91b42ef0> ====================
INFO root:portable_runner.py:577 starting control server on port 43419
INFO root:portable_runner.py:577 starting data server on port 39113
INFO root:portable_runner.py:577 starting state server on port 34463
INFO root:portable_runner.py:577 starting logging server on port 33247
INFO root:portable_runner.py:577 Created Worker handler <apache_beam.runners.portability.fn_api_runner.worker_handlers.DockerSdkWorkerHandler object at 0x7f7aa887bad0> for environment external_9beam:env:docker:v1 (beam:env:docker:v1, b'\n apache/beam_java8_sdk:2.42.0.dev')
INFO root:portable_runner.py:577 Attempting to pull image apache/beam_java8_sdk:2.42.0.dev
INFO root:portable_runner.py:577 Unable to pull image apache/beam_java8_sdk:2.42.0.dev, defaulting to local image if it exists
INFO root:portable_runner.py:577 Waiting for docker to start up. Current status is running
INFO root:portable_runner.py:577 Docker container is running. container_id = b'c41d5c1cb15370572f6b6b0f698d318591138994cc2c2917835dc11bc20e8512', worker_id = worker_85
INFO root:portable_runner.py:577 Created Worker handler <apache_beam.runners.portability.fn_api_runner.worker_handlers.DockerSdkWorkerHandler object at 0x7f7a9010c0d0> for environment ref_Environment_default_environment_2 (beam:env:docker:v1, b'\n$apache/beam_python3.7_sdk:2.42.0.dev')
INFO root:portable_runner.py:577 Attempting to pull image apache/beam_python3.7_sdk:2.42.0.dev
INFO root:portable_runner.py:577 Unable to pull image apache/beam_python3.7_sdk:2.42.0.dev, defaulting to local image if it exists
INFO root:portable_runner.py:577 Waiting for docker to start up. Current status is running
INFO root:portable_runner.py:577 Docker container is running. container_id = b'1f66b58f1415dd6e898f37e1b886a56f99c13038e85cc5bba00c4112c7ea51ca', worker_id = worker_86
INFO root:portable_runner.py:577 Completed job in 16.244000673294067 seconds with state DONE.
INFO apache_beam.runners.portability.portable_runner:portable_runner.py:583 Job state changed to DONE
PASSED [100%]
=============================== warnings summary ===============================
../../build/gradleenv/1922375555/lib/python3.7/site-packages/hdfs/config.py:15
<https://ci-beam.apache.org/job/beam_PostCommit_XVR_Direct/ws/src/build/gradleenv/1922375555/lib/python3.7/site-packages/hdfs/config.py>:15: DeprecationWarning: the imp module is deprecated in favour of importlib; see the module's documentation for alternative uses
from imp import load_source
-- Docs: https://docs.pytest.org/en/stable/how-to/capture-warnings.html
- generated xml file: <https://ci-beam.apache.org/job/beam_PostCommit_XVR_Direct/ws/src/sdks/python/pytest_xlangSqlValidateRunner.xml> -
===== 9 passed, 2 skipped, 6541 deselected, 1 warning in 255.92s (0:04:15) =====
> Task :sdks:python:test-suites:direct:xlang:validatesCrossLanguageRunnerCleanup
Stopping expansion service pid: 826931.
Stopping expansion service pid: 826932.
> Task :sdks:python:test-suites:direct:xlang:fnApiJobServerCleanup
Killing process at 823649
FAILURE: Build failed with an exception.
* What went wrong:
Execution failed for task ':sdks:python:test-suites:direct:xlang:validatesCrossLanguageRunnerJavaUsingPython'.
> There were failing tests. See the report at: file://<https://ci-beam.apache.org/job/beam_PostCommit_XVR_Direct/ws/src/sdks/python/test-suites/direct/xlang/build/reports/tests/validatesCrossLanguageRunnerJavaUsingPython/index.html>
* Try:
> Run with --stacktrace option to get the stack trace.
> Run with --info or --debug option to get more log output.
> Run with --scan to get full insights.
* Get more help at https://help.gradle.org
Deprecated Gradle features were used in this build, making it incompatible with Gradle 8.0.
You can use '--warning-mode all' to show the individual deprecation warnings and determine if they come from your own scripts or plugins.
See https://docs.gradle.org/7.4/userguide/command_line_interface.html#sec:command_line_warnings
Execution optimizations have been disabled for 1 invalid unit(s) of work during this build to ensure correctness.
Please consult deprecation warnings for more details.
BUILD FAILED in 25m 9s
247 actionable tasks: 166 executed, 69 from cache, 12 up-to-date
Publishing build scan...
https://gradle.com/s/nz2sw5c3rvttc
Build step 'Invoke Gradle script' changed build result to FAILURE
Build step 'Invoke Gradle script' marked build as failure
---------------------------------------------------------------------
To unsubscribe, e-mail: builds-unsubscribe@beam.apache.org
For additional commands, e-mail: builds-help@beam.apache.org
Build failed in Jenkins: beam_PostCommit_XVR_Direct #3020
Posted by Apache Jenkins Server <je...@builds.apache.org>.
See <https://ci-beam.apache.org/job/beam_PostCommit_XVR_Direct/3020/display/redirect?page=changes>
Changes:
[Steve Niemitz] Fix UpdateSchemaDestination when source format is set to AVRO
------------------------------------------
[...truncated 1.42 MB...]
INFO root:environments.py:304 Python SDK container image set to "apache/beam_python3.7_sdk:2.42.0.dev" for Docker environment
INFO apache_beam.runners.portability.fn_api_runner.translations:translations.py:714 ==================== <function pack_combiners at 0x7f831f564e60> ====================
INFO apache_beam.runners.portability.fn_api_runner.translations:translations.py:714 ==================== <function lift_combiners at 0x7f831f564ef0> ====================
INFO apache_beam.runners.portability.fn_api_runner.translations:translations.py:714 ==================== <function sort_stages at 0x7f831f565680> ====================
INFO apache_beam.runners.portability.portable_runner:portable_runner.py:583 Job state changed to STOPPED
INFO apache_beam.runners.portability.portable_runner:portable_runner.py:583 Job state changed to STARTING
INFO apache_beam.runners.portability.portable_runner:portable_runner.py:583 Job state changed to RUNNING
INFO root:portable_runner.py:577 Default Python SDK image for environment is apache/beam_python3.7_sdk:2.42.0.dev
INFO root:portable_runner.py:577 ==================== <function annotate_downstream_side_inputs at 0x7fd4f7051050> ====================
INFO root:portable_runner.py:577 ==================== <function fix_side_input_pcoll_coders at 0x7fd4f7051170> ====================
INFO root:portable_runner.py:577 ==================== <function pack_combiners at 0x7fd4f7051680> ====================
INFO root:portable_runner.py:577 ==================== <function lift_combiners at 0x7fd4f7051710> ====================
INFO root:portable_runner.py:577 ==================== <function expand_sdf at 0x7fd4f70518c0> ====================
INFO root:portable_runner.py:577 ==================== <function expand_gbk at 0x7fd4f7051950> ====================
INFO root:portable_runner.py:577 ==================== <function sink_flattens at 0x7fd4f7051a70> ====================
INFO root:portable_runner.py:577 ==================== <function greedily_fuse at 0x7fd4f7051b00> ====================
INFO root:portable_runner.py:577 ==================== <function read_to_impulse at 0x7fd4f7051b90> ====================
INFO root:portable_runner.py:577 ==================== <function impulse_to_input at 0x7fd4f7051c20> ====================
INFO root:portable_runner.py:577 ==================== <function sort_stages at 0x7fd4f7051e60> ====================
INFO root:portable_runner.py:577 ==================== <function add_impulse_to_dangling_transforms at 0x7fd4f7051f80> ====================
INFO root:portable_runner.py:577 ==================== <function setup_timer_mapping at 0x7fd4f7051dd0> ====================
INFO root:portable_runner.py:577 ==================== <function populate_data_channel_coders at 0x7fd4f7051ef0> ====================
INFO root:portable_runner.py:577 starting control server on port 38709
INFO root:portable_runner.py:577 starting data server on port 36929
INFO root:portable_runner.py:577 starting state server on port 38929
INFO root:portable_runner.py:577 starting logging server on port 36363
INFO root:portable_runner.py:577 Created Worker handler <apache_beam.runners.portability.fn_api_runner.worker_handlers.DockerSdkWorkerHandler object at 0x7fd4f46fd690> for environment ref_Environment_default_environment_2 (beam:env:docker:v1, b'\n$apache/beam_python3.7_sdk:2.42.0.dev')
INFO root:portable_runner.py:577 Attempting to pull image apache/beam_python3.7_sdk:2.42.0.dev
INFO root:portable_runner.py:577 Unable to pull image apache/beam_python3.7_sdk:2.42.0.dev, defaulting to local image if it exists
INFO root:portable_runner.py:577 Waiting for docker to start up. Current status is running
INFO root:portable_runner.py:577 Docker container is running. container_id = b'57fa056894e551de458fcb2476bd630b7558d6f242857758db3322ec6e9f086d', worker_id = worker_81
INFO root:portable_runner.py:577 Created Worker handler <apache_beam.runners.portability.fn_api_runner.worker_handlers.DockerSdkWorkerHandler object at 0x7fd4f46c48d0> for environment external_7beam:env:docker:v1 (beam:env:docker:v1, b'\n apache/beam_java8_sdk:2.42.0.dev')
INFO root:portable_runner.py:577 Attempting to pull image apache/beam_java8_sdk:2.42.0.dev
INFO root:portable_runner.py:577 Unable to pull image apache/beam_java8_sdk:2.42.0.dev, defaulting to local image if it exists
INFO root:portable_runner.py:577 Waiting for docker to start up. Current status is running
INFO root:portable_runner.py:577 Docker container is running. container_id = b'569ac5f3d858cf0967d1b98f24022871eda786b85a59e6a25dace9175be115ae', worker_id = worker_82
INFO root:portable_runner.py:577 Completed job in 12.635122299194336 seconds with state DONE.
INFO apache_beam.runners.portability.portable_runner:portable_runner.py:583 Job state changed to DONE
PASSED [ 77%]
apache_beam/transforms/sql_test.py::SqlTransformTest::test_windowing_before_sql
-------------------------------- live log call ---------------------------------
INFO apache_beam.utils.subprocess_server:subprocess_server.py:254 Using pre-built snapshot at <https://ci-beam.apache.org/job/beam_PostCommit_XVR_Direct/ws/src/sdks/java/extensions/sql/expansion-service/build/libs/beam-sdks-java-extensions-sql-expansion-service-2.42.0-SNAPSHOT.jar>
INFO root:external.py:773 Starting a JAR-based expansion service from JAR <https://ci-beam.apache.org/job/beam_PostCommit_XVR_Direct/ws/src/sdks/java/extensions/sql/expansion-service/build/libs/beam-sdks-java-extensions-sql-expansion-service-2.42.0-SNAPSHOT.jar>
INFO apache_beam.utils.subprocess_server:subprocess_server.py:116 Starting service with ['java' '-jar' '<https://ci-beam.apache.org/job/beam_PostCommit_XVR_Direct/ws/src/sdks/java/extensions/sql/expansion-service/build/libs/beam-sdks-java-extensions-sql-expansion-service-2.42.0-SNAPSHOT.jar'> '52771' '--filesToStage=<https://ci-beam.apache.org/job/beam_PostCommit_XVR_Direct/ws/src/sdks/java/extensions/sql/expansion-service/build/libs/beam-sdks-java-extensions-sql-expansion-service-2.42.0-SNAPSHOT.jar']>
INFO apache_beam.utils.subprocess_server:subprocess_server.py:132 Starting expansion service at localhost:52771
INFO apache_beam.utils.subprocess_server:subprocess_server.py:132 Aug 15, 2022 11:35:07 PM org.apache.beam.sdk.expansion.service.ExpansionService loadRegisteredTransforms
INFO apache_beam.utils.subprocess_server:subprocess_server.py:132 INFO: Registering external transforms: [beam:external:java:sql:v1, beam:transform:org.apache.beam:pubsub_read:v1, beam:transform:org.apache.beam:pubsub_write:v1, beam:transform:org.apache.beam:pubsublite_write:v1, beam:transform:org.apache.beam:pubsublite_read:v1, beam:transform:org.apache.beam:spanner_insert:v1, beam:transform:org.apache.beam:spanner_update:v1, beam:transform:org.apache.beam:spanner_replace:v1, beam:transform:org.apache.beam:spanner_insert_or_update:v1, beam:transform:org.apache.beam:spanner_delete:v1, beam:transform:org.apache.beam:spanner_read:v1, beam:transform:org.apache.beam:kafka_read_with_metadata:v1, beam:transform:org.apache.beam:kafka_read_without_metadata:v1, beam:transform:org.apache.beam:kafka_write:v1, beam:external:java:generate_sequence:v1]
INFO apache_beam.utils.subprocess_server:subprocess_server.py:132 beam:external:java:sql:v1: org.apache.beam.sdk.expansion.service.ExpansionService$ExternalTransformRegistrarLoader$1@47eaca72
INFO apache_beam.utils.subprocess_server:subprocess_server.py:132 beam:transform:org.apache.beam:pubsub_read:v1: org.apache.beam.sdk.expansion.service.ExpansionService$ExternalTransformRegistrarLoader$1@55141def
INFO apache_beam.utils.subprocess_server:subprocess_server.py:132 beam:transform:org.apache.beam:pubsub_write:v1: org.apache.beam.sdk.expansion.service.ExpansionService$ExternalTransformRegistrarLoader$1@55182842
INFO apache_beam.utils.subprocess_server:subprocess_server.py:132 beam:transform:org.apache.beam:pubsublite_write:v1: org.apache.beam.sdk.expansion.service.ExpansionService$ExternalTransformRegistrarLoader$1@3270d194
INFO apache_beam.utils.subprocess_server:subprocess_server.py:132 beam:transform:org.apache.beam:pubsublite_read:v1: org.apache.beam.sdk.expansion.service.ExpansionService$ExternalTransformRegistrarLoader$1@235834f2
INFO apache_beam.utils.subprocess_server:subprocess_server.py:132 beam:transform:org.apache.beam:spanner_insert:v1: org.apache.beam.sdk.expansion.service.ExpansionService$ExternalTransformRegistrarLoader$1@5656be13
INFO apache_beam.utils.subprocess_server:subprocess_server.py:132 beam:transform:org.apache.beam:spanner_update:v1: org.apache.beam.sdk.expansion.service.ExpansionService$ExternalTransformRegistrarLoader$1@4218d6a3
INFO apache_beam.utils.subprocess_server:subprocess_server.py:132 beam:transform:org.apache.beam:spanner_replace:v1: org.apache.beam.sdk.expansion.service.ExpansionService$ExternalTransformRegistrarLoader$1@76505305
INFO apache_beam.utils.subprocess_server:subprocess_server.py:132 beam:transform:org.apache.beam:spanner_insert_or_update:v1: org.apache.beam.sdk.expansion.service.ExpansionService$ExternalTransformRegistrarLoader$1@14cd1699
INFO apache_beam.utils.subprocess_server:subprocess_server.py:132 beam:transform:org.apache.beam:spanner_delete:v1: org.apache.beam.sdk.expansion.service.ExpansionService$ExternalTransformRegistrarLoader$1@77888435
INFO apache_beam.utils.subprocess_server:subprocess_server.py:132 beam:transform:org.apache.beam:spanner_read:v1: org.apache.beam.sdk.expansion.service.ExpansionService$ExternalTransformRegistrarLoader$1@73a1e9a9
INFO apache_beam.utils.subprocess_server:subprocess_server.py:132 beam:transform:org.apache.beam:kafka_read_with_metadata:v1: org.apache.beam.sdk.expansion.service.ExpansionService$ExternalTransformRegistrarLoader$1@71d44a3
INFO apache_beam.utils.subprocess_server:subprocess_server.py:132 beam:transform:org.apache.beam:kafka_read_without_metadata:v1: org.apache.beam.sdk.expansion.service.ExpansionService$ExternalTransformRegistrarLoader$1@7b98f307
INFO apache_beam.utils.subprocess_server:subprocess_server.py:132 beam:transform:org.apache.beam:kafka_write:v1: org.apache.beam.sdk.expansion.service.ExpansionService$ExternalTransformRegistrarLoader$1@4802796d
INFO apache_beam.utils.subprocess_server:subprocess_server.py:132 beam:external:java:generate_sequence:v1: org.apache.beam.sdk.expansion.service.ExpansionService$ExternalTransformRegistrarLoader$1@34123d65
INFO apache_beam.utils.subprocess_server:subprocess_server.py:132 Aug 15, 2022 11:35:08 PM org.apache.beam.sdk.expansion.service.ExpansionService expand
INFO apache_beam.utils.subprocess_server:subprocess_server.py:132 INFO: Expanding 'SqlTransform(beam:external:java:sql:v1)' with URN 'beam:external:java:sql:v1'
INFO apache_beam.utils.subprocess_server:subprocess_server.py:132 Aug 15, 2022 11:35:09 PM org.apache.beam.sdk.expansion.service.ExpansionService$ExternalTransformRegistrarLoader payloadToConfig
INFO apache_beam.utils.subprocess_server:subprocess_server.py:132 WARNING: Configuration class 'org.apache.beam.sdk.extensions.sql.expansion.ExternalSqlTransformRegistrar$Configuration' has no schema registered. Attempting to construct with setter approach.
INFO apache_beam.utils.subprocess_server:subprocess_server.py:132 Aug 15, 2022 11:35:09 PM org.apache.beam.sdk.expansion.service.ExpansionService$ExternalTransformRegistrarLoader payloadToConfig
INFO apache_beam.utils.subprocess_server:subprocess_server.py:132 WARNING: Configuration class 'org.apache.beam.sdk.extensions.sql.expansion.ExternalSqlTransformRegistrar$Configuration' has no schema registered. Attempting to construct with setter approach.
INFO apache_beam.utils.subprocess_server:subprocess_server.py:132 Aug 15, 2022 11:35:11 PM org.apache.beam.sdk.extensions.sql.impl.CalciteQueryPlanner convertToBeamRel
INFO apache_beam.utils.subprocess_server:subprocess_server.py:132 INFO: SQL:
INFO apache_beam.utils.subprocess_server:subprocess_server.py:132 SELECT COUNT(*) AS `count`
INFO apache_beam.utils.subprocess_server:subprocess_server.py:132 FROM `beam`.`PCOLLECTION` AS `PCOLLECTION`
INFO apache_beam.utils.subprocess_server:subprocess_server.py:132 Aug 15, 2022 11:35:11 PM org.apache.beam.sdk.extensions.sql.impl.CalciteQueryPlanner convertToBeamRel
INFO apache_beam.utils.subprocess_server:subprocess_server.py:132 INFO: SQLPlan>
INFO apache_beam.utils.subprocess_server:subprocess_server.py:132 LogicalAggregate(group=[{}], count=[COUNT()])
INFO apache_beam.utils.subprocess_server:subprocess_server.py:132 BeamIOSourceRel(table=[[beam, PCOLLECTION]])
INFO apache_beam.utils.subprocess_server:subprocess_server.py:132
INFO apache_beam.utils.subprocess_server:subprocess_server.py:132 Aug 15, 2022 11:35:11 PM org.apache.beam.sdk.extensions.sql.impl.CalciteQueryPlanner convertToBeamRel
INFO apache_beam.utils.subprocess_server:subprocess_server.py:132 INFO: BEAMPlan>
INFO apache_beam.utils.subprocess_server:subprocess_server.py:132 BeamAggregationRel(group=[{}], count=[COUNT()])
INFO apache_beam.utils.subprocess_server:subprocess_server.py:132 BeamIOSourceRel(table=[[beam, PCOLLECTION]])
INFO apache_beam.utils.subprocess_server:subprocess_server.py:132
INFO root:environments.py:376 Default Python SDK image for environment is apache/beam_python3.7_sdk:2.42.0.dev
INFO root:environments.py:299 No image given, using default Python SDK image
INFO root:environments.py:376 Default Python SDK image for environment is apache/beam_python3.7_sdk:2.42.0.dev
INFO root:environments.py:304 Python SDK container image set to "apache/beam_python3.7_sdk:2.42.0.dev" for Docker environment
INFO apache_beam.runners.portability.fn_api_runner.translations:translations.py:714 ==================== <function pack_combiners at 0x7f831f564e60> ====================
INFO apache_beam.runners.portability.fn_api_runner.translations:translations.py:714 ==================== <function lift_combiners at 0x7f831f564ef0> ====================
INFO apache_beam.runners.portability.fn_api_runner.translations:translations.py:714 ==================== <function sort_stages at 0x7f831f565680> ====================
INFO apache_beam.runners.portability.portable_runner:portable_runner.py:583 Job state changed to STOPPED
INFO apache_beam.runners.portability.portable_runner:portable_runner.py:583 Job state changed to STARTING
INFO apache_beam.runners.portability.portable_runner:portable_runner.py:583 Job state changed to RUNNING
INFO root:portable_runner.py:577 Default Python SDK image for environment is apache/beam_python3.7_sdk:2.42.0.dev
INFO root:portable_runner.py:577 ==================== <function annotate_downstream_side_inputs at 0x7fd4f7051050> ====================
INFO root:portable_runner.py:577 ==================== <function fix_side_input_pcoll_coders at 0x7fd4f7051170> ====================
INFO root:portable_runner.py:577 ==================== <function pack_combiners at 0x7fd4f7051680> ====================
INFO root:portable_runner.py:577 ==================== <function lift_combiners at 0x7fd4f7051710> ====================
INFO root:portable_runner.py:577 ==================== <function expand_sdf at 0x7fd4f70518c0> ====================
INFO root:portable_runner.py:577 ==================== <function expand_gbk at 0x7fd4f7051950> ====================
INFO root:portable_runner.py:577 ==================== <function sink_flattens at 0x7fd4f7051a70> ====================
INFO root:portable_runner.py:577 ==================== <function greedily_fuse at 0x7fd4f7051b00> ====================
INFO root:portable_runner.py:577 ==================== <function read_to_impulse at 0x7fd4f7051b90> ====================
INFO root:portable_runner.py:577 ==================== <function impulse_to_input at 0x7fd4f7051c20> ====================
INFO root:portable_runner.py:577 ==================== <function sort_stages at 0x7fd4f7051e60> ====================
INFO root:portable_runner.py:577 ==================== <function add_impulse_to_dangling_transforms at 0x7fd4f7051f80> ====================
INFO root:portable_runner.py:577 ==================== <function setup_timer_mapping at 0x7fd4f7051dd0> ====================
INFO root:portable_runner.py:577 ==================== <function populate_data_channel_coders at 0x7fd4f7051ef0> ====================
INFO root:portable_runner.py:577 starting control server on port 38429
INFO root:portable_runner.py:577 starting data server on port 35875
INFO root:portable_runner.py:577 starting state server on port 41543
INFO root:portable_runner.py:577 starting logging server on port 37517
INFO root:portable_runner.py:577 Created Worker handler <apache_beam.runners.portability.fn_api_runner.worker_handlers.DockerSdkWorkerHandler object at 0x7fd4f46c49d0> for environment ref_Environment_default_environment_2 (beam:env:docker:v1, b'\n$apache/beam_python3.7_sdk:2.42.0.dev')
INFO root:portable_runner.py:577 Attempting to pull image apache/beam_python3.7_sdk:2.42.0.dev
INFO root:portable_runner.py:577 Unable to pull image apache/beam_python3.7_sdk:2.42.0.dev, defaulting to local image if it exists
INFO root:portable_runner.py:577 Waiting for docker to start up. Current status is running
INFO root:portable_runner.py:577 Docker container is running. container_id = b'd0147fa4a8650c1fc170cbef698c9ee0794cca42c9f749730d7b74788d035079', worker_id = worker_83
INFO root:portable_runner.py:577 Created Worker handler <apache_beam.runners.portability.fn_api_runner.worker_handlers.DockerSdkWorkerHandler object at 0x7fd4f4746ed0> for environment external_8beam:env:docker:v1 (beam:env:docker:v1, b'\n apache/beam_java8_sdk:2.42.0.dev')
INFO root:portable_runner.py:577 Attempting to pull image apache/beam_java8_sdk:2.42.0.dev
INFO root:portable_runner.py:577 Unable to pull image apache/beam_java8_sdk:2.42.0.dev, defaulting to local image if it exists
INFO root:portable_runner.py:577 Waiting for docker to start up. Current status is running
INFO root:portable_runner.py:577 Docker container is running. container_id = b'9e2e3802139bfefda744b8082685f88fe6a1dc81b3ba00a6b651148fb0ff1cf7', worker_id = worker_84
INFO root:portable_runner.py:577 Completed job in 11.780686378479004 seconds with state DONE.
INFO apache_beam.runners.portability.portable_runner:portable_runner.py:583 Job state changed to DONE
PASSED [ 88%]
apache_beam/transforms/sql_test.py::SqlTransformTest::test_zetasql_generate_data
-------------------------------- live log call ---------------------------------
INFO apache_beam.utils.subprocess_server:subprocess_server.py:254 Using pre-built snapshot at <https://ci-beam.apache.org/job/beam_PostCommit_XVR_Direct/ws/src/sdks/java/extensions/sql/expansion-service/build/libs/beam-sdks-java-extensions-sql-expansion-service-2.42.0-SNAPSHOT.jar>
INFO root:external.py:773 Starting a JAR-based expansion service from JAR <https://ci-beam.apache.org/job/beam_PostCommit_XVR_Direct/ws/src/sdks/java/extensions/sql/expansion-service/build/libs/beam-sdks-java-extensions-sql-expansion-service-2.42.0-SNAPSHOT.jar>
INFO apache_beam.utils.subprocess_server:subprocess_server.py:116 Starting service with ['java' '-jar' '<https://ci-beam.apache.org/job/beam_PostCommit_XVR_Direct/ws/src/sdks/java/extensions/sql/expansion-service/build/libs/beam-sdks-java-extensions-sql-expansion-service-2.42.0-SNAPSHOT.jar'> '49077' '--filesToStage=<https://ci-beam.apache.org/job/beam_PostCommit_XVR_Direct/ws/src/sdks/java/extensions/sql/expansion-service/build/libs/beam-sdks-java-extensions-sql-expansion-service-2.42.0-SNAPSHOT.jar']>
INFO apache_beam.utils.subprocess_server:subprocess_server.py:132 Starting expansion service at localhost:49077
INFO apache_beam.utils.subprocess_server:subprocess_server.py:132 Aug 15, 2022 11:35:32 PM org.apache.beam.sdk.expansion.service.ExpansionService loadRegisteredTransforms
INFO apache_beam.utils.subprocess_server:subprocess_server.py:132 INFO: Registering external transforms: [beam:external:java:sql:v1, beam:transform:org.apache.beam:pubsub_read:v1, beam:transform:org.apache.beam:pubsub_write:v1, beam:transform:org.apache.beam:pubsublite_write:v1, beam:transform:org.apache.beam:pubsublite_read:v1, beam:transform:org.apache.beam:spanner_insert:v1, beam:transform:org.apache.beam:spanner_update:v1, beam:transform:org.apache.beam:spanner_replace:v1, beam:transform:org.apache.beam:spanner_insert_or_update:v1, beam:transform:org.apache.beam:spanner_delete:v1, beam:transform:org.apache.beam:spanner_read:v1, beam:transform:org.apache.beam:kafka_read_with_metadata:v1, beam:transform:org.apache.beam:kafka_read_without_metadata:v1, beam:transform:org.apache.beam:kafka_write:v1, beam:external:java:generate_sequence:v1]
INFO apache_beam.utils.subprocess_server:subprocess_server.py:132 beam:external:java:sql:v1: org.apache.beam.sdk.expansion.service.ExpansionService$ExternalTransformRegistrarLoader$1@47eaca72
INFO apache_beam.utils.subprocess_server:subprocess_server.py:132 beam:transform:org.apache.beam:pubsub_read:v1: org.apache.beam.sdk.expansion.service.ExpansionService$ExternalTransformRegistrarLoader$1@55141def
INFO apache_beam.utils.subprocess_server:subprocess_server.py:132 beam:transform:org.apache.beam:pubsub_write:v1: org.apache.beam.sdk.expansion.service.ExpansionService$ExternalTransformRegistrarLoader$1@55182842
INFO apache_beam.utils.subprocess_server:subprocess_server.py:132 beam:transform:org.apache.beam:pubsublite_write:v1: org.apache.beam.sdk.expansion.service.ExpansionService$ExternalTransformRegistrarLoader$1@3270d194
INFO apache_beam.utils.subprocess_server:subprocess_server.py:132 beam:transform:org.apache.beam:pubsublite_read:v1: org.apache.beam.sdk.expansion.service.ExpansionService$ExternalTransformRegistrarLoader$1@235834f2
INFO apache_beam.utils.subprocess_server:subprocess_server.py:132 beam:transform:org.apache.beam:spanner_insert:v1: org.apache.beam.sdk.expansion.service.ExpansionService$ExternalTransformRegistrarLoader$1@5656be13
INFO apache_beam.utils.subprocess_server:subprocess_server.py:132 beam:transform:org.apache.beam:spanner_update:v1: org.apache.beam.sdk.expansion.service.ExpansionService$ExternalTransformRegistrarLoader$1@4218d6a3
INFO apache_beam.utils.subprocess_server:subprocess_server.py:132 beam:transform:org.apache.beam:spanner_replace:v1: org.apache.beam.sdk.expansion.service.ExpansionService$ExternalTransformRegistrarLoader$1@76505305
INFO apache_beam.utils.subprocess_server:subprocess_server.py:132 beam:transform:org.apache.beam:spanner_insert_or_update:v1: org.apache.beam.sdk.expansion.service.ExpansionService$ExternalTransformRegistrarLoader$1@14cd1699
INFO apache_beam.utils.subprocess_server:subprocess_server.py:132 beam:transform:org.apache.beam:spanner_delete:v1: org.apache.beam.sdk.expansion.service.ExpansionService$ExternalTransformRegistrarLoader$1@77888435
INFO apache_beam.utils.subprocess_server:subprocess_server.py:132 beam:transform:org.apache.beam:spanner_read:v1: org.apache.beam.sdk.expansion.service.ExpansionService$ExternalTransformRegistrarLoader$1@73a1e9a9
INFO apache_beam.utils.subprocess_server:subprocess_server.py:132 beam:transform:org.apache.beam:kafka_read_with_metadata:v1: org.apache.beam.sdk.expansion.service.ExpansionService$ExternalTransformRegistrarLoader$1@71d44a3
INFO apache_beam.utils.subprocess_server:subprocess_server.py:132 beam:transform:org.apache.beam:kafka_read_without_metadata:v1: org.apache.beam.sdk.expansion.service.ExpansionService$ExternalTransformRegistrarLoader$1@7b98f307
INFO apache_beam.utils.subprocess_server:subprocess_server.py:132 beam:transform:org.apache.beam:kafka_write:v1: org.apache.beam.sdk.expansion.service.ExpansionService$ExternalTransformRegistrarLoader$1@4802796d
INFO apache_beam.utils.subprocess_server:subprocess_server.py:132 beam:external:java:generate_sequence:v1: org.apache.beam.sdk.expansion.service.ExpansionService$ExternalTransformRegistrarLoader$1@34123d65
INFO apache_beam.utils.subprocess_server:subprocess_server.py:132 Aug 15, 2022 11:35:33 PM org.apache.beam.sdk.expansion.service.ExpansionService expand
INFO apache_beam.utils.subprocess_server:subprocess_server.py:132 INFO: Expanding 'SqlTransform(beam:external:java:sql:v1)' with URN 'beam:external:java:sql:v1'
INFO apache_beam.utils.subprocess_server:subprocess_server.py:132 Aug 15, 2022 11:35:33 PM org.apache.beam.sdk.expansion.service.ExpansionService$ExternalTransformRegistrarLoader payloadToConfig
INFO apache_beam.utils.subprocess_server:subprocess_server.py:132 WARNING: Configuration class 'org.apache.beam.sdk.extensions.sql.expansion.ExternalSqlTransformRegistrar$Configuration' has no schema registered. Attempting to construct with setter approach.
INFO apache_beam.utils.subprocess_server:subprocess_server.py:132 Aug 15, 2022 11:35:33 PM org.apache.beam.sdk.expansion.service.ExpansionService$ExternalTransformRegistrarLoader payloadToConfig
INFO apache_beam.utils.subprocess_server:subprocess_server.py:132 WARNING: Configuration class 'org.apache.beam.sdk.extensions.sql.expansion.ExternalSqlTransformRegistrar$Configuration' has no schema registered. Attempting to construct with setter approach.
INFO apache_beam.utils.subprocess_server:subprocess_server.py:132 Aug 15, 2022 11:35:36 PM com.google.zetasql.io.grpc.NameResolverRegistry getDefaultRegistry
INFO apache_beam.utils.subprocess_server:subprocess_server.py:132 WARNING: No NameResolverProviders found via ServiceLoader, including for DNS. This is probably due to a broken build. If using ProGuard, check your configuration
INFO apache_beam.utils.subprocess_server:subprocess_server.py:132 Aug 15, 2022 11:35:37 PM org.apache.beam.sdk.extensions.sql.zetasql.ZetaSQLQueryPlanner convertToBeamRelInternal
INFO apache_beam.utils.subprocess_server:subprocess_server.py:132 INFO: BEAMPlan>
INFO apache_beam.utils.subprocess_server:subprocess_server.py:132 BeamZetaSqlCalcRel(expr#0=[{inputs}], expr#1=[1:BIGINT], expr#2=['foo':VARCHAR], expr#3=[3.1400000000000001243E0:DOUBLE], int=[$t1], str=[$t2], flt=[$t3])
INFO apache_beam.utils.subprocess_server:subprocess_server.py:132 BeamValuesRel(tuples=[[{ 0 }]])
INFO apache_beam.utils.subprocess_server:subprocess_server.py:132
INFO root:environments.py:376 Default Python SDK image for environment is apache/beam_python3.7_sdk:2.42.0.dev
INFO root:environments.py:299 No image given, using default Python SDK image
INFO root:environments.py:376 Default Python SDK image for environment is apache/beam_python3.7_sdk:2.42.0.dev
INFO root:environments.py:304 Python SDK container image set to "apache/beam_python3.7_sdk:2.42.0.dev" for Docker environment
INFO apache_beam.runners.portability.fn_api_runner.translations:translations.py:714 ==================== <function pack_combiners at 0x7f831f564e60> ====================
INFO apache_beam.runners.portability.fn_api_runner.translations:translations.py:714 ==================== <function lift_combiners at 0x7f831f564ef0> ====================
INFO apache_beam.runners.portability.fn_api_runner.translations:translations.py:714 ==================== <function sort_stages at 0x7f831f565680> ====================
INFO apache_beam.runners.portability.portable_runner:portable_runner.py:583 Job state changed to STOPPED
INFO apache_beam.runners.portability.portable_runner:portable_runner.py:583 Job state changed to STARTING
INFO apache_beam.runners.portability.portable_runner:portable_runner.py:583 Job state changed to RUNNING
INFO root:portable_runner.py:577 Default Python SDK image for environment is apache/beam_python3.7_sdk:2.42.0.dev
INFO root:portable_runner.py:577 ==================== <function annotate_downstream_side_inputs at 0x7fd4f7051050> ====================
INFO root:portable_runner.py:577 ==================== <function fix_side_input_pcoll_coders at 0x7fd4f7051170> ====================
INFO root:portable_runner.py:577 ==================== <function pack_combiners at 0x7fd4f7051680> ====================
INFO root:portable_runner.py:577 ==================== <function lift_combiners at 0x7fd4f7051710> ====================
INFO root:portable_runner.py:577 ==================== <function expand_sdf at 0x7fd4f70518c0> ====================
INFO root:portable_runner.py:577 ==================== <function expand_gbk at 0x7fd4f7051950> ====================
INFO root:portable_runner.py:577 ==================== <function sink_flattens at 0x7fd4f7051a70> ====================
INFO root:portable_runner.py:577 ==================== <function greedily_fuse at 0x7fd4f7051b00> ====================
INFO root:portable_runner.py:577 ==================== <function read_to_impulse at 0x7fd4f7051b90> ====================
INFO root:portable_runner.py:577 ==================== <function impulse_to_input at 0x7fd4f7051c20> ====================
INFO root:portable_runner.py:577 ==================== <function sort_stages at 0x7fd4f7051e60> ====================
INFO root:portable_runner.py:577 ==================== <function add_impulse_to_dangling_transforms at 0x7fd4f7051f80> ====================
INFO root:portable_runner.py:577 ==================== <function setup_timer_mapping at 0x7fd4f7051dd0> ====================
INFO root:portable_runner.py:577 ==================== <function populate_data_channel_coders at 0x7fd4f7051ef0> ====================
INFO root:portable_runner.py:577 starting control server on port 37807
INFO root:portable_runner.py:577 starting data server on port 45271
INFO root:portable_runner.py:577 starting state server on port 39641
INFO root:portable_runner.py:577 starting logging server on port 46133
INFO root:portable_runner.py:577 Created Worker handler <apache_beam.runners.portability.fn_api_runner.worker_handlers.DockerSdkWorkerHandler object at 0x7fd4f4f83bd0> for environment external_9beam:env:docker:v1 (beam:env:docker:v1, b'\n apache/beam_java8_sdk:2.42.0.dev')
INFO root:portable_runner.py:577 Attempting to pull image apache/beam_java8_sdk:2.42.0.dev
INFO root:portable_runner.py:577 Unable to pull image apache/beam_java8_sdk:2.42.0.dev, defaulting to local image if it exists
INFO root:portable_runner.py:577 Waiting for docker to start up. Current status is running
INFO root:portable_runner.py:577 Docker container is running. container_id = b'2fc11f2443133ddfa8f87160a00c67b24aab5cc467e4274ecc8476722954b48b', worker_id = worker_85
INFO root:portable_runner.py:577 Created Worker handler <apache_beam.runners.portability.fn_api_runner.worker_handlers.DockerSdkWorkerHandler object at 0x7fd4f5687190> for environment ref_Environment_default_environment_2 (beam:env:docker:v1, b'\n$apache/beam_python3.7_sdk:2.42.0.dev')
INFO root:portable_runner.py:577 Attempting to pull image apache/beam_python3.7_sdk:2.42.0.dev
INFO root:portable_runner.py:577 Unable to pull image apache/beam_python3.7_sdk:2.42.0.dev, defaulting to local image if it exists
INFO root:portable_runner.py:577 Waiting for docker to start up. Current status is running
INFO root:portable_runner.py:577 Docker container is running. container_id = b'fde9e1900f1376f9ea9105fee9a4f41f047e37323813d5ce064e148d77e6edef', worker_id = worker_86
INFO root:portable_runner.py:577 Completed job in 12.191556453704834 seconds with state DONE.
INFO apache_beam.runners.portability.portable_runner:portable_runner.py:583 Job state changed to DONE
PASSED [100%]
=============================== warnings summary ===============================
../../build/gradleenv/1922375555/lib/python3.7/site-packages/hdfs/config.py:15
<https://ci-beam.apache.org/job/beam_PostCommit_XVR_Direct/ws/src/build/gradleenv/1922375555/lib/python3.7/site-packages/hdfs/config.py>:15: DeprecationWarning: the imp module is deprecated in favour of importlib; see the module's documentation for alternative uses
from imp import load_source
-- Docs: https://docs.pytest.org/en/stable/how-to/capture-warnings.html
- generated xml file: <https://ci-beam.apache.org/job/beam_PostCommit_XVR_Direct/ws/src/sdks/python/pytest_xlangSqlValidateRunner.xml> -
===== 9 passed, 2 skipped, 6541 deselected, 1 warning in 233.97s (0:03:53) =====
> Task :sdks:python:test-suites:direct:xlang:validatesCrossLanguageRunnerCleanup
Stopping expansion service pid: 3563079.
Stopping expansion service pid: 3563080.
> Task :sdks:python:test-suites:direct:xlang:fnApiJobServerCleanup
Killing process at 3560342
FAILURE: Build failed with an exception.
* What went wrong:
Execution failed for task ':sdks:python:test-suites:direct:xlang:validatesCrossLanguageRunnerJavaUsingPython'.
> There were failing tests. See the report at: file://<https://ci-beam.apache.org/job/beam_PostCommit_XVR_Direct/ws/src/sdks/python/test-suites/direct/xlang/build/reports/tests/validatesCrossLanguageRunnerJavaUsingPython/index.html>
* Try:
> Run with --stacktrace option to get the stack trace.
> Run with --info or --debug option to get more log output.
> Run with --scan to get full insights.
* Get more help at https://help.gradle.org
Deprecated Gradle features were used in this build, making it incompatible with Gradle 8.0.
You can use '--warning-mode all' to show the individual deprecation warnings and determine if they come from your own scripts or plugins.
See https://docs.gradle.org/7.4/userguide/command_line_interface.html#sec:command_line_warnings
Execution optimizations have been disabled for 1 invalid unit(s) of work during this build to ensure correctness.
Please consult deprecation warnings for more details.
BUILD FAILED in 25m 35s
247 actionable tasks: 165 executed, 70 from cache, 12 up-to-date
Publishing build scan...
https://gradle.com/s/ruuttidwlitus
Build step 'Invoke Gradle script' changed build result to FAILURE
Build step 'Invoke Gradle script' marked build as failure
---------------------------------------------------------------------
To unsubscribe, e-mail: builds-unsubscribe@beam.apache.org
For additional commands, e-mail: builds-help@beam.apache.org
Build failed in Jenkins: beam_PostCommit_XVR_Direct #3019
Posted by Apache Jenkins Server <je...@builds.apache.org>.
See <https://ci-beam.apache.org/job/beam_PostCommit_XVR_Direct/3019/display/redirect?page=changes>
Changes:
[noreply] Attempt to fix SpannerIO test flakes (#22688)
[noreply] Add a dataflow override for runnerv1 to still use SDF on runnerv2.
[noreply] [Playground] Result filter bug (#22215)
[noreply] [Website] update case-studies layout (#22342)
------------------------------------------
[...truncated 1.25 MB...]
>
>
>
coders: <
key: "NafxJIDixVVarIntCoder"
value: <
spec: <
urn: "beam:coders:javasdk:0.1"
payload: "\202SNAPPY\000\000\000\000\001\000\000\000\001\000\000\000\210\330\001\350\254\355\000\005sr\000&org.apache.beam.sdk.coders.VarIntCoder\300K2\332\251KVh\002\000\000xrr5\000\024Atomic\0055 \307\354\265\314\205tPF\002\0055\000*jj\000$Structured\0059\034s\277\022\016\325\3246\021\t9\000 j9\000\005/0C\335\325\211\256\274~\370\002\000\000xp"
>
>
>
coders: <
key: "NafxJIDixVVoidCoder"
value: <
spec: <
urn: "beam:coders:javasdk:0.1"
payload: "\202SNAPPY\000\000\000\000\001\000\000\000\001\000\000\000\210\326\001\350\254\355\000\005sr\000$org.apache.beam.sdk.coders.VoidCoder\271\277U\233\350\r\257U\002\000\000xr\000&j3\000\024Atomic\0055 \307\354\265\314\205tPF\002\0055\000*j5\000$Structured\0059\034s\277\022\016\325\3246\021\t9\000 j9\000\005/0C\335\325\211\256\274~\370\002\000\000xp"
>
>
>
coders: <
key: "c0"
value: <
spec: <
urn: "beam:coder:bytes:v1"
>
>
>
coders: <
key: "c1"
value: <
spec: <
urn: "beam:coder:global_window:v1"
>
>
>
coders: <
key: "c2"
value: <
spec: <
urn: "beam:coder:row:v1"
payload: "\n\r\n\007role_id\032\002\020\003\022$abc5e222-ab8f-4f6f-800a-a58bb0f45675"
>
>
>
environments: <
key: "NafxJIDixVbeam:env:docker:v1"
value: <
urn: "beam:env:docker:v1"
payload: "\n apache/beam_java8_sdk:2.42.0.dev"
capabilities: "beam:coder:bytes:v1"
capabilities: "beam:coder:bool:v1"
capabilities: "beam:coder:varint:v1"
capabilities: "beam:coder:string_utf8:v1"
capabilities: "beam:coder:iterable:v1"
capabilities: "beam:coder:timer:v1"
capabilities: "beam:coder:kv:v1"
capabilities: "beam:coder:length_prefix:v1"
capabilities: "beam:coder:global_window:v1"
capabilities: "beam:coder:interval_window:v1"
capabilities: "beam:coder:custom_window:v1"
capabilities: "beam:coder:windowed_value:v1"
capabilities: "beam:coder:double:v1"
capabilities: "beam:coder:row:v1"
capabilities: "beam:coder:param_windowed_value:v1"
capabilities: "beam:coder:state_backed_iterable:v1"
capabilities: "beam:coder:sharded_key:v1"
capabilities: "beam:coder:nullable:v1"
capabilities: "beam:protocol:multi_core_bundle_processing:v1"
capabilities: "beam:protocol:progress_reporting:v1"
capabilities: "beam:protocol:harness_monitoring_infos:v1"
capabilities: "beam:protocol:control_request_elements_embedding:v1"
capabilities: "beam:protocol:state_caching:v1"
capabilities: "beam:version:sdk_base:apache/beam_java8_sdk:2.42.0.dev"
capabilities: "beam:transform:sdf_truncate_sized_restrictions:v1"
capabilities: "beam:transform:to_string:v1"
dependencies: <
type_urn: "beam:artifact:type:file:v1"
type_payload: "\nL/tmp/artifacts/icedtea-sound-CGRxIE9edPHnbxQhM-L5mp8h21H-ySB79uQtSquPV_Q.jar\022@086471204f5e74f1e76f142133e2f99a9f21db51fec9207bf6e42d4aab8f57f4"
role_urn: "beam:artifact:role:staging_to:v1"
role_payload: "\n=icedtea-sound-CGRxIE9edPHnbxQhM-L5mp8h21H-ySB79uQtSquPV_Q.jar"
>
dependencies: <
type_urn: "beam:artifact:type:file:v1"
type_payload: "\nF/tmp/artifacts/jaccess-FBI0Bb27lF3oEBieWAi7SP8X1zBR8k4BJQOVpsoK9a0.jar\022@14123405bdbb945de810189e5808bb48ff17d73051f24e01250395a6ca0af5ad"
role_urn: "beam:artifact:role:staging_to:v1"
role_payload: "\n7jaccess-FBI0Bb27lF3oEBieWAi7SP8X1zBR8k4BJQOVpsoK9a0.jar"
>
dependencies: <
type_urn: "beam:artifact:type:file:v1"
type_payload: "\nI/tmp/artifacts/localedata-kJ2mc8rBH5-IklhfR1XzNotlIQ_mnVMA-pgaXv2r8Ag.jar\022@909da673cac11f9f8892585f4755f3368b65210fe69d5300fa981a5efdabf008"
role_urn: "beam:artifact:role:staging_to:v1"
role_payload: "\n:localedata-kJ2mc8rBH5-IklhfR1XzNotlIQ_mnVMA-pgaXv2r8Ag.jar"
>
dependencies: <
type_urn: "beam:artifact:type:file:v1"
type_payload: "\nF/tmp/artifacts/nashorn-B0CAb3QpJET_6VsT3hcC_89VtvhV616H8N2bHAIaqWo.jar\022@0740806f74292444ffe95b13de1702ffcf55b6f855eb5e87f0dd9b1c021aa96a"
role_urn: "beam:artifact:role:staging_to:v1"
role_payload: "\n7nashorn-B0CAb3QpJET_6VsT3hcC_89VtvhV616H8N2bHAIaqWo.jar"
>
dependencies: <
type_urn: "beam:artifact:type:file:v1"
type_payload: "\nG/tmp/artifacts/cldrdata-gclqV9lOGqQOKesG-a6TAUTGEYlyIDqpyd4M_k7gtWo.jar\022@81c96a57d94e1aa40e29eb06f9ae930144c6118972203aa9c9de0cfe4ee0b56a"
role_urn: "beam:artifact:role:staging_to:v1"
role_payload: "\n8cldrdata-gclqV9lOGqQOKesG-a6TAUTGEYlyIDqpyd4M_k7gtWo.jar"
>
dependencies: <
type_urn: "beam:artifact:type:file:v1"
type_payload: "\nD/tmp/artifacts/dnsns-byzoQxdXengTvA5IlbH9gSIzfhNQElRYltuMJN0vjcc.jar\022@6f2ce84317577a7813bc0e4895b1fd8122337e135012545896db8c24dd2f8dc7"
role_urn: "beam:artifact:role:staging_to:v1"
role_payload: "\n5dnsns-byzoQxdXengTvA5IlbH9gSIzfhNQElRYltuMJN0vjcc.jar"
>
dependencies: <
type_urn: "beam:artifact:type:file:v1"
type_payload: "\n\203\001/tmp/artifacts/beam-sdks-java-extensions-schemaio-expansion-service-2.42.0-SNAPSHOT-zzwHqZGN3wuL-1HwtI-94hEP-XBwpvK21LFz6mZ-W30.jar\022@cf3c07a9918ddf0b8bfb51f0b48fbde2110ff97070a6f2b6d4b173ea667e5b7d"
role_urn: "beam:artifact:role:staging_to:v1"
role_payload: "\ntbeam-sdks-java-extensions-schemaio-expansion-service-2.42.0-SNAPSHOT-zzwHqZGN3wuL-1HwtI-94hEP-XBwpvK21LFz6mZ-W30.jar"
>
>
>
environments: <
key: "go"
value: <
urn: "beam:env:docker:v1"
payload: "\n\026apache/beam_go_sdk:dev"
capabilities: "beam:protocol:progress_reporting:v1"
capabilities: "beam:protocol:multi_core_bundle_processing:v1"
capabilities: "beam:transform:sdf_truncate_sized_restrictions:v1"
capabilities: "beam:protocol:worker_status:v1"
capabilities: "beam:protocol:monitoring_info_short_ids:v1"
capabilities: "beam:version:sdk_base:go"
capabilities: "beam:coder:bytes:v1"
capabilities: "beam:coder:bool:v1"
capabilities: "beam:coder:varint:v1"
capabilities: "beam:coder:double:v1"
capabilities: "beam:coder:string_utf8:v1"
capabilities: "beam:coder:length_prefix:v1"
capabilities: "beam:coder:kv:v1"
capabilities: "beam:coder:iterable:v1"
capabilities: "beam:coder:state_backed_iterable:v1"
capabilities: "beam:coder:windowed_value:v1"
capabilities: "beam:coder:global_window:v1"
capabilities: "beam:coder:interval_window:v1"
capabilities: "beam:coder:row:v1"
capabilities: "beam:coder:nullable:v1"
dependencies: <
type_urn: "beam:artifact:type:file:v1"
role_urn: "beam:artifact:role:go_worker_binary:v1"
>
>
>
>
root_transform_ids: "e2"
root_transform_ids: "s1"
root_transform_ids: "e3"
root_transform_ids: "s3"
requirements: "beam:requirement:pardo:splittable_dofn:v1"
2022/08/15 17:22:06 Cross-compiling <https://ci-beam.apache.org/job/beam_PostCommit_XVR_Direct/ws/src/sdks/go/test/integration/io/xlang/jdbc/jdbc_test.go> as /tmp/worker-4-1660584126946484084
2022/08/15 17:22:09 Prepared job with id: go-testjdbcio_postgresreadwrite-875-2b5ebf31-994b-49ba-bf43-40220e33eb94 and staging token: go-testjdbcio_postgresreadwrite-875-2b5ebf31-994b-49ba-bf43-40220e33eb94
2022/08/15 17:22:09 Staged binary artifact with token:
2022/08/15 17:22:09 Submitted job: go-testjdbcio_postgresreadwrite-875-2b5ebf31-994b-49ba-bf43-40220e33eb94
2022/08/15 17:22:09 2022-08-15 17:22:09. (1): Default Python SDK image for environment is apache/beam_python3.7_sdk:2.42.0.dev
2022/08/15 17:22:09 2022-08-15 17:22:09. (2): ==================== <function annotate_downstream_side_inputs at 0x7f49c45b2050> ====================
2022/08/15 17:22:09 2022-08-15 17:22:09. (3): ==================== <function fix_side_input_pcoll_coders at 0x7f49c45b2170> ====================
2022/08/15 17:22:09 2022-08-15 17:22:09. (4): ==================== <function pack_combiners at 0x7f49c45b2680> ====================
2022/08/15 17:22:09 2022-08-15 17:22:09. (5): ==================== <function lift_combiners at 0x7f49c45b2710> ====================
2022/08/15 17:22:09 2022-08-15 17:22:09. (6): ==================== <function expand_sdf at 0x7f49c45b28c0> ====================
2022/08/15 17:22:09 2022-08-15 17:22:09. (7): ==================== <function expand_gbk at 0x7f49c45b2950> ====================
2022/08/15 17:22:09 2022-08-15 17:22:09. (8): ==================== <function sink_flattens at 0x7f49c45b2a70> ====================
2022/08/15 17:22:09 2022-08-15 17:22:09. (9): ==================== <function greedily_fuse at 0x7f49c45b2b00> ====================
2022/08/15 17:22:09 Job state: STOPPED
2022/08/15 17:22:09 Job state: STARTING
2022/08/15 17:22:09 Job state: RUNNING
2022/08/15 17:22:09 2022-08-15 17:22:09. (10): ==================== <function read_to_impulse at 0x7f49c45b2b90> ====================
2022/08/15 17:22:09 2022-08-15 17:22:09. (11): ==================== <function impulse_to_input at 0x7f49c45b2c20> ====================
2022/08/15 17:22:09 2022-08-15 17:22:09. (12): ==================== <function sort_stages at 0x7f49c45b2e60> ====================
2022/08/15 17:22:09 2022-08-15 17:22:09. (13): ==================== <function add_impulse_to_dangling_transforms at 0x7f49c45b2f80> ====================
2022/08/15 17:22:09 2022-08-15 17:22:09. (14): ==================== <function setup_timer_mapping at 0x7f49c45b2dd0> ====================
2022/08/15 17:22:09 2022-08-15 17:22:09. (15): ==================== <function populate_data_channel_coders at 0x7f49c45b2ef0> ====================
2022/08/15 17:22:09 2022-08-15 17:22:09. (16): starting control server on port 35539
2022/08/15 17:22:09 2022-08-15 17:22:09. (17): starting data server on port 41725
2022/08/15 17:22:09 2022-08-15 17:22:09. (18): starting state server on port 43631
2022/08/15 17:22:09 2022-08-15 17:22:09. (19): starting logging server on port 44855
2022/08/15 17:22:09 2022-08-15 17:22:09. (20): Created Worker handler <apache_beam.runners.portability.fn_api_runner.worker_handlers.DockerSdkWorkerHandler object at 0x7f49b4747bd0> for environment go (beam:env:docker:v1, b'\n\x16apache/beam_go_sdk:dev')
2022/08/15 17:22:09 2022-08-15 17:22:09. (21): Attempting to pull image apache/beam_go_sdk:dev
2022/08/15 17:22:09 2022-08-15 17:22:09. (22): Unable to pull image apache/beam_go_sdk:dev, defaulting to local image if it exists
2022/08/15 17:22:11 2022-08-15 17:22:11. (23): Waiting for docker to start up. Current status is running
2022/08/15 17:22:11 2022-08-15 17:22:11. (24): Docker container is running. container_id = b'f237d1f737e0b91cc90e11aa4b0c2a767024f2d870f4c4645476d14bca2b4ce9', worker_id = worker_16
2022/08/15 17:22:12 2022-08-15 17:22:12. (25): Created Worker handler <apache_beam.runners.portability.fn_api_runner.worker_handlers.DockerSdkWorkerHandler object at 0x7f49b470cb50> for environment NafxJIDixVbeam:env:docker:v1 (beam:env:docker:v1, b'\n apache/beam_java8_sdk:2.42.0.dev')
2022/08/15 17:22:16 2022-08-15 17:22:16. (26): Attempting to pull image apache/beam_java8_sdk:2.42.0.dev
2022/08/15 17:22:16 2022-08-15 17:22:16. (27): Unable to pull image apache/beam_java8_sdk:2.42.0.dev, defaulting to local image if it exists
2022/08/15 17:22:17 2022-08-15 17:22:17. (28): Waiting for docker to start up. Current status is running
2022/08/15 17:22:17 2022-08-15 17:22:17. (29): Docker container is running. container_id = b'5869d108b48dd95da28eab6c84ad139b637d78fd36e47e6cc9e8179655ba7fbb', worker_id = worker_18
2022/08/15 17:22:24 2022-08-15 17:22:24. (30): Completed job in 14.749128818511963 seconds with state DONE.
2022/08/15 17:22:24 Job state: DONE
--- PASS: TestJDBCIO_PostgresReadWrite (36.69s)
PASS
ok github.com/apache/beam/sdks/v2/go/test/integration/io/xlang/jdbc 88.812s
=== RUN TestKafkaIO_BasicReadWrite
integration.go:264: Test TestKafkaIO_BasicReadWrite is currently filtered for runner portable
--- SKIP: TestKafkaIO_BasicReadWrite (0.00s)
PASS
ok github.com/apache/beam/sdks/v2/go/test/integration/io/xlang/kafka 6.049s
> Task :sdks:python:test-suites:direct:xlang:validatesCrossLanguageRunnerJavaUsingPython
org.apache.beam.runners.core.construction.ValidateRunnerXlangTest$SingleInputOutputTest > test FAILED
java.lang.RuntimeException at ValidateRunnerXlangTest.java:242
java.lang.NullPointerException at Preconditions.java:980
14 tests completed, 1 failed
> Task :sdks:python:test-suites:direct:xlang:validatesCrossLanguageRunnerJavaUsingPython FAILED
> Task :sdks:python:test-suites:direct:xlang:validatesCrossLanguageRunnerPythonUsingJava
> Task :sdks:python:test-suites:direct:xlang:validatesCrossLanguageRunnerPythonUsingSql
> Task :sdks:python:test-suites:direct:xlang:validatesCrossLanguageRunnerCleanup
> Task :sdks:python:test-suites:direct:xlang:fnApiJobServerCleanup
FAILURE: Build failed with an exception.
* What went wrong:
Execution failed for task ':sdks:python:test-suites:direct:xlang:validatesCrossLanguageRunnerJavaUsingPython'.
> There were failing tests. See the report at: file://<https://ci-beam.apache.org/job/beam_PostCommit_XVR_Direct/ws/src/sdks/python/test-suites/direct/xlang/build/reports/tests/validatesCrossLanguageRunnerJavaUsingPython/index.html>
* Try:
> Run with --stacktrace option to get the stack trace.
> Run with --info or --debug option to get more log output.
> Run with --scan to get full insights.
* Get more help at https://help.gradle.org
Deprecated Gradle features were used in this build, making it incompatible with Gradle 8.0.
You can use '--warning-mode all' to show the individual deprecation warnings and determine if they come from your own scripts or plugins.
See https://docs.gradle.org/7.4/userguide/command_line_interface.html#sec:command_line_warnings
Execution optimizations have been disabled for 1 invalid unit(s) of work during this build to ensure correctness.
Please consult deprecation warnings for more details.
BUILD FAILED in 26m 2s
247 actionable tasks: 166 executed, 69 from cache, 12 up-to-date
Publishing build scan...
https://gradle.com/s/5lhoftmgomxrm
Build step 'Invoke Gradle script' changed build result to FAILURE
Build step 'Invoke Gradle script' marked build as failure
---------------------------------------------------------------------
To unsubscribe, e-mail: builds-unsubscribe@beam.apache.org
For additional commands, e-mail: builds-help@beam.apache.org
Build failed in Jenkins: beam_PostCommit_XVR_Direct #3018
Posted by Apache Jenkins Server <je...@builds.apache.org>.
See <https://ci-beam.apache.org/job/beam_PostCommit_XVR_Direct/3018/display/redirect>
Changes:
------------------------------------------
[...truncated 1.42 MB...]
INFO root:environments.py:304 Python SDK container image set to "apache/beam_python3.7_sdk:2.42.0.dev" for Docker environment
INFO apache_beam.runners.portability.fn_api_runner.translations:translations.py:714 ==================== <function pack_combiners at 0x7f0169810e60> ====================
INFO apache_beam.runners.portability.fn_api_runner.translations:translations.py:714 ==================== <function lift_combiners at 0x7f0169810ef0> ====================
INFO apache_beam.runners.portability.fn_api_runner.translations:translations.py:714 ==================== <function sort_stages at 0x7f0169812680> ====================
INFO apache_beam.runners.portability.portable_runner:portable_runner.py:583 Job state changed to STOPPED
INFO apache_beam.runners.portability.portable_runner:portable_runner.py:583 Job state changed to STARTING
INFO apache_beam.runners.portability.portable_runner:portable_runner.py:583 Job state changed to RUNNING
INFO root:portable_runner.py:577 Default Python SDK image for environment is apache/beam_python3.7_sdk:2.42.0.dev
INFO root:portable_runner.py:577 ==================== <function annotate_downstream_side_inputs at 0x7f3fcbbbe050> ====================
INFO root:portable_runner.py:577 ==================== <function fix_side_input_pcoll_coders at 0x7f3fcbbbe170> ====================
INFO root:portable_runner.py:577 ==================== <function pack_combiners at 0x7f3fcbbbe680> ====================
INFO root:portable_runner.py:577 ==================== <function lift_combiners at 0x7f3fcbbbe710> ====================
INFO root:portable_runner.py:577 ==================== <function expand_sdf at 0x7f3fcbbbe8c0> ====================
INFO root:portable_runner.py:577 ==================== <function expand_gbk at 0x7f3fcbbbe950> ====================
INFO root:portable_runner.py:577 ==================== <function sink_flattens at 0x7f3fcbbbea70> ====================
INFO root:portable_runner.py:577 ==================== <function greedily_fuse at 0x7f3fcbbbeb00> ====================
INFO root:portable_runner.py:577 ==================== <function read_to_impulse at 0x7f3fcbbbeb90> ====================
INFO root:portable_runner.py:577 ==================== <function impulse_to_input at 0x7f3fcbbbec20> ====================
INFO root:portable_runner.py:577 ==================== <function sort_stages at 0x7f3fcbbbee60> ====================
INFO root:portable_runner.py:577 ==================== <function add_impulse_to_dangling_transforms at 0x7f3fcbbbef80> ====================
INFO root:portable_runner.py:577 ==================== <function setup_timer_mapping at 0x7f3fcbbbedd0> ====================
INFO root:portable_runner.py:577 ==================== <function populate_data_channel_coders at 0x7f3fcbbbeef0> ====================
INFO root:portable_runner.py:577 starting control server on port 33205
INFO root:portable_runner.py:577 starting data server on port 36103
INFO root:portable_runner.py:577 starting state server on port 41189
INFO root:portable_runner.py:577 starting logging server on port 43259
INFO root:portable_runner.py:577 Created Worker handler <apache_beam.runners.portability.fn_api_runner.worker_handlers.DockerSdkWorkerHandler object at 0x7f3fe2805790> for environment ref_Environment_default_environment_2 (beam:env:docker:v1, b'\n$apache/beam_python3.7_sdk:2.42.0.dev')
INFO root:portable_runner.py:577 Attempting to pull image apache/beam_python3.7_sdk:2.42.0.dev
INFO root:portable_runner.py:577 Unable to pull image apache/beam_python3.7_sdk:2.42.0.dev, defaulting to local image if it exists
INFO root:portable_runner.py:577 Waiting for docker to start up. Current status is running
INFO root:portable_runner.py:577 Docker container is running. container_id = b'd34e47313caffac4a9602b71a44402e87cf52f5b7c3923ad1dc9cd4cfd52cfd0', worker_id = worker_81
INFO root:portable_runner.py:577 Created Worker handler <apache_beam.runners.portability.fn_api_runner.worker_handlers.DockerSdkWorkerHandler object at 0x7f3fe287fc10> for environment external_7beam:env:docker:v1 (beam:env:docker:v1, b'\n apache/beam_java8_sdk:2.42.0.dev')
INFO root:portable_runner.py:577 Attempting to pull image apache/beam_java8_sdk:2.42.0.dev
INFO root:portable_runner.py:577 Unable to pull image apache/beam_java8_sdk:2.42.0.dev, defaulting to local image if it exists
INFO root:portable_runner.py:577 Waiting for docker to start up. Current status is running
INFO root:portable_runner.py:577 Docker container is running. container_id = b'3c7debb6dc386fe58fe23a242c56a54d13c2f2fd8603d3e3c32ec7a68543b24a', worker_id = worker_82
INFO root:portable_runner.py:577 Completed job in 15.338916301727295 seconds with state DONE.
INFO apache_beam.runners.portability.portable_runner:portable_runner.py:583 Job state changed to DONE
PASSED [ 77%]
apache_beam/transforms/sql_test.py::SqlTransformTest::test_windowing_before_sql
-------------------------------- live log call ---------------------------------
INFO apache_beam.utils.subprocess_server:subprocess_server.py:254 Using pre-built snapshot at <https://ci-beam.apache.org/job/beam_PostCommit_XVR_Direct/ws/src/sdks/java/extensions/sql/expansion-service/build/libs/beam-sdks-java-extensions-sql-expansion-service-2.42.0-SNAPSHOT.jar>
INFO root:external.py:773 Starting a JAR-based expansion service from JAR <https://ci-beam.apache.org/job/beam_PostCommit_XVR_Direct/ws/src/sdks/java/extensions/sql/expansion-service/build/libs/beam-sdks-java-extensions-sql-expansion-service-2.42.0-SNAPSHOT.jar>
INFO apache_beam.utils.subprocess_server:subprocess_server.py:116 Starting service with ['java' '-jar' '<https://ci-beam.apache.org/job/beam_PostCommit_XVR_Direct/ws/src/sdks/java/extensions/sql/expansion-service/build/libs/beam-sdks-java-extensions-sql-expansion-service-2.42.0-SNAPSHOT.jar'> '55743' '--filesToStage=<https://ci-beam.apache.org/job/beam_PostCommit_XVR_Direct/ws/src/sdks/java/extensions/sql/expansion-service/build/libs/beam-sdks-java-extensions-sql-expansion-service-2.42.0-SNAPSHOT.jar']>
INFO apache_beam.utils.subprocess_server:subprocess_server.py:132 Starting expansion service at localhost:55743
INFO apache_beam.utils.subprocess_server:subprocess_server.py:132 Aug 15, 2022 11:35:10 AM org.apache.beam.sdk.expansion.service.ExpansionService loadRegisteredTransforms
INFO apache_beam.utils.subprocess_server:subprocess_server.py:132 INFO: Registering external transforms: [beam:external:java:sql:v1, beam:transform:org.apache.beam:pubsub_read:v1, beam:transform:org.apache.beam:pubsub_write:v1, beam:transform:org.apache.beam:pubsublite_write:v1, beam:transform:org.apache.beam:pubsublite_read:v1, beam:transform:org.apache.beam:spanner_insert:v1, beam:transform:org.apache.beam:spanner_update:v1, beam:transform:org.apache.beam:spanner_replace:v1, beam:transform:org.apache.beam:spanner_insert_or_update:v1, beam:transform:org.apache.beam:spanner_delete:v1, beam:transform:org.apache.beam:spanner_read:v1, beam:transform:org.apache.beam:kafka_read_with_metadata:v1, beam:transform:org.apache.beam:kafka_read_without_metadata:v1, beam:transform:org.apache.beam:kafka_write:v1, beam:external:java:generate_sequence:v1]
INFO apache_beam.utils.subprocess_server:subprocess_server.py:132 beam:external:java:sql:v1: org.apache.beam.sdk.expansion.service.ExpansionService$ExternalTransformRegistrarLoader$1@47eaca72
INFO apache_beam.utils.subprocess_server:subprocess_server.py:132 beam:transform:org.apache.beam:pubsub_read:v1: org.apache.beam.sdk.expansion.service.ExpansionService$ExternalTransformRegistrarLoader$1@55141def
INFO apache_beam.utils.subprocess_server:subprocess_server.py:132 beam:transform:org.apache.beam:pubsub_write:v1: org.apache.beam.sdk.expansion.service.ExpansionService$ExternalTransformRegistrarLoader$1@55182842
INFO apache_beam.utils.subprocess_server:subprocess_server.py:132 beam:transform:org.apache.beam:pubsublite_write:v1: org.apache.beam.sdk.expansion.service.ExpansionService$ExternalTransformRegistrarLoader$1@3270d194
INFO apache_beam.utils.subprocess_server:subprocess_server.py:132 beam:transform:org.apache.beam:pubsublite_read:v1: org.apache.beam.sdk.expansion.service.ExpansionService$ExternalTransformRegistrarLoader$1@235834f2
INFO apache_beam.utils.subprocess_server:subprocess_server.py:132 beam:transform:org.apache.beam:spanner_insert:v1: org.apache.beam.sdk.expansion.service.ExpansionService$ExternalTransformRegistrarLoader$1@5656be13
INFO apache_beam.utils.subprocess_server:subprocess_server.py:132 beam:transform:org.apache.beam:spanner_update:v1: org.apache.beam.sdk.expansion.service.ExpansionService$ExternalTransformRegistrarLoader$1@4218d6a3
INFO apache_beam.utils.subprocess_server:subprocess_server.py:132 beam:transform:org.apache.beam:spanner_replace:v1: org.apache.beam.sdk.expansion.service.ExpansionService$ExternalTransformRegistrarLoader$1@76505305
INFO apache_beam.utils.subprocess_server:subprocess_server.py:132 beam:transform:org.apache.beam:spanner_insert_or_update:v1: org.apache.beam.sdk.expansion.service.ExpansionService$ExternalTransformRegistrarLoader$1@14cd1699
INFO apache_beam.utils.subprocess_server:subprocess_server.py:132 beam:transform:org.apache.beam:spanner_delete:v1: org.apache.beam.sdk.expansion.service.ExpansionService$ExternalTransformRegistrarLoader$1@77888435
INFO apache_beam.utils.subprocess_server:subprocess_server.py:132 beam:transform:org.apache.beam:spanner_read:v1: org.apache.beam.sdk.expansion.service.ExpansionService$ExternalTransformRegistrarLoader$1@73a1e9a9
INFO apache_beam.utils.subprocess_server:subprocess_server.py:132 beam:transform:org.apache.beam:kafka_read_with_metadata:v1: org.apache.beam.sdk.expansion.service.ExpansionService$ExternalTransformRegistrarLoader$1@71d44a3
INFO apache_beam.utils.subprocess_server:subprocess_server.py:132 beam:transform:org.apache.beam:kafka_read_without_metadata:v1: org.apache.beam.sdk.expansion.service.ExpansionService$ExternalTransformRegistrarLoader$1@7b98f307
INFO apache_beam.utils.subprocess_server:subprocess_server.py:132 beam:transform:org.apache.beam:kafka_write:v1: org.apache.beam.sdk.expansion.service.ExpansionService$ExternalTransformRegistrarLoader$1@4802796d
INFO apache_beam.utils.subprocess_server:subprocess_server.py:132 beam:external:java:generate_sequence:v1: org.apache.beam.sdk.expansion.service.ExpansionService$ExternalTransformRegistrarLoader$1@34123d65
INFO apache_beam.utils.subprocess_server:subprocess_server.py:132 Aug 15, 2022 11:35:11 AM org.apache.beam.sdk.expansion.service.ExpansionService expand
INFO apache_beam.utils.subprocess_server:subprocess_server.py:132 INFO: Expanding 'SqlTransform(beam:external:java:sql:v1)' with URN 'beam:external:java:sql:v1'
INFO apache_beam.utils.subprocess_server:subprocess_server.py:132 Aug 15, 2022 11:35:11 AM org.apache.beam.sdk.expansion.service.ExpansionService$ExternalTransformRegistrarLoader payloadToConfig
INFO apache_beam.utils.subprocess_server:subprocess_server.py:132 WARNING: Configuration class 'org.apache.beam.sdk.extensions.sql.expansion.ExternalSqlTransformRegistrar$Configuration' has no schema registered. Attempting to construct with setter approach.
INFO apache_beam.utils.subprocess_server:subprocess_server.py:132 Aug 15, 2022 11:35:11 AM org.apache.beam.sdk.expansion.service.ExpansionService$ExternalTransformRegistrarLoader payloadToConfig
INFO apache_beam.utils.subprocess_server:subprocess_server.py:132 WARNING: Configuration class 'org.apache.beam.sdk.extensions.sql.expansion.ExternalSqlTransformRegistrar$Configuration' has no schema registered. Attempting to construct with setter approach.
INFO apache_beam.utils.subprocess_server:subprocess_server.py:132 Aug 15, 2022 11:35:13 AM org.apache.beam.sdk.extensions.sql.impl.CalciteQueryPlanner convertToBeamRel
INFO apache_beam.utils.subprocess_server:subprocess_server.py:132 INFO: SQL:
INFO apache_beam.utils.subprocess_server:subprocess_server.py:132 SELECT COUNT(*) AS `count`
INFO apache_beam.utils.subprocess_server:subprocess_server.py:132 FROM `beam`.`PCOLLECTION` AS `PCOLLECTION`
INFO apache_beam.utils.subprocess_server:subprocess_server.py:132 Aug 15, 2022 11:35:13 AM org.apache.beam.sdk.extensions.sql.impl.CalciteQueryPlanner convertToBeamRel
INFO apache_beam.utils.subprocess_server:subprocess_server.py:132 INFO: SQLPlan>
INFO apache_beam.utils.subprocess_server:subprocess_server.py:132 LogicalAggregate(group=[{}], count=[COUNT()])
INFO apache_beam.utils.subprocess_server:subprocess_server.py:132 BeamIOSourceRel(table=[[beam, PCOLLECTION]])
INFO apache_beam.utils.subprocess_server:subprocess_server.py:132
INFO apache_beam.utils.subprocess_server:subprocess_server.py:132 Aug 15, 2022 11:35:13 AM org.apache.beam.sdk.extensions.sql.impl.CalciteQueryPlanner convertToBeamRel
INFO apache_beam.utils.subprocess_server:subprocess_server.py:132 INFO: BEAMPlan>
INFO apache_beam.utils.subprocess_server:subprocess_server.py:132 BeamAggregationRel(group=[{}], count=[COUNT()])
INFO apache_beam.utils.subprocess_server:subprocess_server.py:132 BeamIOSourceRel(table=[[beam, PCOLLECTION]])
INFO apache_beam.utils.subprocess_server:subprocess_server.py:132
INFO root:environments.py:376 Default Python SDK image for environment is apache/beam_python3.7_sdk:2.42.0.dev
INFO root:environments.py:299 No image given, using default Python SDK image
INFO root:environments.py:376 Default Python SDK image for environment is apache/beam_python3.7_sdk:2.42.0.dev
INFO root:environments.py:304 Python SDK container image set to "apache/beam_python3.7_sdk:2.42.0.dev" for Docker environment
INFO apache_beam.runners.portability.fn_api_runner.translations:translations.py:714 ==================== <function pack_combiners at 0x7f0169810e60> ====================
INFO apache_beam.runners.portability.fn_api_runner.translations:translations.py:714 ==================== <function lift_combiners at 0x7f0169810ef0> ====================
INFO apache_beam.runners.portability.fn_api_runner.translations:translations.py:714 ==================== <function sort_stages at 0x7f0169812680> ====================
INFO apache_beam.runners.portability.portable_runner:portable_runner.py:583 Job state changed to STOPPED
INFO apache_beam.runners.portability.portable_runner:portable_runner.py:583 Job state changed to STARTING
INFO apache_beam.runners.portability.portable_runner:portable_runner.py:583 Job state changed to RUNNING
INFO root:portable_runner.py:577 Default Python SDK image for environment is apache/beam_python3.7_sdk:2.42.0.dev
INFO root:portable_runner.py:577 ==================== <function annotate_downstream_side_inputs at 0x7f3fcbbbe050> ====================
INFO root:portable_runner.py:577 ==================== <function fix_side_input_pcoll_coders at 0x7f3fcbbbe170> ====================
INFO root:portable_runner.py:577 ==================== <function pack_combiners at 0x7f3fcbbbe680> ====================
INFO root:portable_runner.py:577 ==================== <function lift_combiners at 0x7f3fcbbbe710> ====================
INFO root:portable_runner.py:577 ==================== <function expand_sdf at 0x7f3fcbbbe8c0> ====================
INFO root:portable_runner.py:577 ==================== <function expand_gbk at 0x7f3fcbbbe950> ====================
INFO root:portable_runner.py:577 ==================== <function sink_flattens at 0x7f3fcbbbea70> ====================
INFO root:portable_runner.py:577 ==================== <function greedily_fuse at 0x7f3fcbbbeb00> ====================
INFO root:portable_runner.py:577 ==================== <function read_to_impulse at 0x7f3fcbbbeb90> ====================
INFO root:portable_runner.py:577 ==================== <function impulse_to_input at 0x7f3fcbbbec20> ====================
INFO root:portable_runner.py:577 ==================== <function sort_stages at 0x7f3fcbbbee60> ====================
INFO root:portable_runner.py:577 ==================== <function add_impulse_to_dangling_transforms at 0x7f3fcbbbef80> ====================
INFO root:portable_runner.py:577 ==================== <function setup_timer_mapping at 0x7f3fcbbbedd0> ====================
INFO root:portable_runner.py:577 ==================== <function populate_data_channel_coders at 0x7f3fcbbbeef0> ====================
INFO root:portable_runner.py:577 starting control server on port 40913
INFO root:portable_runner.py:577 starting data server on port 44189
INFO root:portable_runner.py:577 starting state server on port 35697
INFO root:portable_runner.py:577 starting logging server on port 35203
INFO root:portable_runner.py:577 Created Worker handler <apache_beam.runners.portability.fn_api_runner.worker_handlers.DockerSdkWorkerHandler object at 0x7f3fe2805d90> for environment ref_Environment_default_environment_2 (beam:env:docker:v1, b'\n$apache/beam_python3.7_sdk:2.42.0.dev')
INFO root:portable_runner.py:577 Attempting to pull image apache/beam_python3.7_sdk:2.42.0.dev
INFO root:portable_runner.py:577 Unable to pull image apache/beam_python3.7_sdk:2.42.0.dev, defaulting to local image if it exists
INFO root:portable_runner.py:577 Waiting for docker to start up. Current status is running
INFO root:portable_runner.py:577 Docker container is running. container_id = b'0f6ba8d1af9a6c3cb9333e0ed5737b07a3c28e464616bec99822fb518deb70ae', worker_id = worker_83
INFO root:portable_runner.py:577 Created Worker handler <apache_beam.runners.portability.fn_api_runner.worker_handlers.DockerSdkWorkerHandler object at 0x7f3fe28a8950> for environment external_8beam:env:docker:v1 (beam:env:docker:v1, b'\n apache/beam_java8_sdk:2.42.0.dev')
INFO root:portable_runner.py:577 Attempting to pull image apache/beam_java8_sdk:2.42.0.dev
INFO root:portable_runner.py:577 Unable to pull image apache/beam_java8_sdk:2.42.0.dev, defaulting to local image if it exists
INFO root:portable_runner.py:577 Waiting for docker to start up. Current status is running
INFO root:portable_runner.py:577 Docker container is running. container_id = b'f058fd19d6e5ce2968afa9b6c284cc3d667569ca8dc4ee61a978c215524f9948', worker_id = worker_84
INFO root:portable_runner.py:577 Completed job in 12.806305885314941 seconds with state DONE.
INFO apache_beam.runners.portability.portable_runner:portable_runner.py:583 Job state changed to DONE
PASSED [ 88%]
apache_beam/transforms/sql_test.py::SqlTransformTest::test_zetasql_generate_data
-------------------------------- live log call ---------------------------------
INFO apache_beam.utils.subprocess_server:subprocess_server.py:254 Using pre-built snapshot at <https://ci-beam.apache.org/job/beam_PostCommit_XVR_Direct/ws/src/sdks/java/extensions/sql/expansion-service/build/libs/beam-sdks-java-extensions-sql-expansion-service-2.42.0-SNAPSHOT.jar>
INFO root:external.py:773 Starting a JAR-based expansion service from JAR <https://ci-beam.apache.org/job/beam_PostCommit_XVR_Direct/ws/src/sdks/java/extensions/sql/expansion-service/build/libs/beam-sdks-java-extensions-sql-expansion-service-2.42.0-SNAPSHOT.jar>
INFO apache_beam.utils.subprocess_server:subprocess_server.py:116 Starting service with ['java' '-jar' '<https://ci-beam.apache.org/job/beam_PostCommit_XVR_Direct/ws/src/sdks/java/extensions/sql/expansion-service/build/libs/beam-sdks-java-extensions-sql-expansion-service-2.42.0-SNAPSHOT.jar'> '41023' '--filesToStage=<https://ci-beam.apache.org/job/beam_PostCommit_XVR_Direct/ws/src/sdks/java/extensions/sql/expansion-service/build/libs/beam-sdks-java-extensions-sql-expansion-service-2.42.0-SNAPSHOT.jar']>
INFO apache_beam.utils.subprocess_server:subprocess_server.py:132 Starting expansion service at localhost:41023
INFO apache_beam.utils.subprocess_server:subprocess_server.py:132 Aug 15, 2022 11:35:35 AM org.apache.beam.sdk.expansion.service.ExpansionService loadRegisteredTransforms
INFO apache_beam.utils.subprocess_server:subprocess_server.py:132 INFO: Registering external transforms: [beam:external:java:sql:v1, beam:transform:org.apache.beam:pubsub_read:v1, beam:transform:org.apache.beam:pubsub_write:v1, beam:transform:org.apache.beam:pubsublite_write:v1, beam:transform:org.apache.beam:pubsublite_read:v1, beam:transform:org.apache.beam:spanner_insert:v1, beam:transform:org.apache.beam:spanner_update:v1, beam:transform:org.apache.beam:spanner_replace:v1, beam:transform:org.apache.beam:spanner_insert_or_update:v1, beam:transform:org.apache.beam:spanner_delete:v1, beam:transform:org.apache.beam:spanner_read:v1, beam:transform:org.apache.beam:kafka_read_with_metadata:v1, beam:transform:org.apache.beam:kafka_read_without_metadata:v1, beam:transform:org.apache.beam:kafka_write:v1, beam:external:java:generate_sequence:v1]
INFO apache_beam.utils.subprocess_server:subprocess_server.py:132 beam:external:java:sql:v1: org.apache.beam.sdk.expansion.service.ExpansionService$ExternalTransformRegistrarLoader$1@47eaca72
INFO apache_beam.utils.subprocess_server:subprocess_server.py:132 beam:transform:org.apache.beam:pubsub_read:v1: org.apache.beam.sdk.expansion.service.ExpansionService$ExternalTransformRegistrarLoader$1@55141def
INFO apache_beam.utils.subprocess_server:subprocess_server.py:132 beam:transform:org.apache.beam:pubsub_write:v1: org.apache.beam.sdk.expansion.service.ExpansionService$ExternalTransformRegistrarLoader$1@55182842
INFO apache_beam.utils.subprocess_server:subprocess_server.py:132 beam:transform:org.apache.beam:pubsublite_write:v1: org.apache.beam.sdk.expansion.service.ExpansionService$ExternalTransformRegistrarLoader$1@3270d194
INFO apache_beam.utils.subprocess_server:subprocess_server.py:132 beam:transform:org.apache.beam:pubsublite_read:v1: org.apache.beam.sdk.expansion.service.ExpansionService$ExternalTransformRegistrarLoader$1@235834f2
INFO apache_beam.utils.subprocess_server:subprocess_server.py:132 beam:transform:org.apache.beam:spanner_insert:v1: org.apache.beam.sdk.expansion.service.ExpansionService$ExternalTransformRegistrarLoader$1@5656be13
INFO apache_beam.utils.subprocess_server:subprocess_server.py:132 beam:transform:org.apache.beam:spanner_update:v1: org.apache.beam.sdk.expansion.service.ExpansionService$ExternalTransformRegistrarLoader$1@4218d6a3
INFO apache_beam.utils.subprocess_server:subprocess_server.py:132 beam:transform:org.apache.beam:spanner_replace:v1: org.apache.beam.sdk.expansion.service.ExpansionService$ExternalTransformRegistrarLoader$1@76505305
INFO apache_beam.utils.subprocess_server:subprocess_server.py:132 beam:transform:org.apache.beam:spanner_insert_or_update:v1: org.apache.beam.sdk.expansion.service.ExpansionService$ExternalTransformRegistrarLoader$1@14cd1699
INFO apache_beam.utils.subprocess_server:subprocess_server.py:132 beam:transform:org.apache.beam:spanner_delete:v1: org.apache.beam.sdk.expansion.service.ExpansionService$ExternalTransformRegistrarLoader$1@77888435
INFO apache_beam.utils.subprocess_server:subprocess_server.py:132 beam:transform:org.apache.beam:spanner_read:v1: org.apache.beam.sdk.expansion.service.ExpansionService$ExternalTransformRegistrarLoader$1@73a1e9a9
INFO apache_beam.utils.subprocess_server:subprocess_server.py:132 beam:transform:org.apache.beam:kafka_read_with_metadata:v1: org.apache.beam.sdk.expansion.service.ExpansionService$ExternalTransformRegistrarLoader$1@71d44a3
INFO apache_beam.utils.subprocess_server:subprocess_server.py:132 beam:transform:org.apache.beam:kafka_read_without_metadata:v1: org.apache.beam.sdk.expansion.service.ExpansionService$ExternalTransformRegistrarLoader$1@7b98f307
INFO apache_beam.utils.subprocess_server:subprocess_server.py:132 beam:transform:org.apache.beam:kafka_write:v1: org.apache.beam.sdk.expansion.service.ExpansionService$ExternalTransformRegistrarLoader$1@4802796d
INFO apache_beam.utils.subprocess_server:subprocess_server.py:132 beam:external:java:generate_sequence:v1: org.apache.beam.sdk.expansion.service.ExpansionService$ExternalTransformRegistrarLoader$1@34123d65
INFO apache_beam.utils.subprocess_server:subprocess_server.py:132 Aug 15, 2022 11:35:36 AM org.apache.beam.sdk.expansion.service.ExpansionService expand
INFO apache_beam.utils.subprocess_server:subprocess_server.py:132 INFO: Expanding 'SqlTransform(beam:external:java:sql:v1)' with URN 'beam:external:java:sql:v1'
INFO apache_beam.utils.subprocess_server:subprocess_server.py:132 Aug 15, 2022 11:35:36 AM org.apache.beam.sdk.expansion.service.ExpansionService$ExternalTransformRegistrarLoader payloadToConfig
INFO apache_beam.utils.subprocess_server:subprocess_server.py:132 WARNING: Configuration class 'org.apache.beam.sdk.extensions.sql.expansion.ExternalSqlTransformRegistrar$Configuration' has no schema registered. Attempting to construct with setter approach.
INFO apache_beam.utils.subprocess_server:subprocess_server.py:132 Aug 15, 2022 11:35:36 AM org.apache.beam.sdk.expansion.service.ExpansionService$ExternalTransformRegistrarLoader payloadToConfig
INFO apache_beam.utils.subprocess_server:subprocess_server.py:132 WARNING: Configuration class 'org.apache.beam.sdk.extensions.sql.expansion.ExternalSqlTransformRegistrar$Configuration' has no schema registered. Attempting to construct with setter approach.
INFO apache_beam.utils.subprocess_server:subprocess_server.py:132 Aug 15, 2022 11:35:38 AM com.google.zetasql.io.grpc.NameResolverRegistry getDefaultRegistry
INFO apache_beam.utils.subprocess_server:subprocess_server.py:132 WARNING: No NameResolverProviders found via ServiceLoader, including for DNS. This is probably due to a broken build. If using ProGuard, check your configuration
INFO apache_beam.utils.subprocess_server:subprocess_server.py:132 Aug 15, 2022 11:35:40 AM org.apache.beam.sdk.extensions.sql.zetasql.ZetaSQLQueryPlanner convertToBeamRelInternal
INFO apache_beam.utils.subprocess_server:subprocess_server.py:132 INFO: BEAMPlan>
INFO apache_beam.utils.subprocess_server:subprocess_server.py:132 BeamZetaSqlCalcRel(expr#0=[{inputs}], expr#1=[1:BIGINT], expr#2=['foo':VARCHAR], expr#3=[3.1400000000000001243E0:DOUBLE], int=[$t1], str=[$t2], flt=[$t3])
INFO apache_beam.utils.subprocess_server:subprocess_server.py:132 BeamValuesRel(tuples=[[{ 0 }]])
INFO apache_beam.utils.subprocess_server:subprocess_server.py:132
INFO root:environments.py:376 Default Python SDK image for environment is apache/beam_python3.7_sdk:2.42.0.dev
INFO root:environments.py:299 No image given, using default Python SDK image
INFO root:environments.py:376 Default Python SDK image for environment is apache/beam_python3.7_sdk:2.42.0.dev
INFO root:environments.py:304 Python SDK container image set to "apache/beam_python3.7_sdk:2.42.0.dev" for Docker environment
INFO apache_beam.runners.portability.fn_api_runner.translations:translations.py:714 ==================== <function pack_combiners at 0x7f0169810e60> ====================
INFO apache_beam.runners.portability.fn_api_runner.translations:translations.py:714 ==================== <function lift_combiners at 0x7f0169810ef0> ====================
INFO apache_beam.runners.portability.fn_api_runner.translations:translations.py:714 ==================== <function sort_stages at 0x7f0169812680> ====================
INFO apache_beam.runners.portability.portable_runner:portable_runner.py:583 Job state changed to STOPPED
INFO apache_beam.runners.portability.portable_runner:portable_runner.py:583 Job state changed to STARTING
INFO apache_beam.runners.portability.portable_runner:portable_runner.py:583 Job state changed to RUNNING
INFO root:portable_runner.py:577 Default Python SDK image for environment is apache/beam_python3.7_sdk:2.42.0.dev
INFO root:portable_runner.py:577 ==================== <function annotate_downstream_side_inputs at 0x7f3fcbbbe050> ====================
INFO root:portable_runner.py:577 ==================== <function fix_side_input_pcoll_coders at 0x7f3fcbbbe170> ====================
INFO root:portable_runner.py:577 ==================== <function pack_combiners at 0x7f3fcbbbe680> ====================
INFO root:portable_runner.py:577 ==================== <function lift_combiners at 0x7f3fcbbbe710> ====================
INFO root:portable_runner.py:577 ==================== <function expand_sdf at 0x7f3fcbbbe8c0> ====================
INFO root:portable_runner.py:577 ==================== <function expand_gbk at 0x7f3fcbbbe950> ====================
INFO root:portable_runner.py:577 ==================== <function sink_flattens at 0x7f3fcbbbea70> ====================
INFO root:portable_runner.py:577 ==================== <function greedily_fuse at 0x7f3fcbbbeb00> ====================
INFO root:portable_runner.py:577 ==================== <function read_to_impulse at 0x7f3fcbbbeb90> ====================
INFO root:portable_runner.py:577 ==================== <function impulse_to_input at 0x7f3fcbbbec20> ====================
INFO root:portable_runner.py:577 ==================== <function sort_stages at 0x7f3fcbbbee60> ====================
INFO root:portable_runner.py:577 ==================== <function add_impulse_to_dangling_transforms at 0x7f3fcbbbef80> ====================
INFO root:portable_runner.py:577 ==================== <function setup_timer_mapping at 0x7f3fcbbbedd0> ====================
INFO root:portable_runner.py:577 ==================== <function populate_data_channel_coders at 0x7f3fcbbbeef0> ====================
INFO root:portable_runner.py:577 starting control server on port 35945
INFO root:portable_runner.py:577 starting data server on port 46841
INFO root:portable_runner.py:577 starting state server on port 41019
INFO root:portable_runner.py:577 starting logging server on port 37703
INFO root:portable_runner.py:577 Created Worker handler <apache_beam.runners.portability.fn_api_runner.worker_handlers.DockerSdkWorkerHandler object at 0x7f3fe21c4910> for environment external_9beam:env:docker:v1 (beam:env:docker:v1, b'\n apache/beam_java8_sdk:2.42.0.dev')
INFO root:portable_runner.py:577 Attempting to pull image apache/beam_java8_sdk:2.42.0.dev
INFO root:portable_runner.py:577 Unable to pull image apache/beam_java8_sdk:2.42.0.dev, defaulting to local image if it exists
INFO root:portable_runner.py:577 Waiting for docker to start up. Current status is running
INFO root:portable_runner.py:577 Docker container is running. container_id = b'b5b819aa100159ca630bd6d19a5f44286b7ad3cf1f3f2aaea2ac9fbddaec158a', worker_id = worker_85
INFO root:portable_runner.py:577 Created Worker handler <apache_beam.runners.portability.fn_api_runner.worker_handlers.DockerSdkWorkerHandler object at 0x7f3fe28adf50> for environment ref_Environment_default_environment_2 (beam:env:docker:v1, b'\n$apache/beam_python3.7_sdk:2.42.0.dev')
INFO root:portable_runner.py:577 Attempting to pull image apache/beam_python3.7_sdk:2.42.0.dev
INFO root:portable_runner.py:577 Unable to pull image apache/beam_python3.7_sdk:2.42.0.dev, defaulting to local image if it exists
INFO root:portable_runner.py:577 Waiting for docker to start up. Current status is running
INFO root:portable_runner.py:577 Docker container is running. container_id = b'c1f794ec19e907aa2d3244e7b24d09ac3e475a3a7543d37bfc8ef8ef41402063', worker_id = worker_86
INFO root:portable_runner.py:577 Completed job in 12.628925085067749 seconds with state DONE.
INFO apache_beam.runners.portability.portable_runner:portable_runner.py:583 Job state changed to DONE
PASSED [100%]
=============================== warnings summary ===============================
../../build/gradleenv/1922375555/lib/python3.7/site-packages/hdfs/config.py:15
<https://ci-beam.apache.org/job/beam_PostCommit_XVR_Direct/ws/src/build/gradleenv/1922375555/lib/python3.7/site-packages/hdfs/config.py>:15: DeprecationWarning: the imp module is deprecated in favour of importlib; see the module's documentation for alternative uses
from imp import load_source
-- Docs: https://docs.pytest.org/en/stable/how-to/capture-warnings.html
- generated xml file: <https://ci-beam.apache.org/job/beam_PostCommit_XVR_Direct/ws/src/sdks/python/pytest_xlangSqlValidateRunner.xml> -
===== 9 passed, 2 skipped, 6541 deselected, 1 warning in 234.30s (0:03:54) =====
> Task :sdks:python:test-suites:direct:xlang:validatesCrossLanguageRunnerCleanup
Stopping expansion service pid: 3119299.
Stopping expansion service pid: 3119300.
> Task :sdks:python:test-suites:direct:xlang:fnApiJobServerCleanup
Killing process at 3116563
FAILURE: Build failed with an exception.
* What went wrong:
Execution failed for task ':sdks:python:test-suites:direct:xlang:validatesCrossLanguageRunnerJavaUsingPython'.
> There were failing tests. See the report at: file://<https://ci-beam.apache.org/job/beam_PostCommit_XVR_Direct/ws/src/sdks/python/test-suites/direct/xlang/build/reports/tests/validatesCrossLanguageRunnerJavaUsingPython/index.html>
* Try:
> Run with --stacktrace option to get the stack trace.
> Run with --info or --debug option to get more log output.
> Run with --scan to get full insights.
* Get more help at https://help.gradle.org
Deprecated Gradle features were used in this build, making it incompatible with Gradle 8.0.
You can use '--warning-mode all' to show the individual deprecation warnings and determine if they come from your own scripts or plugins.
See https://docs.gradle.org/7.4/userguide/command_line_interface.html#sec:command_line_warnings
Execution optimizations have been disabled for 1 invalid unit(s) of work during this build to ensure correctness.
Please consult deprecation warnings for more details.
BUILD FAILED in 25m 33s
247 actionable tasks: 162 executed, 73 from cache, 12 up-to-date
Publishing build scan...
https://gradle.com/s/z7q7lkff3lifk
Build step 'Invoke Gradle script' changed build result to FAILURE
Build step 'Invoke Gradle script' marked build as failure
---------------------------------------------------------------------
To unsubscribe, e-mail: builds-unsubscribe@beam.apache.org
For additional commands, e-mail: builds-help@beam.apache.org
Build failed in Jenkins: beam_PostCommit_XVR_Direct #3017
Posted by Apache Jenkins Server <je...@builds.apache.org>.
See <https://ci-beam.apache.org/job/beam_PostCommit_XVR_Direct/3017/display/redirect>
Changes:
------------------------------------------
[...truncated 1.42 MB...]
INFO root:environments.py:304 Python SDK container image set to "apache/beam_python3.7_sdk:2.42.0.dev" for Docker environment
INFO apache_beam.runners.portability.fn_api_runner.translations:translations.py:714 ==================== <function pack_combiners at 0x7fa8c4af5e60> ====================
INFO apache_beam.runners.portability.fn_api_runner.translations:translations.py:714 ==================== <function lift_combiners at 0x7fa8c4af5ef0> ====================
INFO apache_beam.runners.portability.fn_api_runner.translations:translations.py:714 ==================== <function sort_stages at 0x7fa8c4af7680> ====================
INFO apache_beam.runners.portability.portable_runner:portable_runner.py:583 Job state changed to STOPPED
INFO apache_beam.runners.portability.portable_runner:portable_runner.py:583 Job state changed to STARTING
INFO apache_beam.runners.portability.portable_runner:portable_runner.py:583 Job state changed to RUNNING
INFO root:portable_runner.py:577 Default Python SDK image for environment is apache/beam_python3.7_sdk:2.42.0.dev
INFO root:portable_runner.py:577 ==================== <function annotate_downstream_side_inputs at 0x7f5c98843050> ====================
INFO root:portable_runner.py:577 ==================== <function fix_side_input_pcoll_coders at 0x7f5c98843170> ====================
INFO root:portable_runner.py:577 ==================== <function pack_combiners at 0x7f5c98843680> ====================
INFO root:portable_runner.py:577 ==================== <function lift_combiners at 0x7f5c98843710> ====================
INFO root:portable_runner.py:577 ==================== <function expand_sdf at 0x7f5c988438c0> ====================
INFO root:portable_runner.py:577 ==================== <function expand_gbk at 0x7f5c98843950> ====================
INFO root:portable_runner.py:577 ==================== <function sink_flattens at 0x7f5c98843a70> ====================
INFO root:portable_runner.py:577 ==================== <function greedily_fuse at 0x7f5c98843b00> ====================
INFO root:portable_runner.py:577 ==================== <function read_to_impulse at 0x7f5c98843b90> ====================
INFO root:portable_runner.py:577 ==================== <function impulse_to_input at 0x7f5c98843c20> ====================
INFO root:portable_runner.py:577 ==================== <function sort_stages at 0x7f5c98843e60> ====================
INFO root:portable_runner.py:577 ==================== <function add_impulse_to_dangling_transforms at 0x7f5c98843f80> ====================
INFO root:portable_runner.py:577 ==================== <function setup_timer_mapping at 0x7f5c98843dd0> ====================
INFO root:portable_runner.py:577 ==================== <function populate_data_channel_coders at 0x7f5c98843ef0> ====================
INFO root:portable_runner.py:577 starting control server on port 36475
INFO root:portable_runner.py:577 starting data server on port 45431
INFO root:portable_runner.py:577 starting state server on port 39381
INFO root:portable_runner.py:577 starting logging server on port 37417
INFO root:portable_runner.py:577 Created Worker handler <apache_beam.runners.portability.fn_api_runner.worker_handlers.DockerSdkWorkerHandler object at 0x7f5cab510550> for environment ref_Environment_default_environment_2 (beam:env:docker:v1, b'\n$apache/beam_python3.7_sdk:2.42.0.dev')
INFO root:portable_runner.py:577 Attempting to pull image apache/beam_python3.7_sdk:2.42.0.dev
INFO root:portable_runner.py:577 Unable to pull image apache/beam_python3.7_sdk:2.42.0.dev, defaulting to local image if it exists
INFO root:portable_runner.py:577 Waiting for docker to start up. Current status is running
INFO root:portable_runner.py:577 Docker container is running. container_id = b'97ad0d747da51188132f0c394b8cf0ca20cb010fa20690f8a27a2ec71d8119aa', worker_id = worker_81
INFO root:portable_runner.py:577 Created Worker handler <apache_beam.runners.portability.fn_api_runner.worker_handlers.DockerSdkWorkerHandler object at 0x7f5c9862ced0> for environment external_7beam:env:docker:v1 (beam:env:docker:v1, b'\n apache/beam_java8_sdk:2.42.0.dev')
INFO root:portable_runner.py:577 Attempting to pull image apache/beam_java8_sdk:2.42.0.dev
INFO root:portable_runner.py:577 Unable to pull image apache/beam_java8_sdk:2.42.0.dev, defaulting to local image if it exists
INFO root:portable_runner.py:577 Waiting for docker to start up. Current status is running
INFO root:portable_runner.py:577 Docker container is running. container_id = b'9aad0686ad2a8c83bf51974cce0278f664895f2d0956b0594602e0954913a2ac', worker_id = worker_82
INFO root:portable_runner.py:577 Completed job in 13.564967155456543 seconds with state DONE.
INFO apache_beam.runners.portability.portable_runner:portable_runner.py:583 Job state changed to DONE
PASSED [ 77%]
apache_beam/transforms/sql_test.py::SqlTransformTest::test_windowing_before_sql
-------------------------------- live log call ---------------------------------
INFO apache_beam.utils.subprocess_server:subprocess_server.py:254 Using pre-built snapshot at <https://ci-beam.apache.org/job/beam_PostCommit_XVR_Direct/ws/src/sdks/java/extensions/sql/expansion-service/build/libs/beam-sdks-java-extensions-sql-expansion-service-2.42.0-SNAPSHOT.jar>
INFO root:external.py:773 Starting a JAR-based expansion service from JAR <https://ci-beam.apache.org/job/beam_PostCommit_XVR_Direct/ws/src/sdks/java/extensions/sql/expansion-service/build/libs/beam-sdks-java-extensions-sql-expansion-service-2.42.0-SNAPSHOT.jar>
INFO apache_beam.utils.subprocess_server:subprocess_server.py:116 Starting service with ['java' '-jar' '<https://ci-beam.apache.org/job/beam_PostCommit_XVR_Direct/ws/src/sdks/java/extensions/sql/expansion-service/build/libs/beam-sdks-java-extensions-sql-expansion-service-2.42.0-SNAPSHOT.jar'> '40033' '--filesToStage=<https://ci-beam.apache.org/job/beam_PostCommit_XVR_Direct/ws/src/sdks/java/extensions/sql/expansion-service/build/libs/beam-sdks-java-extensions-sql-expansion-service-2.42.0-SNAPSHOT.jar']>
INFO apache_beam.utils.subprocess_server:subprocess_server.py:132 Starting expansion service at localhost:40033
INFO apache_beam.utils.subprocess_server:subprocess_server.py:132 Aug 15, 2022 5:35:28 AM org.apache.beam.sdk.expansion.service.ExpansionService loadRegisteredTransforms
INFO apache_beam.utils.subprocess_server:subprocess_server.py:132 INFO: Registering external transforms: [beam:external:java:sql:v1, beam:transform:org.apache.beam:pubsub_read:v1, beam:transform:org.apache.beam:pubsub_write:v1, beam:transform:org.apache.beam:pubsublite_write:v1, beam:transform:org.apache.beam:pubsublite_read:v1, beam:transform:org.apache.beam:spanner_insert:v1, beam:transform:org.apache.beam:spanner_update:v1, beam:transform:org.apache.beam:spanner_replace:v1, beam:transform:org.apache.beam:spanner_insert_or_update:v1, beam:transform:org.apache.beam:spanner_delete:v1, beam:transform:org.apache.beam:spanner_read:v1, beam:transform:org.apache.beam:kafka_read_with_metadata:v1, beam:transform:org.apache.beam:kafka_read_without_metadata:v1, beam:transform:org.apache.beam:kafka_write:v1, beam:external:java:generate_sequence:v1]
INFO apache_beam.utils.subprocess_server:subprocess_server.py:132 beam:external:java:sql:v1: org.apache.beam.sdk.expansion.service.ExpansionService$ExternalTransformRegistrarLoader$1@47eaca72
INFO apache_beam.utils.subprocess_server:subprocess_server.py:132 beam:transform:org.apache.beam:pubsub_read:v1: org.apache.beam.sdk.expansion.service.ExpansionService$ExternalTransformRegistrarLoader$1@55141def
INFO apache_beam.utils.subprocess_server:subprocess_server.py:132 beam:transform:org.apache.beam:pubsub_write:v1: org.apache.beam.sdk.expansion.service.ExpansionService$ExternalTransformRegistrarLoader$1@55182842
INFO apache_beam.utils.subprocess_server:subprocess_server.py:132 beam:transform:org.apache.beam:pubsublite_write:v1: org.apache.beam.sdk.expansion.service.ExpansionService$ExternalTransformRegistrarLoader$1@3270d194
INFO apache_beam.utils.subprocess_server:subprocess_server.py:132 beam:transform:org.apache.beam:pubsublite_read:v1: org.apache.beam.sdk.expansion.service.ExpansionService$ExternalTransformRegistrarLoader$1@235834f2
INFO apache_beam.utils.subprocess_server:subprocess_server.py:132 beam:transform:org.apache.beam:spanner_insert:v1: org.apache.beam.sdk.expansion.service.ExpansionService$ExternalTransformRegistrarLoader$1@5656be13
INFO apache_beam.utils.subprocess_server:subprocess_server.py:132 beam:transform:org.apache.beam:spanner_update:v1: org.apache.beam.sdk.expansion.service.ExpansionService$ExternalTransformRegistrarLoader$1@4218d6a3
INFO apache_beam.utils.subprocess_server:subprocess_server.py:132 beam:transform:org.apache.beam:spanner_replace:v1: org.apache.beam.sdk.expansion.service.ExpansionService$ExternalTransformRegistrarLoader$1@76505305
INFO apache_beam.utils.subprocess_server:subprocess_server.py:132 beam:transform:org.apache.beam:spanner_insert_or_update:v1: org.apache.beam.sdk.expansion.service.ExpansionService$ExternalTransformRegistrarLoader$1@14cd1699
INFO apache_beam.utils.subprocess_server:subprocess_server.py:132 beam:transform:org.apache.beam:spanner_delete:v1: org.apache.beam.sdk.expansion.service.ExpansionService$ExternalTransformRegistrarLoader$1@77888435
INFO apache_beam.utils.subprocess_server:subprocess_server.py:132 beam:transform:org.apache.beam:spanner_read:v1: org.apache.beam.sdk.expansion.service.ExpansionService$ExternalTransformRegistrarLoader$1@73a1e9a9
INFO apache_beam.utils.subprocess_server:subprocess_server.py:132 beam:transform:org.apache.beam:kafka_read_with_metadata:v1: org.apache.beam.sdk.expansion.service.ExpansionService$ExternalTransformRegistrarLoader$1@71d44a3
INFO apache_beam.utils.subprocess_server:subprocess_server.py:132 beam:transform:org.apache.beam:kafka_read_without_metadata:v1: org.apache.beam.sdk.expansion.service.ExpansionService$ExternalTransformRegistrarLoader$1@7b98f307
INFO apache_beam.utils.subprocess_server:subprocess_server.py:132 beam:transform:org.apache.beam:kafka_write:v1: org.apache.beam.sdk.expansion.service.ExpansionService$ExternalTransformRegistrarLoader$1@4802796d
INFO apache_beam.utils.subprocess_server:subprocess_server.py:132 beam:external:java:generate_sequence:v1: org.apache.beam.sdk.expansion.service.ExpansionService$ExternalTransformRegistrarLoader$1@34123d65
INFO apache_beam.utils.subprocess_server:subprocess_server.py:132 Aug 15, 2022 5:35:30 AM org.apache.beam.sdk.expansion.service.ExpansionService expand
INFO apache_beam.utils.subprocess_server:subprocess_server.py:132 INFO: Expanding 'SqlTransform(beam:external:java:sql:v1)' with URN 'beam:external:java:sql:v1'
INFO apache_beam.utils.subprocess_server:subprocess_server.py:132 Aug 15, 2022 5:35:30 AM org.apache.beam.sdk.expansion.service.ExpansionService$ExternalTransformRegistrarLoader payloadToConfig
INFO apache_beam.utils.subprocess_server:subprocess_server.py:132 WARNING: Configuration class 'org.apache.beam.sdk.extensions.sql.expansion.ExternalSqlTransformRegistrar$Configuration' has no schema registered. Attempting to construct with setter approach.
INFO apache_beam.utils.subprocess_server:subprocess_server.py:132 Aug 15, 2022 5:35:30 AM org.apache.beam.sdk.expansion.service.ExpansionService$ExternalTransformRegistrarLoader payloadToConfig
INFO apache_beam.utils.subprocess_server:subprocess_server.py:132 WARNING: Configuration class 'org.apache.beam.sdk.extensions.sql.expansion.ExternalSqlTransformRegistrar$Configuration' has no schema registered. Attempting to construct with setter approach.
INFO apache_beam.utils.subprocess_server:subprocess_server.py:132 Aug 15, 2022 5:35:32 AM org.apache.beam.sdk.extensions.sql.impl.CalciteQueryPlanner convertToBeamRel
INFO apache_beam.utils.subprocess_server:subprocess_server.py:132 INFO: SQL:
INFO apache_beam.utils.subprocess_server:subprocess_server.py:132 SELECT COUNT(*) AS `count`
INFO apache_beam.utils.subprocess_server:subprocess_server.py:132 FROM `beam`.`PCOLLECTION` AS `PCOLLECTION`
INFO apache_beam.utils.subprocess_server:subprocess_server.py:132 Aug 15, 2022 5:35:32 AM org.apache.beam.sdk.extensions.sql.impl.CalciteQueryPlanner convertToBeamRel
INFO apache_beam.utils.subprocess_server:subprocess_server.py:132 INFO: SQLPlan>
INFO apache_beam.utils.subprocess_server:subprocess_server.py:132 LogicalAggregate(group=[{}], count=[COUNT()])
INFO apache_beam.utils.subprocess_server:subprocess_server.py:132 BeamIOSourceRel(table=[[beam, PCOLLECTION]])
INFO apache_beam.utils.subprocess_server:subprocess_server.py:132
INFO apache_beam.utils.subprocess_server:subprocess_server.py:132 Aug 15, 2022 5:35:32 AM org.apache.beam.sdk.extensions.sql.impl.CalciteQueryPlanner convertToBeamRel
INFO apache_beam.utils.subprocess_server:subprocess_server.py:132 INFO: BEAMPlan>
INFO apache_beam.utils.subprocess_server:subprocess_server.py:132 BeamAggregationRel(group=[{}], count=[COUNT()])
INFO apache_beam.utils.subprocess_server:subprocess_server.py:132 BeamIOSourceRel(table=[[beam, PCOLLECTION]])
INFO apache_beam.utils.subprocess_server:subprocess_server.py:132
INFO root:environments.py:376 Default Python SDK image for environment is apache/beam_python3.7_sdk:2.42.0.dev
INFO root:environments.py:299 No image given, using default Python SDK image
INFO root:environments.py:376 Default Python SDK image for environment is apache/beam_python3.7_sdk:2.42.0.dev
INFO root:environments.py:304 Python SDK container image set to "apache/beam_python3.7_sdk:2.42.0.dev" for Docker environment
INFO apache_beam.runners.portability.fn_api_runner.translations:translations.py:714 ==================== <function pack_combiners at 0x7fa8c4af5e60> ====================
INFO apache_beam.runners.portability.fn_api_runner.translations:translations.py:714 ==================== <function lift_combiners at 0x7fa8c4af5ef0> ====================
INFO apache_beam.runners.portability.fn_api_runner.translations:translations.py:714 ==================== <function sort_stages at 0x7fa8c4af7680> ====================
INFO apache_beam.runners.portability.portable_runner:portable_runner.py:583 Job state changed to STOPPED
INFO apache_beam.runners.portability.portable_runner:portable_runner.py:583 Job state changed to STARTING
INFO apache_beam.runners.portability.portable_runner:portable_runner.py:583 Job state changed to RUNNING
INFO root:portable_runner.py:577 Default Python SDK image for environment is apache/beam_python3.7_sdk:2.42.0.dev
INFO root:portable_runner.py:577 ==================== <function annotate_downstream_side_inputs at 0x7f5c98843050> ====================
INFO root:portable_runner.py:577 ==================== <function fix_side_input_pcoll_coders at 0x7f5c98843170> ====================
INFO root:portable_runner.py:577 ==================== <function pack_combiners at 0x7f5c98843680> ====================
INFO root:portable_runner.py:577 ==================== <function lift_combiners at 0x7f5c98843710> ====================
INFO root:portable_runner.py:577 ==================== <function expand_sdf at 0x7f5c988438c0> ====================
INFO root:portable_runner.py:577 ==================== <function expand_gbk at 0x7f5c98843950> ====================
INFO root:portable_runner.py:577 ==================== <function sink_flattens at 0x7f5c98843a70> ====================
INFO root:portable_runner.py:577 ==================== <function greedily_fuse at 0x7f5c98843b00> ====================
INFO root:portable_runner.py:577 ==================== <function read_to_impulse at 0x7f5c98843b90> ====================
INFO root:portable_runner.py:577 ==================== <function impulse_to_input at 0x7f5c98843c20> ====================
INFO root:portable_runner.py:577 ==================== <function sort_stages at 0x7f5c98843e60> ====================
INFO root:portable_runner.py:577 ==================== <function add_impulse_to_dangling_transforms at 0x7f5c98843f80> ====================
INFO root:portable_runner.py:577 ==================== <function setup_timer_mapping at 0x7f5c98843dd0> ====================
INFO root:portable_runner.py:577 ==================== <function populate_data_channel_coders at 0x7f5c98843ef0> ====================
INFO root:portable_runner.py:577 starting control server on port 35351
INFO root:portable_runner.py:577 starting data server on port 45473
INFO root:portable_runner.py:577 starting state server on port 39431
INFO root:portable_runner.py:577 starting logging server on port 33279
INFO root:portable_runner.py:577 Created Worker handler <apache_beam.runners.portability.fn_api_runner.worker_handlers.DockerSdkWorkerHandler object at 0x7f5cab57ef90> for environment ref_Environment_default_environment_2 (beam:env:docker:v1, b'\n$apache/beam_python3.7_sdk:2.42.0.dev')
INFO root:portable_runner.py:577 Attempting to pull image apache/beam_python3.7_sdk:2.42.0.dev
INFO root:portable_runner.py:577 Unable to pull image apache/beam_python3.7_sdk:2.42.0.dev, defaulting to local image if it exists
INFO root:portable_runner.py:577 Waiting for docker to start up. Current status is running
INFO root:portable_runner.py:577 Docker container is running. container_id = b'0b25022b5313e410d7f13d5ae0c75691bccb86afc04a3c028ab76ad044a48afd', worker_id = worker_83
INFO root:portable_runner.py:577 Created Worker handler <apache_beam.runners.portability.fn_api_runner.worker_handlers.DockerSdkWorkerHandler object at 0x7f5c986ea550> for environment external_8beam:env:docker:v1 (beam:env:docker:v1, b'\n apache/beam_java8_sdk:2.42.0.dev')
INFO root:portable_runner.py:577 Attempting to pull image apache/beam_java8_sdk:2.42.0.dev
INFO root:portable_runner.py:577 Unable to pull image apache/beam_java8_sdk:2.42.0.dev, defaulting to local image if it exists
INFO root:portable_runner.py:577 Waiting for docker to start up. Current status is running
INFO root:portable_runner.py:577 Docker container is running. container_id = b'dbbf5f8a22d1b7fa6d103aa0c51411bee5ec38ba4d65884bda4e1ef2e8dc8df7', worker_id = worker_84
INFO root:portable_runner.py:577 Completed job in 11.627906560897827 seconds with state DONE.
INFO apache_beam.runners.portability.portable_runner:portable_runner.py:583 Job state changed to DONE
PASSED [ 88%]
apache_beam/transforms/sql_test.py::SqlTransformTest::test_zetasql_generate_data
-------------------------------- live log call ---------------------------------
INFO apache_beam.utils.subprocess_server:subprocess_server.py:254 Using pre-built snapshot at <https://ci-beam.apache.org/job/beam_PostCommit_XVR_Direct/ws/src/sdks/java/extensions/sql/expansion-service/build/libs/beam-sdks-java-extensions-sql-expansion-service-2.42.0-SNAPSHOT.jar>
INFO root:external.py:773 Starting a JAR-based expansion service from JAR <https://ci-beam.apache.org/job/beam_PostCommit_XVR_Direct/ws/src/sdks/java/extensions/sql/expansion-service/build/libs/beam-sdks-java-extensions-sql-expansion-service-2.42.0-SNAPSHOT.jar>
INFO apache_beam.utils.subprocess_server:subprocess_server.py:116 Starting service with ['java' '-jar' '<https://ci-beam.apache.org/job/beam_PostCommit_XVR_Direct/ws/src/sdks/java/extensions/sql/expansion-service/build/libs/beam-sdks-java-extensions-sql-expansion-service-2.42.0-SNAPSHOT.jar'> '52519' '--filesToStage=<https://ci-beam.apache.org/job/beam_PostCommit_XVR_Direct/ws/src/sdks/java/extensions/sql/expansion-service/build/libs/beam-sdks-java-extensions-sql-expansion-service-2.42.0-SNAPSHOT.jar']>
INFO apache_beam.utils.subprocess_server:subprocess_server.py:132 Starting expansion service at localhost:52519
INFO apache_beam.utils.subprocess_server:subprocess_server.py:132 Aug 15, 2022 5:35:53 AM org.apache.beam.sdk.expansion.service.ExpansionService loadRegisteredTransforms
INFO apache_beam.utils.subprocess_server:subprocess_server.py:132 INFO: Registering external transforms: [beam:external:java:sql:v1, beam:transform:org.apache.beam:pubsub_read:v1, beam:transform:org.apache.beam:pubsub_write:v1, beam:transform:org.apache.beam:pubsublite_write:v1, beam:transform:org.apache.beam:pubsublite_read:v1, beam:transform:org.apache.beam:spanner_insert:v1, beam:transform:org.apache.beam:spanner_update:v1, beam:transform:org.apache.beam:spanner_replace:v1, beam:transform:org.apache.beam:spanner_insert_or_update:v1, beam:transform:org.apache.beam:spanner_delete:v1, beam:transform:org.apache.beam:spanner_read:v1, beam:transform:org.apache.beam:kafka_read_with_metadata:v1, beam:transform:org.apache.beam:kafka_read_without_metadata:v1, beam:transform:org.apache.beam:kafka_write:v1, beam:external:java:generate_sequence:v1]
INFO apache_beam.utils.subprocess_server:subprocess_server.py:132 beam:external:java:sql:v1: org.apache.beam.sdk.expansion.service.ExpansionService$ExternalTransformRegistrarLoader$1@47eaca72
INFO apache_beam.utils.subprocess_server:subprocess_server.py:132 beam:transform:org.apache.beam:pubsub_read:v1: org.apache.beam.sdk.expansion.service.ExpansionService$ExternalTransformRegistrarLoader$1@55141def
INFO apache_beam.utils.subprocess_server:subprocess_server.py:132 beam:transform:org.apache.beam:pubsub_write:v1: org.apache.beam.sdk.expansion.service.ExpansionService$ExternalTransformRegistrarLoader$1@55182842
INFO apache_beam.utils.subprocess_server:subprocess_server.py:132 beam:transform:org.apache.beam:pubsublite_write:v1: org.apache.beam.sdk.expansion.service.ExpansionService$ExternalTransformRegistrarLoader$1@3270d194
INFO apache_beam.utils.subprocess_server:subprocess_server.py:132 beam:transform:org.apache.beam:pubsublite_read:v1: org.apache.beam.sdk.expansion.service.ExpansionService$ExternalTransformRegistrarLoader$1@235834f2
INFO apache_beam.utils.subprocess_server:subprocess_server.py:132 beam:transform:org.apache.beam:spanner_insert:v1: org.apache.beam.sdk.expansion.service.ExpansionService$ExternalTransformRegistrarLoader$1@5656be13
INFO apache_beam.utils.subprocess_server:subprocess_server.py:132 beam:transform:org.apache.beam:spanner_update:v1: org.apache.beam.sdk.expansion.service.ExpansionService$ExternalTransformRegistrarLoader$1@4218d6a3
INFO apache_beam.utils.subprocess_server:subprocess_server.py:132 beam:transform:org.apache.beam:spanner_replace:v1: org.apache.beam.sdk.expansion.service.ExpansionService$ExternalTransformRegistrarLoader$1@76505305
INFO apache_beam.utils.subprocess_server:subprocess_server.py:132 beam:transform:org.apache.beam:spanner_insert_or_update:v1: org.apache.beam.sdk.expansion.service.ExpansionService$ExternalTransformRegistrarLoader$1@14cd1699
INFO apache_beam.utils.subprocess_server:subprocess_server.py:132 beam:transform:org.apache.beam:spanner_delete:v1: org.apache.beam.sdk.expansion.service.ExpansionService$ExternalTransformRegistrarLoader$1@77888435
INFO apache_beam.utils.subprocess_server:subprocess_server.py:132 beam:transform:org.apache.beam:spanner_read:v1: org.apache.beam.sdk.expansion.service.ExpansionService$ExternalTransformRegistrarLoader$1@73a1e9a9
INFO apache_beam.utils.subprocess_server:subprocess_server.py:132 beam:transform:org.apache.beam:kafka_read_with_metadata:v1: org.apache.beam.sdk.expansion.service.ExpansionService$ExternalTransformRegistrarLoader$1@71d44a3
INFO apache_beam.utils.subprocess_server:subprocess_server.py:132 beam:transform:org.apache.beam:kafka_read_without_metadata:v1: org.apache.beam.sdk.expansion.service.ExpansionService$ExternalTransformRegistrarLoader$1@7b98f307
INFO apache_beam.utils.subprocess_server:subprocess_server.py:132 beam:transform:org.apache.beam:kafka_write:v1: org.apache.beam.sdk.expansion.service.ExpansionService$ExternalTransformRegistrarLoader$1@4802796d
INFO apache_beam.utils.subprocess_server:subprocess_server.py:132 beam:external:java:generate_sequence:v1: org.apache.beam.sdk.expansion.service.ExpansionService$ExternalTransformRegistrarLoader$1@34123d65
INFO apache_beam.utils.subprocess_server:subprocess_server.py:132 Aug 15, 2022 5:35:54 AM org.apache.beam.sdk.expansion.service.ExpansionService expand
INFO apache_beam.utils.subprocess_server:subprocess_server.py:132 INFO: Expanding 'SqlTransform(beam:external:java:sql:v1)' with URN 'beam:external:java:sql:v1'
INFO apache_beam.utils.subprocess_server:subprocess_server.py:132 Aug 15, 2022 5:35:54 AM org.apache.beam.sdk.expansion.service.ExpansionService$ExternalTransformRegistrarLoader payloadToConfig
INFO apache_beam.utils.subprocess_server:subprocess_server.py:132 WARNING: Configuration class 'org.apache.beam.sdk.extensions.sql.expansion.ExternalSqlTransformRegistrar$Configuration' has no schema registered. Attempting to construct with setter approach.
INFO apache_beam.utils.subprocess_server:subprocess_server.py:132 Aug 15, 2022 5:35:55 AM org.apache.beam.sdk.expansion.service.ExpansionService$ExternalTransformRegistrarLoader payloadToConfig
INFO apache_beam.utils.subprocess_server:subprocess_server.py:132 WARNING: Configuration class 'org.apache.beam.sdk.extensions.sql.expansion.ExternalSqlTransformRegistrar$Configuration' has no schema registered. Attempting to construct with setter approach.
INFO apache_beam.utils.subprocess_server:subprocess_server.py:132 Aug 15, 2022 5:35:57 AM com.google.zetasql.io.grpc.NameResolverRegistry getDefaultRegistry
INFO apache_beam.utils.subprocess_server:subprocess_server.py:132 WARNING: No NameResolverProviders found via ServiceLoader, including for DNS. This is probably due to a broken build. If using ProGuard, check your configuration
INFO apache_beam.utils.subprocess_server:subprocess_server.py:132 Aug 15, 2022 5:35:58 AM org.apache.beam.sdk.extensions.sql.zetasql.ZetaSQLQueryPlanner convertToBeamRelInternal
INFO apache_beam.utils.subprocess_server:subprocess_server.py:132 INFO: BEAMPlan>
INFO apache_beam.utils.subprocess_server:subprocess_server.py:132 BeamZetaSqlCalcRel(expr#0=[{inputs}], expr#1=[1:BIGINT], expr#2=['foo':VARCHAR], expr#3=[3.1400000000000001243E0:DOUBLE], int=[$t1], str=[$t2], flt=[$t3])
INFO apache_beam.utils.subprocess_server:subprocess_server.py:132 BeamValuesRel(tuples=[[{ 0 }]])
INFO apache_beam.utils.subprocess_server:subprocess_server.py:132
INFO root:environments.py:376 Default Python SDK image for environment is apache/beam_python3.7_sdk:2.42.0.dev
INFO root:environments.py:299 No image given, using default Python SDK image
INFO root:environments.py:376 Default Python SDK image for environment is apache/beam_python3.7_sdk:2.42.0.dev
INFO root:environments.py:304 Python SDK container image set to "apache/beam_python3.7_sdk:2.42.0.dev" for Docker environment
INFO apache_beam.runners.portability.fn_api_runner.translations:translations.py:714 ==================== <function pack_combiners at 0x7fa8c4af5e60> ====================
INFO apache_beam.runners.portability.fn_api_runner.translations:translations.py:714 ==================== <function lift_combiners at 0x7fa8c4af5ef0> ====================
INFO apache_beam.runners.portability.fn_api_runner.translations:translations.py:714 ==================== <function sort_stages at 0x7fa8c4af7680> ====================
INFO apache_beam.runners.portability.portable_runner:portable_runner.py:583 Job state changed to STOPPED
INFO apache_beam.runners.portability.portable_runner:portable_runner.py:583 Job state changed to STARTING
INFO apache_beam.runners.portability.portable_runner:portable_runner.py:583 Job state changed to RUNNING
INFO root:portable_runner.py:577 Default Python SDK image for environment is apache/beam_python3.7_sdk:2.42.0.dev
INFO root:portable_runner.py:577 ==================== <function annotate_downstream_side_inputs at 0x7f5c98843050> ====================
INFO root:portable_runner.py:577 ==================== <function fix_side_input_pcoll_coders at 0x7f5c98843170> ====================
INFO root:portable_runner.py:577 ==================== <function pack_combiners at 0x7f5c98843680> ====================
INFO root:portable_runner.py:577 ==================== <function lift_combiners at 0x7f5c98843710> ====================
INFO root:portable_runner.py:577 ==================== <function expand_sdf at 0x7f5c988438c0> ====================
INFO root:portable_runner.py:577 ==================== <function expand_gbk at 0x7f5c98843950> ====================
INFO root:portable_runner.py:577 ==================== <function sink_flattens at 0x7f5c98843a70> ====================
INFO root:portable_runner.py:577 ==================== <function greedily_fuse at 0x7f5c98843b00> ====================
INFO root:portable_runner.py:577 ==================== <function read_to_impulse at 0x7f5c98843b90> ====================
INFO root:portable_runner.py:577 ==================== <function impulse_to_input at 0x7f5c98843c20> ====================
INFO root:portable_runner.py:577 ==================== <function sort_stages at 0x7f5c98843e60> ====================
INFO root:portable_runner.py:577 ==================== <function add_impulse_to_dangling_transforms at 0x7f5c98843f80> ====================
INFO root:portable_runner.py:577 ==================== <function setup_timer_mapping at 0x7f5c98843dd0> ====================
INFO root:portable_runner.py:577 ==================== <function populate_data_channel_coders at 0x7f5c98843ef0> ====================
INFO root:portable_runner.py:577 starting control server on port 37433
INFO root:portable_runner.py:577 starting data server on port 45217
INFO root:portable_runner.py:577 starting state server on port 41143
INFO root:portable_runner.py:577 starting logging server on port 34959
INFO root:portable_runner.py:577 Created Worker handler <apache_beam.runners.portability.fn_api_runner.worker_handlers.DockerSdkWorkerHandler object at 0x7f5c887a31d0> for environment ref_Environment_default_environment_2 (beam:env:docker:v1, b'\n$apache/beam_python3.7_sdk:2.42.0.dev')
INFO root:portable_runner.py:577 Attempting to pull image apache/beam_python3.7_sdk:2.42.0.dev
INFO root:portable_runner.py:577 Unable to pull image apache/beam_python3.7_sdk:2.42.0.dev, defaulting to local image if it exists
INFO root:portable_runner.py:577 Waiting for docker to start up. Current status is running
INFO root:portable_runner.py:577 Docker container is running. container_id = b'569b87369ae4a45c87938e442292af9959d4d01000656494b8c904759cc3dcbc', worker_id = worker_85
INFO root:portable_runner.py:577 Created Worker handler <apache_beam.runners.portability.fn_api_runner.worker_handlers.DockerSdkWorkerHandler object at 0x7f5c986ab8d0> for environment external_9beam:env:docker:v1 (beam:env:docker:v1, b'\n apache/beam_java8_sdk:2.42.0.dev')
INFO root:portable_runner.py:577 Attempting to pull image apache/beam_java8_sdk:2.42.0.dev
INFO root:portable_runner.py:577 Unable to pull image apache/beam_java8_sdk:2.42.0.dev, defaulting to local image if it exists
INFO root:portable_runner.py:577 Waiting for docker to start up. Current status is running
INFO root:portable_runner.py:577 Docker container is running. container_id = b'e9accea9aee9112edde8cb8df2bab4515bb554a1b0811eef6795f5f4a7fbe948', worker_id = worker_86
INFO root:portable_runner.py:577 Completed job in 13.677720785140991 seconds with state DONE.
INFO apache_beam.runners.portability.portable_runner:portable_runner.py:583 Job state changed to DONE
PASSED [100%]
=============================== warnings summary ===============================
../../build/gradleenv/1922375555/lib/python3.7/site-packages/hdfs/config.py:15
<https://ci-beam.apache.org/job/beam_PostCommit_XVR_Direct/ws/src/build/gradleenv/1922375555/lib/python3.7/site-packages/hdfs/config.py>:15: DeprecationWarning: the imp module is deprecated in favour of importlib; see the module's documentation for alternative uses
from imp import load_source
-- Docs: https://docs.pytest.org/en/stable/how-to/capture-warnings.html
- generated xml file: <https://ci-beam.apache.org/job/beam_PostCommit_XVR_Direct/ws/src/sdks/python/pytest_xlangSqlValidateRunner.xml> -
===== 9 passed, 2 skipped, 6541 deselected, 1 warning in 235.16s (0:03:55) =====
> Task :sdks:python:test-suites:direct:xlang:validatesCrossLanguageRunnerCleanup
Stopping expansion service pid: 2928100.
Stopping expansion service pid: 2928101.
> Task :sdks:python:test-suites:direct:xlang:fnApiJobServerCleanup
Killing process at 2925259
FAILURE: Build failed with an exception.
* What went wrong:
Execution failed for task ':sdks:python:test-suites:direct:xlang:validatesCrossLanguageRunnerJavaUsingPython'.
> There were failing tests. See the report at: file://<https://ci-beam.apache.org/job/beam_PostCommit_XVR_Direct/ws/src/sdks/python/test-suites/direct/xlang/build/reports/tests/validatesCrossLanguageRunnerJavaUsingPython/index.html>
* Try:
> Run with --stacktrace option to get the stack trace.
> Run with --info or --debug option to get more log output.
> Run with --scan to get full insights.
* Get more help at https://help.gradle.org
Deprecated Gradle features were used in this build, making it incompatible with Gradle 8.0.
You can use '--warning-mode all' to show the individual deprecation warnings and determine if they come from your own scripts or plugins.
See https://docs.gradle.org/7.4/userguide/command_line_interface.html#sec:command_line_warnings
Execution optimizations have been disabled for 1 invalid unit(s) of work during this build to ensure correctness.
Please consult deprecation warnings for more details.
BUILD FAILED in 26m
247 actionable tasks: 162 executed, 73 from cache, 12 up-to-date
Publishing build scan...
https://gradle.com/s/a5cwy6xtzk2mg
Build step 'Invoke Gradle script' changed build result to FAILURE
Build step 'Invoke Gradle script' marked build as failure
---------------------------------------------------------------------
To unsubscribe, e-mail: builds-unsubscribe@beam.apache.org
For additional commands, e-mail: builds-help@beam.apache.org