You are viewing a plain text version of this content. The canonical link for it is here.
Posted to builds@beam.apache.org by Apache Jenkins Server <je...@builds.apache.org> on 2022/05/13 00:49:18 UTC

Build failed in Jenkins: beam_PostCommit_XVR_Samza #1170

See <https://ci-beam.apache.org/job/beam_PostCommit_XVR_Samza/1170/display/redirect?page=changes>

Changes:

[chamikaramj] Updates CHANGES.md to include some recently discovered known issues

[noreply] [BEAM-14347] Add generic registration feature to CHANGES (#17643)

[noreply] Better test assertion. (#17551)

[noreply] Bump github.com/google/go-cmp from 0.5.7 to 0.5.8 in /sdks (#17628)

[noreply] Bump github.com/testcontainers/testcontainers-go in /sdks (#17627)

[noreply] Bump github.com/lib/pq from 1.10.4 to 1.10.5 in /sdks (#17626)

[noreply] Merge pull request #17584 from [BEAM-14415] Exception handling tests and

[noreply] Bump cloud.google.com/go/pubsub from 1.18.0 to 1.21.1 in /sdks (#17646)

[noreply] Merge pull request #17408 from [BEAM-14312] [Website] change section

[noreply] Bump cloud.google.com/go/bigquery from 1.28.0 to 1.32.0 in /sdks


------------------------------------------
[...truncated 2.27 MB...]
      capabilities: "beam:coder:nullable:v1"
      capabilities: "beam:protocol:multi_core_bundle_processing:v1"
      capabilities: "beam:protocol:progress_reporting:v1"
      capabilities: "beam:protocol:harness_monitoring_infos:v1"
      capabilities: "beam:protocol:control_request_elements_embedding:v1"
      capabilities: "beam:protocol:state_caching:v1"
      capabilities: "beam:version:sdk_base:apache/beam_java8_sdk:2.40.0.dev"
      capabilities: "beam:transform:sdf_truncate_sized_restrictions:v1"
      capabilities: "beam:transform:to_string:v1"
      dependencies: <
        type_urn: "beam:artifact:type:file:v1"
        type_payload: "\nL/tmp/artifacts/icedtea-sound-ebvtNFkfFXg4aaYFuDnwKpwDSjzsaZqlqv5iKxPTr-U.jar\022@79bbed34591f15783869a605b839f02a9c034a3cec699aa5aafe622b13d3afe5"
        role_urn: "beam:artifact:role:staging_to:v1"
        role_payload: "\n=icedtea-sound-ebvtNFkfFXg4aaYFuDnwKpwDSjzsaZqlqv5iKxPTr-U.jar"
      >
      dependencies: <
        type_urn: "beam:artifact:type:file:v1"
        type_payload: "\nF/tmp/artifacts/jaccess-ULFTCPsb6cLYZ0f1BG1FQfczmHNaZCx8plXuRDKpBqE.jar\022@50b15308fb1be9c2d86747f5046d4541f73398735a642c7ca655ee4432a906a1"
        role_urn: "beam:artifact:role:staging_to:v1"
        role_payload: "\n7jaccess-ULFTCPsb6cLYZ0f1BG1FQfczmHNaZCx8plXuRDKpBqE.jar"
      >
      dependencies: <
        type_urn: "beam:artifact:type:file:v1"
        type_payload: "\nI/tmp/artifacts/localedata-dUHqyGxaTVCjfTI8MckPYarZ3_mwf62udkxaHi1aKns.jar\022@7541eac86c5a4d50a37d323c31c90f61aad9dff9b07fadae764c5a1e2d5a2a7b"
        role_urn: "beam:artifact:role:staging_to:v1"
        role_payload: "\n:localedata-dUHqyGxaTVCjfTI8MckPYarZ3_mwf62udkxaHi1aKns.jar"
      >
      dependencies: <
        type_urn: "beam:artifact:type:file:v1"
        type_payload: "\nF/tmp/artifacts/nashorn-XdUndQGroXOP9NCsfITpBERYcbbGXVHLjbvNWXCh-3A.jar\022@5dd5277501aba1738ff4d0ac7c84e904445871b6c65d51cb8dbbcd5970a1fb70"
        role_urn: "beam:artifact:role:staging_to:v1"
        role_payload: "\n7nashorn-XdUndQGroXOP9NCsfITpBERYcbbGXVHLjbvNWXCh-3A.jar"
      >
      dependencies: <
        type_urn: "beam:artifact:type:file:v1"
        type_payload: "\nG/tmp/artifacts/cldrdata-YqzuKX1QnLCOo0cwjKRdBhGrip_ltIJZg-APT60tUPA.jar\022@62acee297d509cb08ea347308ca45d0611ab8a9fe5b4825983e00f4fad2d50f0"
        role_urn: "beam:artifact:role:staging_to:v1"
        role_payload: "\n8cldrdata-YqzuKX1QnLCOo0cwjKRdBhGrip_ltIJZg-APT60tUPA.jar"
      >
      dependencies: <
        type_urn: "beam:artifact:type:file:v1"
        type_payload: "\nD/tmp/artifacts/dnsns-dhEp186udEF6X6chZus-RJzWRmzlccxx1_btlXWayVI.jar\022@761129d7ceae74417a5fa72166eb3e449cd6466ce571cc71d7f6ed95759ac952"
        role_urn: "beam:artifact:role:staging_to:v1"
        role_payload: "\n5dnsns-dhEp186udEF6X6chZus-RJzWRmzlccxx1_btlXWayVI.jar"
      >
      dependencies: <
        type_urn: "beam:artifact:type:file:v1"
        type_payload: "\nr/tmp/artifacts/beam-sdks-java-io-expansion-service-2.40.0-SNAPSHOT-oOeA76oG_oEF53endk6AIQxfsmU5x4H9IcHOFSVo57o.jar\022@a0e780efaa06fe8105e777a7764e80210c5fb26539c781fd21c1ce152568e7ba"
        role_urn: "beam:artifact:role:staging_to:v1"
        role_payload: "\ncbeam-sdks-java-io-expansion-service-2.40.0-SNAPSHOT-oOeA76oG_oEF53endk6AIQxfsmU5x4H9IcHOFSVo57o.jar"
      >
    >
  >
  environments: <
    key: "go"
    value: <
      urn: "beam:env:docker:v1"
      payload: "\n\026apache/beam_go_sdk:dev"
      capabilities: "beam:protocol:progress_reporting:v0"
      capabilities: "beam:protocol:multi_core_bundle_processing:v1"
      capabilities: "beam:version:sdk_base:go"
      capabilities: "beam:coder:bytes:v1"
      capabilities: "beam:coder:bool:v1"
      capabilities: "beam:coder:varint:v1"
      capabilities: "beam:coder:double:v1"
      capabilities: "beam:coder:string_utf8:v1"
      capabilities: "beam:coder:length_prefix:v1"
      capabilities: "beam:coder:kv:v1"
      capabilities: "beam:coder:iterable:v1"
      capabilities: "beam:coder:state_backed_iterable:v1"
      capabilities: "beam:coder:windowed_value:v1"
      capabilities: "beam:coder:global_window:v1"
      capabilities: "beam:coder:interval_window:v1"
      capabilities: "beam:coder:row:v1"
      capabilities: "beam:coder:nullable:v1"
      dependencies: <
        type_urn: "beam:artifact:type:file:v1"
        role_urn: "beam:artifact:role:go_worker_binary:v1"
      >
    >
  >
>
root_transform_ids: "s1"
root_transform_ids: "e4"
root_transform_ids: "e5"
root_transform_ids: "s3"
requirements: "beam:requirement:pardo:splittable_dofn:v1"
2022/05/13 00:29:02 Cross-compiling <https://ci-beam.apache.org/job/beam_PostCommit_XVR_Samza/ws/src/sdks/go/test/integration/io/xlang/kafka/kafka_test.go> as /tmp/worker-2-1652401742880309249
2022/05/13 00:29:06 Prepared job with id: go-testkafkaio_basicreadwrite_b1f94e31-36a4-41f5-a012-fc91034909d3 and staging token: go-testkafkaio_basicreadwrite_b1f94e31-36a4-41f5-a012-fc91034909d3
2022/05/13 00:29:06 Staged binary artifact with token: 
2022/05/13 00:29:06 Submitted job: go0testkafkaio0basicreadwrite-jenkins-0513002906-5830250f_b533e229-2ad6-42fd-bf11-cc24437b390a
2022/05/13 00:29:06 Job state: STOPPED
2022/05/13 00:29:06 Job state: STARTING
2022/05/13 00:29:06 Job state: RUNNING
2022/05/13 00:29:25 Job state: DONE
--- PASS: TestKafkaIO_BasicReadWrite (57.74s)
PASS
ok  	github.com/apache/beam/sdks/v2/go/test/integration/io/xlang/kafka	63.779s
FAIL
$ TEST_EXIT_CODE=0
$ cd ../..
$ exit 1
$ exit 1

> Task :runners:samza:job-server:validatesCrossLanguageRunnerGoUsingJava FAILED
> Task :runners:samza:job-server:validatesCrossLanguageRunnerJavaUsingJava
> Task :runners:samza:job-server:validatesCrossLanguageRunnerJavaUsingPython
> Task :runners:samza:job-server:validatesCrossLanguageRunnerJavaUsingPythonOnly

> Task :runners:samza:job-server:validatesCrossLanguageRunnerPythonUsingJava
>>> RUNNING integration tests with pipeline options: --runner=PortableRunner --job_endpoint=localhost:39513 --environment_cache_millis=10000 --experiments=beam_fn_api
>>>   pytest options: 
>>>   collect markers: -m=xlang_transforms
============================= test session starts ==============================
platform linux -- Python 3.9.10, pytest-4.6.11, py-1.11.0, pluggy-0.13.1
rootdir: <https://ci-beam.apache.org/job/beam_PostCommit_XVR_Samza/ws/src/sdks/python,> inifile: pytest.ini
plugins: xdist-1.34.0, timeout-1.4.2, forked-1.4.0, requests-mock-1.9.3
timeout: 600.0s
timeout method: signal
timeout func_only: False
collected 5582 items / 5572 deselected / 1 skipped / 9 selected

apache_beam/io/external/generate_sequence_test.py ...                    [ 30%]
apache_beam/transforms/validate_runner_xlang_test.py .......             [100%]

=============================== warnings summary ===============================
apache_beam/io/filesystems_test.py:54
  <https://ci-beam.apache.org/job/beam_PostCommit_XVR_Samza/ws/src/sdks/python/apache_beam/io/filesystems_test.py>:54: DeprecationWarning: invalid escape sequence \c
    self.assertIsNone(FileSystems.get_scheme('c:\\abc\cdf'))  # pylint: disable=anomalous-backslash-in-string

apache_beam/io/filesystems_test.py:62
  <https://ci-beam.apache.org/job/beam_PostCommit_XVR_Samza/ws/src/sdks/python/apache_beam/io/filesystems_test.py>:62: DeprecationWarning: invalid escape sequence \d
    self.assertTrue(isinstance(FileSystems.get_filesystem('c:\\abc\def'),  # pylint: disable=anomalous-backslash-in-string

<unknown>:54
  <unknown>:54: DeprecationWarning: invalid escape sequence \c

<unknown>:62
  <unknown>:62: DeprecationWarning: invalid escape sequence \d

<https://ci-beam.apache.org/job/beam_PostCommit_XVR_Samza/ws/src/build/gradleenv/1922375555/lib/python3.9/site-packages/tenacity/_asyncio.py>:42
  <https://ci-beam.apache.org/job/beam_PostCommit_XVR_Samza/ws/src/build/gradleenv/1922375555/lib/python3.9/site-packages/tenacity/_asyncio.py>:42: DeprecationWarning: "@coroutine" decorator is deprecated since Python 3.8, use "async def" instead
    def call(self, fn, *args, **kwargs):

-- Docs: https://docs.pytest.org/en/latest/warnings.html
- generated xml file: <https://ci-beam.apache.org/job/beam_PostCommit_XVR_Samza/ws/src/sdks/python/pytest_xlangValidateRunner.xml> -
===== 10 passed, 1 skipped, 5572 deselected, 5 warnings in 123.23 seconds ======

> Task :runners:samza:job-server:validatesCrossLanguageRunnerPythonUsingPython
>>> RUNNING integration tests with pipeline options: --runner=PortableRunner --job_endpoint=localhost:39513 --environment_cache_millis=10000 --experiments=beam_fn_api
>>>   pytest options: 
>>>   collect markers: -m=xlang_transforms
============================= test session starts ==============================
platform linux -- Python 3.9.10, pytest-4.6.11, py-1.11.0, pluggy-0.13.1
rootdir: <https://ci-beam.apache.org/job/beam_PostCommit_XVR_Samza/ws/src/sdks/python,> inifile: pytest.ini
plugins: xdist-1.34.0, timeout-1.4.2, forked-1.4.0, requests-mock-1.9.3
timeout: 600.0s
timeout method: signal
timeout func_only: False
collected 5582 items / 5572 deselected / 1 skipped / 9 selected

apache_beam/io/external/generate_sequence_test.py .ss                    [ 30%]
apache_beam/transforms/validate_runner_xlang_test.py .......             [100%]

=============================== warnings summary ===============================
<unknown>:54
  <unknown>:54: DeprecationWarning: invalid escape sequence \c

<unknown>:62
  <unknown>:62: DeprecationWarning: invalid escape sequence \d

<https://ci-beam.apache.org/job/beam_PostCommit_XVR_Samza/ws/src/build/gradleenv/1922375555/lib/python3.9/site-packages/tenacity/_asyncio.py>:42
  <https://ci-beam.apache.org/job/beam_PostCommit_XVR_Samza/ws/src/build/gradleenv/1922375555/lib/python3.9/site-packages/tenacity/_asyncio.py>:42: DeprecationWarning: "@coroutine" decorator is deprecated since Python 3.8, use "async def" instead
    def call(self, fn, *args, **kwargs):

-- Docs: https://docs.pytest.org/en/latest/warnings.html
- generated xml file: <https://ci-beam.apache.org/job/beam_PostCommit_XVR_Samza/ws/src/sdks/python/pytest_xlangValidateRunner.xml> -
====== 8 passed, 3 skipped, 5572 deselected, 3 warnings in 77.03 seconds =======

> Task :runners:samza:job-server:validatesCrossLanguageRunnerPythonUsingSql
>>> RUNNING integration tests with pipeline options: --runner=PortableRunner --job_endpoint=localhost:39513 --environment_cache_millis=10000 --experiments=beam_fn_api
>>>   pytest options: 
>>>   collect markers: -m=xlang_sql_expansion_service
============================= test session starts ==============================
platform linux -- Python 3.9.10, pytest-4.6.11, py-1.11.0, pluggy-0.13.1
rootdir: <https://ci-beam.apache.org/job/beam_PostCommit_XVR_Samza/ws/src/sdks/python,> inifile: pytest.ini
plugins: xdist-1.34.0, timeout-1.4.2, forked-1.4.0, requests-mock-1.9.3
timeout: 600.0s
timeout method: signal
timeout func_only: False
collected 5582 items / 5573 deselected / 1 skipped / 8 selected

apache_beam/transforms/sql_test.py .........                             [100%]

=============================== warnings summary ===============================
<unknown>:54
  <unknown>:54: DeprecationWarning: invalid escape sequence \c

<unknown>:62
  <unknown>:62: DeprecationWarning: invalid escape sequence \d

<https://ci-beam.apache.org/job/beam_PostCommit_XVR_Samza/ws/src/build/gradleenv/1922375555/lib/python3.9/site-packages/tenacity/_asyncio.py>:42
  <https://ci-beam.apache.org/job/beam_PostCommit_XVR_Samza/ws/src/build/gradleenv/1922375555/lib/python3.9/site-packages/tenacity/_asyncio.py>:42: DeprecationWarning: "@coroutine" decorator is deprecated since Python 3.8, use "async def" instead
    def call(self, fn, *args, **kwargs):

-- Docs: https://docs.pytest.org/en/latest/warnings.html
- generated xml file: <https://ci-beam.apache.org/job/beam_PostCommit_XVR_Samza/ws/src/sdks/python/pytest_xlangSqlValidateRunner.xml> -
====== 9 passed, 1 skipped, 5573 deselected, 3 warnings in 231.49 seconds ======

> Task :runners:samza:job-server:validatesCrossLanguageRunnerCleanup
Stopping expansion service pid: 2585507.
Stopping expansion service pid: 2585508.

> Task :runners:samza:job-server:samzaJobServerCleanup
Stopping job server pid: 2571711.

FAILURE: Build failed with an exception.

* Where:
Build file '<https://ci-beam.apache.org/job/beam_PostCommit_XVR_Samza/ws/src/sdks/go/test/build.gradle'> line: 195

* What went wrong:
Execution failed for task ':runners:samza:job-server:validatesCrossLanguageRunnerGoUsingJava'.
> Process 'command 'sh'' finished with non-zero exit value 1

* Try:
> Run with --stacktrace option to get the stack trace.
> Run with --info or --debug option to get more log output.
> Run with --scan to get full insights.

* Get more help at https://help.gradle.org

Deprecated Gradle features were used in this build, making it incompatible with Gradle 8.0.

You can use '--warning-mode all' to show the individual deprecation warnings and determine if they come from your own scripts or plugins.

See https://docs.gradle.org/7.4/userguide/command_line_interface.html#sec:command_line_warnings

Execution optimizations have been disabled for 1 invalid unit(s) of work during this build to ensure correctness.
Please consult deprecation warnings for more details.

BUILD FAILED in 34m 3s
231 actionable tasks: 35 executed, 196 up-to-date

Publishing build scan...
https://gradle.com/s/hpiasauwcbare

Build step 'Invoke Gradle script' changed build result to FAILURE
Build step 'Invoke Gradle script' marked build as failure

---------------------------------------------------------------------
To unsubscribe, e-mail: builds-unsubscribe@beam.apache.org
For additional commands, e-mail: builds-help@beam.apache.org


Jenkins build is back to normal : beam_PostCommit_XVR_Samza #1171

Posted by Apache Jenkins Server <je...@builds.apache.org>.
See <https://ci-beam.apache.org/job/beam_PostCommit_XVR_Samza/1171/display/redirect?page=changes>


---------------------------------------------------------------------
To unsubscribe, e-mail: builds-unsubscribe@beam.apache.org
For additional commands, e-mail: builds-help@beam.apache.org