You are viewing a plain text version of this content. The canonical link for it is here.
Posted to commits@beam.apache.org by Apache Jenkins Server <je...@builds.apache.org> on 2017/09/25 06:12:52 UTC

Jenkins build is still unstable: beam_PostCommit_Java_ValidatesRunner_Flink #3917

See <https://builds.apache.org/job/beam_PostCommit_Java_ValidatesRunner_Flink/3917/display/redirect>


Jenkins build is back to normal : beam_PostCommit_Java_ValidatesRunner_Flink #3946

Posted by Apache Jenkins Server <je...@builds.apache.org>.
See <https://builds.apache.org/job/beam_PostCommit_Java_ValidatesRunner_Flink/3946/display/redirect>


Build failed in Jenkins: beam_PostCommit_Java_ValidatesRunner_Flink #3945

Posted by Apache Jenkins Server <je...@builds.apache.org>.
See <https://builds.apache.org/job/beam_PostCommit_Java_ValidatesRunner_Flink/3945/display/redirect>

------------------------------------------
[...truncated 489.18 KB...]
2017-09-28T09:53:44.672 [INFO] Downloading: https://repo.maven.apache.org/maven2/log4j/log4j/1.2.16/log4j-1.2.16.pom
2017-09-28T09:53:44.699 [INFO] Downloaded: https://repo.maven.apache.org/maven2/log4j/log4j/1.2.16/log4j-1.2.16.pom (20 KB at 735.7 KB/sec)
2017-09-28T09:53:44.703 [INFO] Downloading: https://repo.maven.apache.org/maven2/org/javassist/javassist/3.18.1-GA/javassist-3.18.1-GA.pom
2017-09-28T09:53:44.729 [INFO] Downloaded: https://repo.maven.apache.org/maven2/org/javassist/javassist/3.18.1-GA/javassist-3.18.1-GA.pom (10 KB at 372.0 KB/sec)
2017-09-28T09:53:44.749 [INFO] Downloading: https://repo.maven.apache.org/maven2/org/apache/flink/flink-clients_2.10/1.3.0/flink-clients_2.10-1.3.0.jar
2017-09-28T09:53:44.750 [INFO] Downloading: https://repo.maven.apache.org/maven2/org/apache/flink/flink-optimizer_2.10/1.3.0/flink-optimizer_2.10-1.3.0.jar
2017-09-28T09:53:44.751 [INFO] Downloading: https://repo.maven.apache.org/maven2/org/apache/flink/flink-annotations/1.3.0/flink-annotations-1.3.0.jar
2017-09-28T09:53:44.751 [INFO] Downloading: https://repo.maven.apache.org/maven2/org/apache/flink/force-shading/1.3.0/force-shading-1.3.0.jar
2017-09-28T09:53:44.752 [INFO] Downloading: https://repo.maven.apache.org/maven2/org/apache/flink/flink-core/1.3.0/flink-core-1.3.0.jar
2017-09-28T09:53:44.781 [INFO] Downloaded: https://repo.maven.apache.org/maven2/org/apache/flink/flink-annotations/1.3.0/flink-annotations-1.3.0.jar (8 KB at 232.6 KB/sec)
2017-09-28T09:53:44.781 [INFO] Downloading: https://repo.maven.apache.org/maven2/com/esotericsoftware/kryo/kryo/2.24.0/kryo-2.24.0.jar
2017-09-28T09:53:44.791 [INFO] Downloaded: https://repo.maven.apache.org/maven2/org/apache/flink/force-shading/1.3.0/force-shading-1.3.0.jar (8 KB at 173.4 KB/sec)
2017-09-28T09:53:44.791 [INFO] Downloading: https://repo.maven.apache.org/maven2/org/objenesis/objenesis/2.1/objenesis-2.1.jar
2017-09-28T09:53:44.802 [INFO] Downloaded: https://repo.maven.apache.org/maven2/org/apache/flink/flink-clients_2.10/1.3.0/flink-clients_2.10-1.3.0.jar (89 KB at 1673.7 KB/sec)
2017-09-28T09:53:44.802 [INFO] Downloading: https://repo.maven.apache.org/maven2/org/apache/flink/flink-metrics-core/1.3.0/flink-metrics-core-1.3.0.jar
2017-09-28T09:53:44.822 [INFO] Downloaded: https://repo.maven.apache.org/maven2/org/objenesis/objenesis/2.1/objenesis-2.1.jar (41 KB at 574.3 KB/sec)
2017-09-28T09:53:44.822 [INFO] Downloading: https://repo.maven.apache.org/maven2/org/apache/flink/flink-java/1.3.0/flink-java-1.3.0.jar
2017-09-28T09:53:44.836 [INFO] Downloaded: https://repo.maven.apache.org/maven2/org/apache/flink/flink-metrics-core/1.3.0/flink-metrics-core-1.3.0.jar (16 KB at 183.7 KB/sec)
2017-09-28T09:53:44.836 [INFO] Downloading: https://repo.maven.apache.org/maven2/org/apache/flink/flink-shaded-hadoop2/1.3.0/flink-shaded-hadoop2-1.3.0.jar
2017-09-28T09:53:44.891 [INFO] Downloaded: https://repo.maven.apache.org/maven2/com/esotericsoftware/kryo/kryo/2.24.0/kryo-2.24.0.jar (332 KB at 2349.9 KB/sec)
2017-09-28T09:53:44.892 [INFO] Downloading: https://repo.maven.apache.org/maven2/xmlenc/xmlenc/0.52/xmlenc-0.52.jar
2017-09-28T09:53:44.919 [INFO] Downloaded: https://repo.maven.apache.org/maven2/xmlenc/xmlenc/0.52/xmlenc-0.52.jar (15 KB at 87.3 KB/sec)
2017-09-28T09:53:44.919 [INFO] Downloading: https://repo.maven.apache.org/maven2/commons-codec/commons-codec/1.4/commons-codec-1.4.jar
2017-09-28T09:53:44.952 [INFO] Downloaded: https://repo.maven.apache.org/maven2/commons-codec/commons-codec/1.4/commons-codec-1.4.jar (57 KB at 282.6 KB/sec)
2017-09-28T09:53:44.952 [INFO] Downloading: https://repo.maven.apache.org/maven2/commons-net/commons-net/3.1/commons-net-3.1.jar
2017-09-28T09:53:45.018 [INFO] Downloaded: https://repo.maven.apache.org/maven2/org/apache/flink/flink-core/1.3.0/flink-core-1.3.0.jar (1362 KB at 5080.2 KB/sec)
2017-09-28T09:53:45.018 [INFO] Downloading: https://repo.maven.apache.org/maven2/org/mortbay/jetty/jetty-util/6.1.26/jetty-util-6.1.26.jar
2017-09-28T09:53:45.029 [INFO] Downloaded: https://repo.maven.apache.org/maven2/commons-net/commons-net/3.1/commons-net-3.1.jar (267 KB at 960.3 KB/sec)
2017-09-28T09:53:45.029 [INFO] Downloading: https://repo.maven.apache.org/maven2/com/sun/jersey/jersey-core/1.9/jersey-core-1.9.jar
2017-09-28T09:53:45.076 [INFO] Downloaded: https://repo.maven.apache.org/maven2/org/apache/flink/flink-java/1.3.0/flink-java-1.3.0.jar (752 KB at 2313.5 KB/sec)
2017-09-28T09:53:45.076 [INFO] Downloading: https://repo.maven.apache.org/maven2/commons-el/commons-el/1.0/commons-el-1.0.jar
2017-09-28T09:53:45.087 [INFO] Downloaded: https://repo.maven.apache.org/maven2/org/mortbay/jetty/jetty-util/6.1.26/jetty-util-6.1.26.jar (173 KB at 514.8 KB/sec)
2017-09-28T09:53:45.088 [INFO] Downloading: https://repo.maven.apache.org/maven2/commons-logging/commons-logging/1.1.3/commons-logging-1.1.3.jar
2017-09-28T09:53:45.131 [INFO] Downloaded: https://repo.maven.apache.org/maven2/commons-el/commons-el/1.0/commons-el-1.0.jar (110 KB at 288.7 KB/sec)
2017-09-28T09:53:45.131 [INFO] Downloading: https://repo.maven.apache.org/maven2/com/jamesmurty/utils/java-xmlbuilder/0.4/java-xmlbuilder-0.4.jar
2017-09-28T09:53:45.131 [INFO] Downloaded: https://repo.maven.apache.org/maven2/commons-logging/commons-logging/1.1.3/commons-logging-1.1.3.jar (61 KB at 159.5 KB/sec)
2017-09-28T09:53:45.131 [INFO] Downloading: https://repo.maven.apache.org/maven2/commons-configuration/commons-configuration/1.7/commons-configuration-1.7.jar
2017-09-28T09:53:45.158 [INFO] Downloaded: https://repo.maven.apache.org/maven2/com/jamesmurty/utils/java-xmlbuilder/0.4/java-xmlbuilder-0.4.jar (19 KB at 44.4 KB/sec)
2017-09-28T09:53:45.158 [INFO] Downloading: https://repo.maven.apache.org/maven2/commons-digester/commons-digester/1.8.1/commons-digester-1.8.1.jar
2017-09-28T09:53:45.171 [INFO] Downloaded: https://repo.maven.apache.org/maven2/com/sun/jersey/jersey-core/1.9/jersey-core-1.9.jar (448 KB at 1066.6 KB/sec)
2017-09-28T09:53:45.171 [INFO] Downloading: https://repo.maven.apache.org/maven2/com/jcraft/jsch/0.1.42/jsch-0.1.42.jar
2017-09-28T09:53:45.217 [INFO] Downloaded: https://repo.maven.apache.org/maven2/commons-digester/commons-digester/1.8.1/commons-digester-1.8.1.jar (143 KB at 306.2 KB/sec)
2017-09-28T09:53:45.217 [INFO] Downloading: https://repo.maven.apache.org/maven2/commons-beanutils/commons-beanutils-bean-collections/1.8.3/commons-beanutils-bean-collections-1.8.3.jar
2017-09-28T09:53:45.235 [INFO] Downloaded: https://repo.maven.apache.org/maven2/commons-configuration/commons-configuration/1.7/commons-configuration-1.7.jar (343 KB at 706.9 KB/sec)
2017-09-28T09:53:45.235 [INFO] Downloading: https://repo.maven.apache.org/maven2/commons-daemon/commons-daemon/1.0.13/commons-daemon-1.0.13.jar
2017-09-28T09:53:45.241 [INFO] Downloaded: https://repo.maven.apache.org/maven2/com/jcraft/jsch/0.1.42/jsch-0.1.42.jar (182 KB at 370.2 KB/sec)
2017-09-28T09:53:45.241 [INFO] Downloading: https://repo.maven.apache.org/maven2/javax/xml/bind/jaxb-api/2.2.2/jaxb-api-2.2.2.jar
2017-09-28T09:53:45.246 [INFO] Downloaded: https://repo.maven.apache.org/maven2/org/apache/flink/flink-optimizer_2.10/1.3.0/flink-optimizer_2.10-1.3.0.jar (2679 KB at 5390.2 KB/sec)
2017-09-28T09:53:45.246 [INFO] Downloading: https://repo.maven.apache.org/maven2/javax/xml/stream/stax-api/1.0-2/stax-api-1.0-2.jar
2017-09-28T09:53:45.246 [INFO] Downloaded: https://repo.maven.apache.org/maven2/commons-beanutils/commons-beanutils-bean-collections/1.8.3/commons-beanutils-bean-collections-1.8.3.jar (26 KB at 52.4 KB/sec)
2017-09-28T09:53:45.247 [INFO] Downloading: https://repo.maven.apache.org/maven2/javax/activation/activation/1.1/activation-1.1.jar
2017-09-28T09:53:45.263 [INFO] Downloaded: https://repo.maven.apache.org/maven2/commons-daemon/commons-daemon/1.0.13/commons-daemon-1.0.13.jar (24 KB at 46.2 KB/sec)
2017-09-28T09:53:45.263 [INFO] Downloading: https://repo.maven.apache.org/maven2/org/apache/commons/commons-math3/3.5/commons-math3-3.5.jar
2017-09-28T09:53:45.285 [INFO] Downloaded: https://repo.maven.apache.org/maven2/javax/xml/stream/stax-api/1.0-2/stax-api-1.0-2.jar (23 KB at 42.7 KB/sec)
2017-09-28T09:53:45.285 [INFO] Downloaded: https://repo.maven.apache.org/maven2/javax/xml/bind/jaxb-api/2.2.2/jaxb-api-2.2.2.jar (103 KB at 192.3 KB/sec)
2017-09-28T09:53:45.285 [INFO] Downloading: https://repo.maven.apache.org/maven2/io/netty/netty-all/4.0.27.Final/netty-all-4.0.27.Final.jar
2017-09-28T09:53:45.285 [INFO] Downloading: https://repo.maven.apache.org/maven2/org/apache/flink/flink-runtime_2.10/1.3.0/flink-runtime_2.10-1.3.0.jar
2017-09-28T09:53:45.286 [INFO] Downloaded: https://repo.maven.apache.org/maven2/javax/activation/activation/1.1/activation-1.1.jar (62 KB at 115.0 KB/sec)
2017-09-28T09:53:45.300 [INFO] Downloading: https://repo.maven.apache.org/maven2/org/javassist/javassist/3.18.2-GA/javassist-3.18.2-GA.jar
2017-09-28T09:53:45.527 [INFO] Downloaded: https://repo.maven.apache.org/maven2/org/javassist/javassist/3.18.2-GA/javassist-3.18.2-GA.jar (698 KB at 899.2 KB/sec)
2017-09-28T09:53:45.528 [INFO] Downloading: https://repo.maven.apache.org/maven2/org/scala-lang/scala-library/2.10.4/scala-library-2.10.4.jar
2017-09-28T09:53:45.707 [INFO] Downloaded: https://repo.maven.apache.org/maven2/io/netty/netty-all/4.0.27.Final/netty-all-4.0.27.Final.jar (1894 KB at 1981.1 KB/sec)
2017-09-28T09:53:45.708 [INFO] Downloading: https://repo.maven.apache.org/maven2/com/data-artisans/flakka-actor_2.10/2.3-custom/flakka-actor_2.10-2.3-custom.jar
2017-09-28T09:53:45.833 [INFO] Downloaded: https://repo.maven.apache.org/maven2/org/apache/commons/commons-math3/3.5/commons-math3-3.5.jar (1991 KB at 1839.8 KB/sec)
2017-09-28T09:53:45.833 [INFO] Downloading: https://repo.maven.apache.org/maven2/com/typesafe/config/1.2.1/config-1.2.1.jar
2017-09-28T09:53:45.920 [INFO] Downloaded: https://repo.maven.apache.org/maven2/com/typesafe/config/1.2.1/config-1.2.1.jar (215 KB at 183.4 KB/sec)
2017-09-28T09:53:45.920 [INFO] Downloading: https://repo.maven.apache.org/maven2/com/data-artisans/flakka-remote_2.10/2.3-custom/flakka-remote_2.10-2.3-custom.jar
2017-09-28T09:53:46.245 [INFO] Downloaded: https://repo.maven.apache.org/maven2/com/data-artisans/flakka-remote_2.10/2.3-custom/flakka-remote_2.10-2.3-custom.jar (1347 KB at 901.6 KB/sec)
2017-09-28T09:53:46.245 [INFO] Downloading: https://repo.maven.apache.org/maven2/io/netty/netty/3.8.0.Final/netty-3.8.0.Final.jar
2017-09-28T09:53:46.283 [INFO] Downloaded: https://repo.maven.apache.org/maven2/com/data-artisans/flakka-actor_2.10/2.3-custom/flakka-actor_2.10-2.3-custom.jar (2754 KB at 1797.3 KB/sec)
2017-09-28T09:53:46.283 [INFO] Downloading: https://repo.maven.apache.org/maven2/org/uncommons/maths/uncommons-maths/1.2.2a/uncommons-maths-1.2.2a.jar
2017-09-28T09:53:46.315 [INFO] Downloaded: https://repo.maven.apache.org/maven2/org/uncommons/maths/uncommons-maths/1.2.2a/uncommons-maths-1.2.2a.jar (48 KB at 30.6 KB/sec)
2017-09-28T09:53:46.315 [INFO] Downloading: https://repo.maven.apache.org/maven2/com/data-artisans/flakka-slf4j_2.10/2.3-custom/flakka-slf4j_2.10-2.3-custom.jar
2017-09-28T09:53:46.342 [INFO] Downloaded: https://repo.maven.apache.org/maven2/com/data-artisans/flakka-slf4j_2.10/2.3-custom/flakka-slf4j_2.10-2.3-custom.jar (16 KB at 9.5 KB/sec)
2017-09-28T09:53:46.342 [INFO] Downloading: https://repo.maven.apache.org/maven2/org/clapper/grizzled-slf4j_2.10/1.0.2/grizzled-slf4j_2.10-1.0.2.jar
2017-09-28T09:53:46.367 [INFO] Downloaded: https://repo.maven.apache.org/maven2/org/clapper/grizzled-slf4j_2.10/1.0.2/grizzled-slf4j_2.10-1.0.2.jar (7 KB at 3.9 KB/sec)
2017-09-28T09:53:46.367 [INFO] Downloading: https://repo.maven.apache.org/maven2/com/github/scopt/scopt_2.10/3.5.0/scopt_2.10-3.5.0.jar
2017-09-28T09:53:46.432 [INFO] Downloaded: https://repo.maven.apache.org/maven2/com/github/scopt/scopt_2.10/3.5.0/scopt_2.10-3.5.0.jar (140 KB at 83.2 KB/sec)
2017-09-28T09:53:46.432 [INFO] Downloading: https://repo.maven.apache.org/maven2/org/apache/zookeeper/zookeeper/3.4.6/zookeeper-3.4.6.jar
2017-09-28T09:53:46.565 [INFO] Downloaded: https://repo.maven.apache.org/maven2/org/apache/zookeeper/zookeeper/3.4.6/zookeeper-3.4.6.jar (775 KB at 426.9 KB/sec)
2017-09-28T09:53:46.565 [INFO] Downloading: https://repo.maven.apache.org/maven2/jline/jline/0.9.94/jline-0.9.94.jar
2017-09-28T09:53:46.615 [INFO] Downloaded: https://repo.maven.apache.org/maven2/jline/jline/0.9.94/jline-0.9.94.jar (86 KB at 45.8 KB/sec)
2017-09-28T09:53:46.615 [INFO] Downloading: https://repo.maven.apache.org/maven2/com/twitter/chill_2.10/0.7.4/chill_2.10-0.7.4.jar
2017-09-28T09:53:46.616 [INFO] Downloaded: https://repo.maven.apache.org/maven2/io/netty/netty/3.8.0.Final/netty-3.8.0.Final.jar (1202 KB at 644.2 KB/sec)
2017-09-28T09:53:46.616 [INFO] Downloading: https://repo.maven.apache.org/maven2/com/twitter/chill-java/0.7.4/chill-java-0.7.4.jar
2017-09-28T09:53:46.660 [INFO] Downloaded: https://repo.maven.apache.org/maven2/com/twitter/chill-java/0.7.4/chill-java-0.7.4.jar (50 KB at 25.8 KB/sec)
2017-09-28T09:53:46.660 [INFO] Downloading: https://repo.maven.apache.org/maven2/org/apache/flink/flink-streaming-java_2.10/1.3.0/flink-streaming-java_2.10-1.3.0.jar
2017-09-28T09:53:46.697 [INFO] Downloaded: https://repo.maven.apache.org/maven2/com/twitter/chill_2.10/0.7.4/chill_2.10-0.7.4.jar (217 KB at 111.0 KB/sec)
2017-09-28T09:53:46.697 [INFO] Downloading: https://repo.maven.apache.org/maven2/org/apache/sling/org.apache.sling.commons.json/2.0.6/org.apache.sling.commons.json-2.0.6.jar
2017-09-28T09:53:46.728 [INFO] Downloaded: https://repo.maven.apache.org/maven2/org/apache/sling/org.apache.sling.commons.json/2.0.6/org.apache.sling.commons.json-2.0.6.jar (47 KB at 23.7 KB/sec)
2017-09-28T09:53:46.728 [INFO] Downloading: https://repo.maven.apache.org/maven2/org/apache/flink/flink-core/1.3.0/flink-core-1.3.0-tests.jar
2017-09-28T09:53:46.928 [INFO] Downloaded: https://repo.maven.apache.org/maven2/org/scala-lang/scala-library/2.10.4/scala-library-2.10.4.jar (6960 KB at 3196.8 KB/sec)
2017-09-28T09:53:46.928 [INFO] Downloading: https://repo.maven.apache.org/maven2/org/apache/flink/flink-runtime_2.10/1.3.0/flink-runtime_2.10-1.3.0-tests.jar
2017-09-28T09:53:46.957 [INFO] Downloaded: https://repo.maven.apache.org/maven2/org/apache/flink/flink-core/1.3.0/flink-core-1.3.0-tests.jar (753 KB at 340.9 KB/sec)
2017-09-28T09:53:46.957 [INFO] Downloading: https://repo.maven.apache.org/maven2/com/google/apis/google-api-services-bigquery/v2-rev355-1.22.0/google-api-services-bigquery-v2-rev355-1.22.0.jar
2017-09-28T09:53:47.004 [INFO] Downloaded: https://repo.maven.apache.org/maven2/com/google/apis/google-api-services-bigquery/v2-rev355-1.22.0/google-api-services-bigquery-v2-rev355-1.22.0.jar (107 KB at 47.4 KB/sec)
2017-09-28T09:53:47.004 [INFO] Downloading: https://repo.maven.apache.org/maven2/com/google/api-client/google-api-client/1.22.0/google-api-client-1.22.0.jar
2017-09-28T09:53:47.084 [INFO] Downloaded: https://repo.maven.apache.org/maven2/com/google/api-client/google-api-client/1.22.0/google-api-client-1.22.0.jar (195 KB at 83.4 KB/sec)
2017-09-28T09:53:47.084 [INFO] Downloading: https://repo.maven.apache.org/maven2/com/google/oauth-client/google-oauth-client/1.22.0/google-oauth-client-1.22.0.jar
2017-09-28T09:53:47.124 [INFO] Downloaded: https://repo.maven.apache.org/maven2/com/google/oauth-client/google-oauth-client/1.22.0/google-oauth-client-1.22.0.jar (60 KB at 25.2 KB/sec)
2017-09-28T09:53:47.124 [INFO] Downloading: https://repo.maven.apache.org/maven2/com/google/http-client/google-http-client/1.22.0/google-http-client-1.22.0.jar
2017-09-28T09:53:47.237 [INFO] Downloaded: https://repo.maven.apache.org/maven2/com/google/http-client/google-http-client/1.22.0/google-http-client-1.22.0.jar (349 KB at 140.2 KB/sec)
2017-09-28T09:53:47.237 [INFO] Downloading: https://repo.maven.apache.org/maven2/org/apache/httpcomponents/httpclient/4.0.1/httpclient-4.0.1.jar
2017-09-28T09:53:47.332 [INFO] Downloaded: https://repo.maven.apache.org/maven2/org/apache/httpcomponents/httpclient/4.0.1/httpclient-4.0.1.jar (285 KB at 110.1 KB/sec)
2017-09-28T09:53:47.332 [INFO] Downloading: https://repo.maven.apache.org/maven2/com/google/http-client/google-http-client-jackson2/1.22.0/google-http-client-jackson2-1.22.0.jar
2017-09-28T09:53:47.340 [INFO] Downloaded: https://repo.maven.apache.org/maven2/org/apache/flink/flink-runtime_2.10/1.3.0/flink-runtime_2.10-1.3.0.jar (9005 KB at 3477.8 KB/sec)
2017-09-28T09:53:47.340 [INFO] Downloading: https://repo.maven.apache.org/maven2/org/apache/flink/flink-streaming-java_2.10/1.3.0/flink-streaming-java_2.10-1.3.0-tests.jar
2017-09-28T09:53:47.358 [INFO] Downloaded: https://repo.maven.apache.org/maven2/com/google/http-client/google-http-client-jackson2/1.22.0/google-http-client-jackson2-1.22.0.jar (7 KB at 2.5 KB/sec)
2017-09-28T09:53:47.358 [INFO] Downloading: https://repo.maven.apache.org/maven2/org/apache/flink/flink-test-utils_2.10/1.3.0/flink-test-utils_2.10-1.3.0.jar
2017-09-28T09:53:47.402 [INFO] Downloaded: https://repo.maven.apache.org/maven2/org/apache/flink/flink-streaming-java_2.10/1.3.0/flink-streaming-java_2.10-1.3.0.jar (3128 KB at 1179.7 KB/sec)
2017-09-28T09:53:47.402 [INFO] Downloading: https://repo.maven.apache.org/maven2/org/apache/flink/flink-test-utils-junit/1.3.0/flink-test-utils-junit-1.3.0.jar
2017-09-28T09:53:47.432 [INFO] Downloaded: https://repo.maven.apache.org/maven2/org/apache/flink/flink-test-utils-junit/1.3.0/flink-test-utils-junit-1.3.0.jar (26 KB at 9.5 KB/sec)
2017-09-28T09:53:47.432 [INFO] Downloading: https://repo.maven.apache.org/maven2/org/apache/curator/curator-test/2.12.0/curator-test-2.12.0.jar
2017-09-28T09:53:47.481 [INFO] Downloaded: https://repo.maven.apache.org/maven2/org/apache/flink/flink-runtime_2.10/1.3.0/flink-runtime_2.10-1.3.0-tests.jar (2841 KB at 1040.5 KB/sec)
2017-09-28T09:53:47.732 [INFO] Downloaded: https://repo.maven.apache.org/maven2/org/apache/flink/flink-streaming-java_2.10/1.3.0/flink-streaming-java_2.10-1.3.0-tests.jar (1133 KB at 380.0 KB/sec)
2017-09-28T09:53:47.841 [INFO] Downloaded: https://repo.maven.apache.org/maven2/org/apache/curator/curator-test/2.12.0/curator-test-2.12.0.jar (2368 KB at 766.2 KB/sec)
2017-09-28T09:53:47.926 [INFO] Downloaded: https://repo.maven.apache.org/maven2/org/apache/flink/flink-test-utils_2.10/1.3.0/flink-test-utils_2.10-1.3.0.jar (2365 KB at 744.7 KB/sec)
2017-09-28T09:53:48.293 [INFO] Downloaded: https://repo.maven.apache.org/maven2/org/apache/flink/flink-shaded-hadoop2/1.3.0/flink-shaded-hadoop2-1.3.0.jar (16586 KB at 4682.5 KB/sec)
2017-09-28T09:53:48.312 [INFO] 
2017-09-28T09:53:48.312 [INFO] --- maven-clean-plugin:3.0.0:clean (default-clean) @ beam-runners-flink_2.10 ---
2017-09-28T09:53:48.314 [INFO] Deleting <https://builds.apache.org/job/beam_PostCommit_Java_ValidatesRunner_Flink/ws/runners/flink> (includes = [**/*.pyc, **/*.egg-info/, **/sdks/python/LICENSE, **/sdks/python/NOTICE, **/sdks/python/README.md], excludes = [])
2017-09-28T09:53:48.501 [INFO] 
2017-09-28T09:53:48.501 [INFO] --- maven-enforcer-plugin:3.0.0-M1:enforce (enforce) @ beam-runners-flink_2.10 ---
2017-09-28T09:53:52.296 [INFO] 
2017-09-28T09:53:52.297 [INFO] --- maven-enforcer-plugin:3.0.0-M1:enforce (enforce-banned-dependencies) @ beam-runners-flink_2.10 ---
2017-09-28T09:53:52.504 [INFO] 
2017-09-28T09:53:52.504 [INFO] --- maven-remote-resources-plugin:1.5:process (process-resource-bundles) @ beam-runners-flink_2.10 ---
2017-09-28T09:53:53.503 [INFO] 
2017-09-28T09:53:53.503 [INFO] --- maven-resources-plugin:3.0.2:resources (default-resources) @ beam-runners-flink_2.10 ---
2017-09-28T09:53:53.504 [INFO] Using 'UTF-8' encoding to copy filtered resources.
2017-09-28T09:53:53.505 [INFO] Copying 1 resource
2017-09-28T09:53:53.520 [INFO] Copying 3 resources
2017-09-28T09:53:53.710 [INFO] 
2017-09-28T09:53:53.711 [INFO] --- maven-compiler-plugin:3.6.2:compile (default-compile) @ beam-runners-flink_2.10 ---
2017-09-28T09:53:53.734 [INFO] Changes detected - recompiling the module!
2017-09-28T09:53:53.734 [INFO] Compiling 75 source files to <https://builds.apache.org/job/beam_PostCommit_Java_ValidatesRunner_Flink/ws/runners/flink/target/classes>
2017-09-28T09:53:56.484 [WARNING] bootstrap class path not set in conjunction with -source 1.7
2017-09-28T09:53:56.484 [INFO] <https://builds.apache.org/job/beam_PostCommit_Java_ValidatesRunner_Flink/ws/runners/flink/src/main/java/org/apache/beam/runners/flink/translation/wrappers/streaming/io/DedupingOperator.java>: Some input files use or override a deprecated API.
2017-09-28T09:53:56.484 [INFO] <https://builds.apache.org/job/beam_PostCommit_Java_ValidatesRunner_Flink/ws/runners/flink/src/main/java/org/apache/beam/runners/flink/translation/wrappers/streaming/io/DedupingOperator.java>: Recompile with -Xlint:deprecation for details.
2017-09-28T09:53:56.484 [INFO] <https://builds.apache.org/job/beam_PostCommit_Java_ValidatesRunner_Flink/ws/runners/flink/src/main/java/org/apache/beam/runners/flink/FlinkStreamingPipelineTranslator.java>: Some input files use unchecked or unsafe operations.
2017-09-28T09:53:56.484 [INFO] <https://builds.apache.org/job/beam_PostCommit_Java_ValidatesRunner_Flink/ws/runners/flink/src/main/java/org/apache/beam/runners/flink/FlinkStreamingPipelineTranslator.java>: Recompile with -Xlint:unchecked for details.
2017-09-28T09:53:56.691 [INFO] 
2017-09-28T09:53:56.692 [INFO] --- maven-resources-plugin:3.0.2:testResources (default-testResources) @ beam-runners-flink_2.10 ---
2017-09-28T09:53:56.694 [INFO] Using 'UTF-8' encoding to copy filtered resources.
2017-09-28T09:53:56.695 [INFO] Copying 1 resource
2017-09-28T09:53:56.696 [INFO] Copying 3 resources
2017-09-28T09:53:56.843 [INFO] 
2017-09-28T09:53:56.843 [INFO] --- maven-compiler-plugin:3.6.2:testCompile (default-testCompile) @ beam-runners-flink_2.10 ---
2017-09-28T09:53:56.859 [INFO] Changes detected - recompiling the module!
2017-09-28T09:53:56.859 [INFO] Compiling 18 source files to <https://builds.apache.org/job/beam_PostCommit_Java_ValidatesRunner_Flink/ws/runners/flink/target/test-classes>
2017-09-28T09:53:57.630 [INFO] <https://builds.apache.org/job/beam_PostCommit_Java_ValidatesRunner_Flink/ws/runners/flink/src/test/java/org/apache/beam/runners/flink/streaming/UnboundedSourceWrapperTest.java>: Some input files use unchecked or unsafe operations.
2017-09-28T09:53:57.630 [INFO] <https://builds.apache.org/job/beam_PostCommit_Java_ValidatesRunner_Flink/ws/runners/flink/src/test/java/org/apache/beam/runners/flink/streaming/UnboundedSourceWrapperTest.java>: Recompile with -Xlint:unchecked for details.
2017-09-28T09:53:57.837 [INFO] 
2017-09-28T09:53:57.837 [INFO] --- maven-checkstyle-plugin:2.17:check (default) @ beam-runners-flink_2.10 ---
2017-09-28T09:53:59.938 [INFO] Starting audit...
[ERROR] <https://builds.apache.org/job/beam_PostCommit_Java_ValidatesRunner_Flink/ws/runners/flink/src/main/java/org/apache/beam/runners/flink/translation/wrappers/streaming/state/FlinkStateInternals.java>:993: Line is longer than 100 characters (found 116). [LineLength]
Audit done.
2017-09-28T09:53:59.938 [INFO] There is 1 error reported by Checkstyle 6.19 with beam/checkstyle.xml ruleset.
2017-09-28T09:53:59.940 [ERROR] src/main/java/org/apache/beam/runners/flink/translation/wrappers/streaming/state/FlinkStateInternals.java:[993] (sizes) LineLength: Line is longer than 100 characters (found 116).
[JENKINS] Archiving disabled
[JENKINS] Archiving disabled
[JENKINS] Archiving disabled
[JENKINS] Archiving disabled
[JENKINS] Archiving disabled
[JENKINS] Archiving disabled
[JENKINS] Archiving disabled
[JENKINS] Archiving disabled
[JENKINS] Archiving disabled
[JENKINS] Archiving disabled
[JENKINS] Archiving disabled
[JENKINS] Archiving disabled
[JENKINS] Archiving disabled
2017-09-28T09:54:07.580 [INFO] ------------------------------------------------------------------------
2017-09-28T09:54:07.580 [INFO] Reactor Summary:
2017-09-28T09:54:07.580 [INFO] 
2017-09-28T09:54:07.581 [INFO] Apache Beam :: Parent .............................. SUCCESS [ 34.338 s]
2017-09-28T09:54:07.581 [INFO] Apache Beam :: SDKs :: Java :: Build Tools ......... SUCCESS [ 12.764 s]
2017-09-28T09:54:07.581 [INFO] Apache Beam :: SDKs ................................ SUCCESS [  2.759 s]
2017-09-28T09:54:07.581 [INFO] Apache Beam :: SDKs :: Common ...................... SUCCESS [  2.435 s]
2017-09-28T09:54:07.581 [INFO] Apache Beam :: SDKs :: Common :: Runner API ........ SUCCESS [ 19.285 s]
2017-09-28T09:54:07.582 [INFO] Apache Beam :: SDKs :: Common :: Fn API ............ SUCCESS [ 10.676 s]
2017-09-28T09:54:07.582 [INFO] Apache Beam :: SDKs :: Java ........................ SUCCESS [  2.436 s]
2017-09-28T09:54:07.582 [INFO] Apache Beam :: SDKs :: Java :: Core ................ SUCCESS [02:19 min]
2017-09-28T09:54:07.582 [INFO] Apache Beam :: Runners ............................. SUCCESS [  2.649 s]
2017-09-28T09:54:07.582 [INFO] Apache Beam :: Runners :: Core Construction Java ... SUCCESS [ 21.049 s]
2017-09-28T09:54:07.582 [INFO] Apache Beam :: Runners :: Core Java ................ SUCCESS [ 40.992 s]
2017-09-28T09:54:07.583 [INFO] Apache Beam :: Runners :: Flink .................... FAILURE [ 18.347 s]
2017-09-28T09:54:07.583 [INFO] ------------------------------------------------------------------------
2017-09-28T09:54:07.583 [INFO] BUILD FAILURE
2017-09-28T09:54:07.583 [INFO] ------------------------------------------------------------------------
2017-09-28T09:54:07.583 [INFO] Total time: 06:04 min
2017-09-28T09:54:07.583 [INFO] Finished at: 2017-09-28T09:54:07+00:00
2017-09-28T09:54:08.696 [INFO] Final Memory: 134M/1710M
2017-09-28T09:54:08.696 [INFO] ------------------------------------------------------------------------
2017-09-28T09:54:08.697 [WARNING] The requested profile "validates-runner-tests" could not be activated because it does not exist.
2017-09-28T09:54:08.702 [ERROR] Failed to execute goal org.apache.maven.plugins:maven-checkstyle-plugin:2.17:check (default) on project beam-runners-flink_2.10: You have 1 Checkstyle violation. -> [Help 1]
org.apache.maven.lifecycle.LifecycleExecutionException: Failed to execute goal org.apache.maven.plugins:maven-checkstyle-plugin:2.17:check (default) on project beam-runners-flink_2.10: You have 1 Checkstyle violation.
	at org.apache.maven.lifecycle.internal.MojoExecutor.execute(MojoExecutor.java:212)
	at org.apache.maven.lifecycle.internal.MojoExecutor.execute(MojoExecutor.java:153)
	at org.apache.maven.lifecycle.internal.MojoExecutor.execute(MojoExecutor.java:145)
	at org.apache.maven.lifecycle.internal.LifecycleModuleBuilder.buildProject(LifecycleModuleBuilder.java:116)
	at org.apache.maven.lifecycle.internal.LifecycleModuleBuilder.buildProject(LifecycleModuleBuilder.java:80)
	at org.apache.maven.lifecycle.internal.builder.singlethreaded.SingleThreadedBuilder.build(SingleThreadedBuilder.java:51)
	at org.apache.maven.lifecycle.internal.LifecycleStarter.execute(LifecycleStarter.java:128)
	at org.apache.maven.DefaultMaven.doExecute(DefaultMaven.java:307)
	at org.apache.maven.DefaultMaven.doExecute(DefaultMaven.java:193)
	at org.apache.maven.DefaultMaven.execute(DefaultMaven.java:106)
	at org.jvnet.hudson.maven3.launcher.Maven33Launcher.main(Maven33Launcher.java:129)
	at sun.reflect.NativeMethodAccessorImpl.invoke0(Native Method)
	at sun.reflect.NativeMethodAccessorImpl.invoke(NativeMethodAccessorImpl.java:62)
	at sun.reflect.DelegatingMethodAccessorImpl.invoke(DelegatingMethodAccessorImpl.java:43)
	at java.lang.reflect.Method.invoke(Method.java:498)
	at org.codehaus.plexus.classworlds.launcher.Launcher.launchStandard(Launcher.java:330)
	at org.codehaus.plexus.classworlds.launcher.Launcher.launch(Launcher.java:238)
	at jenkins.maven3.agent.Maven33Main.launch(Maven33Main.java:176)
	at sun.reflect.NativeMethodAccessorImpl.invoke0(Native Method)
	at sun.reflect.NativeMethodAccessorImpl.invoke(NativeMethodAccessorImpl.java:62)
	at sun.reflect.DelegatingMethodAccessorImpl.invoke(DelegatingMethodAccessorImpl.java:43)
	at java.lang.reflect.Method.invoke(Method.java:498)
	at hudson.maven.Maven3Builder.call(Maven3Builder.java:139)
	at hudson.maven.Maven3Builder.call(Maven3Builder.java:70)
	at hudson.remoting.UserRequest.perform(UserRequest.java:153)
	at hudson.remoting.UserRequest.perform(UserRequest.java:50)
	at hudson.remoting.Request$2.run(Request.java:336)
	at hudson.remoting.InterceptingExecutorService$1.call(InterceptingExecutorService.java:68)
	at java.util.concurrent.FutureTask.run(FutureTask.java:266)
	at java.util.concurrent.ThreadPoolExecutor.runWorker(ThreadPoolExecutor.java:1149)
	at java.util.concurrent.ThreadPoolExecutor$Worker.run(ThreadPoolExecutor.java:624)
	at java.lang.Thread.run(Thread.java:748)
Caused by: org.apache.maven.plugin.MojoFailureException: You have 1 Checkstyle violation.
	at org.apache.maven.plugin.checkstyle.CheckstyleViolationCheckMojo.execute(CheckstyleViolationCheckMojo.java:588)
	at org.apache.maven.plugin.DefaultBuildPluginManager.executeMojo(DefaultBuildPluginManager.java:134)
	at org.apache.maven.lifecycle.internal.MojoExecutor.execute(MojoExecutor.java:208)
	... 31 more
2017-09-28T09:54:08.707 [ERROR] 
2017-09-28T09:54:08.707 [ERROR] Re-run Maven using the -X switch to enable full debug logging.
2017-09-28T09:54:08.708 [ERROR] 
2017-09-28T09:54:08.708 [ERROR] For more information about the errors and possible solutions, please read the following articles:
2017-09-28T09:54:08.708 [ERROR] [Help 1] http://cwiki.apache.org/confluence/display/MAVEN/MojoFailureException
2017-09-28T09:54:08.708 [ERROR] 
2017-09-28T09:54:08.708 [ERROR] After correcting the problems, you can resume the build with the command
2017-09-28T09:54:08.709 [ERROR]   mvn <goals> -rf :beam-runners-flink_2.10
channel stopped
Not sending mail to unregistered user kirpichov@google.com
Not sending mail to unregistered user ekirpichov@gmail.com
Not sending mail to unregistered user relax@relax-macbookpro.roam.corp.google.com
Not sending mail to unregistered user github@nakomis.com
Not sending mail to unregistered user millsd@google.com
Not sending mail to unregistered user klk@google.com

Jenkins build is still unstable: beam_PostCommit_Java_ValidatesRunner_Flink #3944

Posted by Apache Jenkins Server <je...@builds.apache.org>.
See <https://builds.apache.org/job/beam_PostCommit_Java_ValidatesRunner_Flink/3944/display/redirect>


Jenkins build is still unstable: beam_PostCommit_Java_ValidatesRunner_Flink #3943

Posted by Apache Jenkins Server <je...@builds.apache.org>.
See <https://builds.apache.org/job/beam_PostCommit_Java_ValidatesRunner_Flink/3943/display/redirect?page=changes>


Jenkins build is still unstable: beam_PostCommit_Java_ValidatesRunner_Flink #3942

Posted by Apache Jenkins Server <je...@builds.apache.org>.
See <https://builds.apache.org/job/beam_PostCommit_Java_ValidatesRunner_Flink/3942/display/redirect?page=changes>


Jenkins build is still unstable: beam_PostCommit_Java_ValidatesRunner_Flink #3941

Posted by Apache Jenkins Server <je...@builds.apache.org>.
See <https://builds.apache.org/job/beam_PostCommit_Java_ValidatesRunner_Flink/3941/display/redirect?page=changes>


Jenkins build is still unstable: beam_PostCommit_Java_ValidatesRunner_Flink #3940

Posted by Apache Jenkins Server <je...@builds.apache.org>.
See <https://builds.apache.org/job/beam_PostCommit_Java_ValidatesRunner_Flink/3940/display/redirect?page=changes>


Jenkins build is still unstable: beam_PostCommit_Java_ValidatesRunner_Flink #3939

Posted by Apache Jenkins Server <je...@builds.apache.org>.
See <https://builds.apache.org/job/beam_PostCommit_Java_ValidatesRunner_Flink/3939/display/redirect?page=changes>


Jenkins build is still unstable: beam_PostCommit_Java_ValidatesRunner_Flink #3938

Posted by Apache Jenkins Server <je...@builds.apache.org>.
See <https://builds.apache.org/job/beam_PostCommit_Java_ValidatesRunner_Flink/3938/display/redirect>


Jenkins build is still unstable: beam_PostCommit_Java_ValidatesRunner_Flink #3937

Posted by Apache Jenkins Server <je...@builds.apache.org>.
See <https://builds.apache.org/job/beam_PostCommit_Java_ValidatesRunner_Flink/3937/display/redirect?page=changes>


Jenkins build is still unstable: beam_PostCommit_Java_ValidatesRunner_Flink #3936

Posted by Apache Jenkins Server <je...@builds.apache.org>.
See <https://builds.apache.org/job/beam_PostCommit_Java_ValidatesRunner_Flink/3936/display/redirect?page=changes>


Jenkins build is still unstable: beam_PostCommit_Java_ValidatesRunner_Flink #3935

Posted by Apache Jenkins Server <je...@builds.apache.org>.
See <https://builds.apache.org/job/beam_PostCommit_Java_ValidatesRunner_Flink/3935/display/redirect?page=changes>


Jenkins build is still unstable: beam_PostCommit_Java_ValidatesRunner_Flink #3934

Posted by Apache Jenkins Server <je...@builds.apache.org>.
See <https://builds.apache.org/job/beam_PostCommit_Java_ValidatesRunner_Flink/3934/display/redirect?page=changes>


Jenkins build is still unstable: beam_PostCommit_Java_ValidatesRunner_Flink #3933

Posted by Apache Jenkins Server <je...@builds.apache.org>.
See <https://builds.apache.org/job/beam_PostCommit_Java_ValidatesRunner_Flink/3933/display/redirect?page=changes>


Jenkins build is still unstable: beam_PostCommit_Java_ValidatesRunner_Flink #3932

Posted by Apache Jenkins Server <je...@builds.apache.org>.
See <https://builds.apache.org/job/beam_PostCommit_Java_ValidatesRunner_Flink/3932/display/redirect?page=changes>


Jenkins build is still unstable: beam_PostCommit_Java_ValidatesRunner_Flink #3931

Posted by Apache Jenkins Server <je...@builds.apache.org>.
See <https://builds.apache.org/job/beam_PostCommit_Java_ValidatesRunner_Flink/3931/display/redirect?page=changes>


Jenkins build is still unstable: beam_PostCommit_Java_ValidatesRunner_Flink #3930

Posted by Apache Jenkins Server <je...@builds.apache.org>.
See <https://builds.apache.org/job/beam_PostCommit_Java_ValidatesRunner_Flink/3930/display/redirect?page=changes>


Jenkins build is still unstable: beam_PostCommit_Java_ValidatesRunner_Flink #3929

Posted by Apache Jenkins Server <je...@builds.apache.org>.
See <https://builds.apache.org/job/beam_PostCommit_Java_ValidatesRunner_Flink/3929/display/redirect?page=changes>


Jenkins build is still unstable: beam_PostCommit_Java_ValidatesRunner_Flink #3928

Posted by Apache Jenkins Server <je...@builds.apache.org>.
See <https://builds.apache.org/job/beam_PostCommit_Java_ValidatesRunner_Flink/3928/display/redirect>


Jenkins build is still unstable: beam_PostCommit_Java_ValidatesRunner_Flink #3927

Posted by Apache Jenkins Server <je...@builds.apache.org>.
See <https://builds.apache.org/job/beam_PostCommit_Java_ValidatesRunner_Flink/3927/display/redirect>


Jenkins build is still unstable: beam_PostCommit_Java_ValidatesRunner_Flink #3926

Posted by Apache Jenkins Server <je...@builds.apache.org>.
See <https://builds.apache.org/job/beam_PostCommit_Java_ValidatesRunner_Flink/3926/display/redirect?page=changes>


Jenkins build is still unstable: beam_PostCommit_Java_ValidatesRunner_Flink #3925

Posted by Apache Jenkins Server <je...@builds.apache.org>.
See <https://builds.apache.org/job/beam_PostCommit_Java_ValidatesRunner_Flink/3925/display/redirect?page=changes>


Jenkins build is still unstable: beam_PostCommit_Java_ValidatesRunner_Flink #3924

Posted by Apache Jenkins Server <je...@builds.apache.org>.
See <https://builds.apache.org/job/beam_PostCommit_Java_ValidatesRunner_Flink/3924/display/redirect?page=changes>


Jenkins build is still unstable: beam_PostCommit_Java_ValidatesRunner_Flink #3923

Posted by Apache Jenkins Server <je...@builds.apache.org>.
See <https://builds.apache.org/job/beam_PostCommit_Java_ValidatesRunner_Flink/3923/display/redirect?page=changes>


Jenkins build is still unstable: beam_PostCommit_Java_ValidatesRunner_Flink #3922

Posted by Apache Jenkins Server <je...@builds.apache.org>.
See <https://builds.apache.org/job/beam_PostCommit_Java_ValidatesRunner_Flink/3922/display/redirect?page=changes>


Jenkins build is still unstable: beam_PostCommit_Java_ValidatesRunner_Flink #3921

Posted by Apache Jenkins Server <je...@builds.apache.org>.
See <https://builds.apache.org/job/beam_PostCommit_Java_ValidatesRunner_Flink/3921/display/redirect?page=changes>


Jenkins build is still unstable: beam_PostCommit_Java_ValidatesRunner_Flink #3920

Posted by Apache Jenkins Server <je...@builds.apache.org>.
See <https://builds.apache.org/job/beam_PostCommit_Java_ValidatesRunner_Flink/3920/display/redirect?page=changes>


Jenkins build is still unstable: beam_PostCommit_Java_ValidatesRunner_Flink #3919

Posted by Apache Jenkins Server <je...@builds.apache.org>.
See <https://builds.apache.org/job/beam_PostCommit_Java_ValidatesRunner_Flink/3919/display/redirect?page=changes>


Jenkins build is still unstable: beam_PostCommit_Java_ValidatesRunner_Flink #3918

Posted by Apache Jenkins Server <je...@builds.apache.org>.
See <https://builds.apache.org/job/beam_PostCommit_Java_ValidatesRunner_Flink/3918/display/redirect>