You are viewing a plain text version of this content. The canonical link for it is here.
Posted to dev@lucene.apache.org by Policeman Jenkins Server <je...@thetaphi.de> on 2018/08/07 11:56:18 UTC

[JENKINS] Lucene-Solr-master-Linux (64bit/jdk-10.0.1) - Build # 22620 - Still Unstable!

Build: https://jenkins.thetaphi.de/job/Lucene-Solr-master-Linux/22620/
Java: 64bit/jdk-10.0.1 -XX:+UseCompressedOops -XX:+UseG1GC

2 tests failed.
FAILED:  org.apache.solr.cloud.TestWithCollection.testDeleteWithCollection

Error Message:
Error from server at https://127.0.0.1:33223/solr: Could not find collection : testDeleteWithCollection_abc

Stack Trace:
org.apache.solr.client.solrj.impl.HttpSolrClient$RemoteSolrException: Error from server at https://127.0.0.1:33223/solr: Could not find collection : testDeleteWithCollection_abc
	at __randomizedtesting.SeedInfo.seed([EF87C5A37A165324:945E324E238C819A]:0)
	at org.apache.solr.client.solrj.impl.HttpSolrClient.executeMethod(HttpSolrClient.java:643)
	at org.apache.solr.client.solrj.impl.HttpSolrClient.request(HttpSolrClient.java:255)
	at org.apache.solr.client.solrj.impl.HttpSolrClient.request(HttpSolrClient.java:244)
	at org.apache.solr.client.solrj.impl.LBHttpSolrClient.doRequest(LBHttpSolrClient.java:483)
	at org.apache.solr.client.solrj.impl.LBHttpSolrClient.request(LBHttpSolrClient.java:413)
	at org.apache.solr.client.solrj.impl.CloudSolrClient.sendRequest(CloudSolrClient.java:1106)
	at org.apache.solr.client.solrj.impl.CloudSolrClient.requestWithRetryOnStaleState(CloudSolrClient.java:886)
	at org.apache.solr.client.solrj.impl.CloudSolrClient.request(CloudSolrClient.java:819)
	at org.apache.solr.client.solrj.SolrRequest.process(SolrRequest.java:194)
	at org.apache.solr.client.solrj.SolrRequest.process(SolrRequest.java:211)
	at org.apache.solr.cloud.TestWithCollection.testDeleteWithCollection(TestWithCollection.java:197)
	at java.base/jdk.internal.reflect.NativeMethodAccessorImpl.invoke0(Native Method)
	at java.base/jdk.internal.reflect.NativeMethodAccessorImpl.invoke(NativeMethodAccessorImpl.java:62)
	at java.base/jdk.internal.reflect.DelegatingMethodAccessorImpl.invoke(DelegatingMethodAccessorImpl.java:43)
	at java.base/java.lang.reflect.Method.invoke(Method.java:564)
	at com.carrotsearch.randomizedtesting.RandomizedRunner.invoke(RandomizedRunner.java:1737)
	at com.carrotsearch.randomizedtesting.RandomizedRunner$8.evaluate(RandomizedRunner.java:934)
	at com.carrotsearch.randomizedtesting.RandomizedRunner$9.evaluate(RandomizedRunner.java:970)
	at com.carrotsearch.randomizedtesting.RandomizedRunner$10.evaluate(RandomizedRunner.java:984)
	at com.carrotsearch.randomizedtesting.rules.SystemPropertiesRestoreRule$1.evaluate(SystemPropertiesRestoreRule.java:57)
	at org.apache.lucene.util.TestRuleSetupTeardownChained$1.evaluate(TestRuleSetupTeardownChained.java:49)
	at org.apache.lucene.util.AbstractBeforeAfterRule$1.evaluate(AbstractBeforeAfterRule.java:45)
	at org.apache.lucene.util.TestRuleThreadAndTestName$1.evaluate(TestRuleThreadAndTestName.java:48)
	at org.apache.lucene.util.TestRuleIgnoreAfterMaxFailures$1.evaluate(TestRuleIgnoreAfterMaxFailures.java:64)
	at org.apache.lucene.util.TestRuleMarkFailure$1.evaluate(TestRuleMarkFailure.java:47)
	at com.carrotsearch.randomizedtesting.rules.StatementAdapter.evaluate(StatementAdapter.java:36)
	at com.carrotsearch.randomizedtesting.ThreadLeakControl$StatementRunner.run(ThreadLeakControl.java:368)
	at com.carrotsearch.randomizedtesting.ThreadLeakControl.forkTimeoutingTask(ThreadLeakControl.java:817)
	at com.carrotsearch.randomizedtesting.ThreadLeakControl$3.evaluate(ThreadLeakControl.java:468)
	at com.carrotsearch.randomizedtesting.RandomizedRunner.runSingleTest(RandomizedRunner.java:943)
	at com.carrotsearch.randomizedtesting.RandomizedRunner$5.evaluate(RandomizedRunner.java:829)
	at com.carrotsearch.randomizedtesting.RandomizedRunner$6.evaluate(RandomizedRunner.java:879)
	at com.carrotsearch.randomizedtesting.RandomizedRunner$7.evaluate(RandomizedRunner.java:890)
	at com.carrotsearch.randomizedtesting.rules.StatementAdapter.evaluate(StatementAdapter.java:36)
	at com.carrotsearch.randomizedtesting.rules.SystemPropertiesRestoreRule$1.evaluate(SystemPropertiesRestoreRule.java:57)
	at org.apache.lucene.util.AbstractBeforeAfterRule$1.evaluate(AbstractBeforeAfterRule.java:45)
	at com.carrotsearch.randomizedtesting.rules.StatementAdapter.evaluate(StatementAdapter.java:36)
	at org.apache.lucene.util.TestRuleStoreClassName$1.evaluate(TestRuleStoreClassName.java:41)
	at com.carrotsearch.randomizedtesting.rules.NoShadowingOrOverridesOnMethodsRule$1.evaluate(NoShadowingOrOverridesOnMethodsRule.java:40)
	at com.carrotsearch.randomizedtesting.rules.NoShadowingOrOverridesOnMethodsRule$1.evaluate(NoShadowingOrOverridesOnMethodsRule.java:40)
	at com.carrotsearch.randomizedtesting.rules.StatementAdapter.evaluate(StatementAdapter.java:36)
	at com.carrotsearch.randomizedtesting.rules.StatementAdapter.evaluate(StatementAdapter.java:36)
	at org.apache.lucene.util.TestRuleAssertionsRequired$1.evaluate(TestRuleAssertionsRequired.java:53)
	at org.apache.lucene.util.TestRuleMarkFailure$1.evaluate(TestRuleMarkFailure.java:47)
	at org.apache.lucene.util.TestRuleIgnoreAfterMaxFailures$1.evaluate(TestRuleIgnoreAfterMaxFailures.java:64)
	at org.apache.lucene.util.TestRuleIgnoreTestSuites$1.evaluate(TestRuleIgnoreTestSuites.java:54)
	at com.carrotsearch.randomizedtesting.rules.StatementAdapter.evaluate(StatementAdapter.java:36)
	at com.carrotsearch.randomizedtesting.ThreadLeakControl$StatementRunner.run(ThreadLeakControl.java:368)
	at java.base/java.lang.Thread.run(Thread.java:844)


FAILED:  org.apache.solr.cloud.TestWithCollection.testDeleteWithCollection

Error Message:
Error from server at https://127.0.0.1:33911/solr: Could not find collection : testDeleteWithCollection_abc_2

Stack Trace:
org.apache.solr.client.solrj.impl.HttpSolrClient$RemoteSolrException: Error from server at https://127.0.0.1:33911/solr: Could not find collection : testDeleteWithCollection_abc_2
	at __randomizedtesting.SeedInfo.seed([EF87C5A37A165324:945E324E238C819A]:0)
	at org.apache.solr.client.solrj.impl.HttpSolrClient.executeMethod(HttpSolrClient.java:643)
	at org.apache.solr.client.solrj.impl.HttpSolrClient.request(HttpSolrClient.java:255)
	at org.apache.solr.client.solrj.impl.HttpSolrClient.request(HttpSolrClient.java:244)
	at org.apache.solr.client.solrj.impl.LBHttpSolrClient.doRequest(LBHttpSolrClient.java:483)
	at org.apache.solr.client.solrj.impl.LBHttpSolrClient.request(LBHttpSolrClient.java:413)
	at org.apache.solr.client.solrj.impl.CloudSolrClient.sendRequest(CloudSolrClient.java:1106)
	at org.apache.solr.client.solrj.impl.CloudSolrClient.requestWithRetryOnStaleState(CloudSolrClient.java:886)
	at org.apache.solr.client.solrj.impl.CloudSolrClient.request(CloudSolrClient.java:819)
	at org.apache.solr.client.solrj.SolrRequest.process(SolrRequest.java:194)
	at org.apache.solr.client.solrj.SolrRequest.process(SolrRequest.java:211)
	at org.apache.solr.cloud.TestWithCollection.testDeleteWithCollection(TestWithCollection.java:224)
	at java.base/jdk.internal.reflect.NativeMethodAccessorImpl.invoke0(Native Method)
	at java.base/jdk.internal.reflect.NativeMethodAccessorImpl.invoke(NativeMethodAccessorImpl.java:62)
	at java.base/jdk.internal.reflect.DelegatingMethodAccessorImpl.invoke(DelegatingMethodAccessorImpl.java:43)
	at java.base/java.lang.reflect.Method.invoke(Method.java:564)
	at com.carrotsearch.randomizedtesting.RandomizedRunner.invoke(RandomizedRunner.java:1737)
	at com.carrotsearch.randomizedtesting.RandomizedRunner$8.evaluate(RandomizedRunner.java:934)
	at com.carrotsearch.randomizedtesting.RandomizedRunner$9.evaluate(RandomizedRunner.java:970)
	at com.carrotsearch.randomizedtesting.RandomizedRunner$10.evaluate(RandomizedRunner.java:984)
	at com.carrotsearch.randomizedtesting.rules.SystemPropertiesRestoreRule$1.evaluate(SystemPropertiesRestoreRule.java:57)
	at org.apache.lucene.util.TestRuleSetupTeardownChained$1.evaluate(TestRuleSetupTeardownChained.java:49)
	at org.apache.lucene.util.AbstractBeforeAfterRule$1.evaluate(AbstractBeforeAfterRule.java:45)
	at org.apache.lucene.util.TestRuleThreadAndTestName$1.evaluate(TestRuleThreadAndTestName.java:48)
	at org.apache.lucene.util.TestRuleIgnoreAfterMaxFailures$1.evaluate(TestRuleIgnoreAfterMaxFailures.java:64)
	at org.apache.lucene.util.TestRuleMarkFailure$1.evaluate(TestRuleMarkFailure.java:47)
	at com.carrotsearch.randomizedtesting.rules.StatementAdapter.evaluate(StatementAdapter.java:36)
	at com.carrotsearch.randomizedtesting.ThreadLeakControl$StatementRunner.run(ThreadLeakControl.java:368)
	at com.carrotsearch.randomizedtesting.ThreadLeakControl.forkTimeoutingTask(ThreadLeakControl.java:817)
	at com.carrotsearch.randomizedtesting.ThreadLeakControl$3.evaluate(ThreadLeakControl.java:468)
	at com.carrotsearch.randomizedtesting.RandomizedRunner.runSingleTest(RandomizedRunner.java:943)
	at com.carrotsearch.randomizedtesting.RandomizedRunner$5.evaluate(RandomizedRunner.java:829)
	at com.carrotsearch.randomizedtesting.RandomizedRunner$6.evaluate(RandomizedRunner.java:879)
	at com.carrotsearch.randomizedtesting.RandomizedRunner$7.evaluate(RandomizedRunner.java:890)
	at com.carrotsearch.randomizedtesting.rules.StatementAdapter.evaluate(StatementAdapter.java:36)
	at com.carrotsearch.randomizedtesting.rules.SystemPropertiesRestoreRule$1.evaluate(SystemPropertiesRestoreRule.java:57)
	at org.apache.lucene.util.AbstractBeforeAfterRule$1.evaluate(AbstractBeforeAfterRule.java:45)
	at com.carrotsearch.randomizedtesting.rules.StatementAdapter.evaluate(StatementAdapter.java:36)
	at org.apache.lucene.util.TestRuleStoreClassName$1.evaluate(TestRuleStoreClassName.java:41)
	at com.carrotsearch.randomizedtesting.rules.NoShadowingOrOverridesOnMethodsRule$1.evaluate(NoShadowingOrOverridesOnMethodsRule.java:40)
	at com.carrotsearch.randomizedtesting.rules.NoShadowingOrOverridesOnMethodsRule$1.evaluate(NoShadowingOrOverridesOnMethodsRule.java:40)
	at com.carrotsearch.randomizedtesting.rules.StatementAdapter.evaluate(StatementAdapter.java:36)
	at com.carrotsearch.randomizedtesting.rules.StatementAdapter.evaluate(StatementAdapter.java:36)
	at org.apache.lucene.util.TestRuleAssertionsRequired$1.evaluate(TestRuleAssertionsRequired.java:53)
	at org.apache.lucene.util.TestRuleMarkFailure$1.evaluate(TestRuleMarkFailure.java:47)
	at org.apache.lucene.util.TestRuleIgnoreAfterMaxFailures$1.evaluate(TestRuleIgnoreAfterMaxFailures.java:64)
	at org.apache.lucene.util.TestRuleIgnoreTestSuites$1.evaluate(TestRuleIgnoreTestSuites.java:54)
	at com.carrotsearch.randomizedtesting.rules.StatementAdapter.evaluate(StatementAdapter.java:36)
	at com.carrotsearch.randomizedtesting.ThreadLeakControl$StatementRunner.run(ThreadLeakControl.java:368)
	at java.base/java.lang.Thread.run(Thread.java:844)




Build Log:
[...truncated 14110 lines...]
   [junit4] Suite: org.apache.solr.cloud.TestWithCollection
   [junit4]   2> Creating dataDir: /home/jenkins/workspace/Lucene-Solr-master-Linux/solr/build/solr-core/test/J1/temp/solr.cloud.TestWithCollection_EF87C5A37A165324-001/init-core-data-001
   [junit4]   2> 1406133 INFO  (SUITE-TestWithCollection-seed#[EF87C5A37A165324]-worker) [    ] o.a.s.SolrTestCaseJ4 Using PointFields (NUMERIC_POINTS_SYSPROP=true) w/NUMERIC_DOCVALUES_SYSPROP=false
   [junit4]   2> 1406134 INFO  (SUITE-TestWithCollection-seed#[EF87C5A37A165324]-worker) [    ] o.a.s.SolrTestCaseJ4 Randomized ssl (true) and clientAuth (true) via: @org.apache.solr.util.RandomizeSSL(reason="", ssl=0.0/0.0, value=0.0/0.0, clientAuth=0.0/0.0)
   [junit4]   2> 1406134 INFO  (SUITE-TestWithCollection-seed#[EF87C5A37A165324]-worker) [    ] o.a.s.SolrTestCaseJ4 SecureRandom sanity checks: test.solr.allowed.securerandom=null & java.security.egd=file:/dev/./urandom
   [junit4]   2> 1406135 INFO  (SUITE-TestWithCollection-seed#[EF87C5A37A165324]-worker) [    ] o.a.s.c.MiniSolrCloudCluster Starting cluster of 2 servers in /home/jenkins/workspace/Lucene-Solr-master-Linux/solr/build/solr-core/test/J1/temp/solr.cloud.TestWithCollection_EF87C5A37A165324-001/tempDir-001
   [junit4]   2> 1406135 INFO  (SUITE-TestWithCollection-seed#[EF87C5A37A165324]-worker) [    ] o.a.s.c.ZkTestServer STARTING ZK TEST SERVER
   [junit4]   2> 1406135 INFO  (Thread-4541) [    ] o.a.s.c.ZkTestServer client port:0.0.0.0/0.0.0.0:0
   [junit4]   2> 1406135 INFO  (Thread-4541) [    ] o.a.s.c.ZkTestServer Starting server
   [junit4]   2> 1406136 ERROR (Thread-4541) [    ] o.a.z.s.ZooKeeperServer ZKShutdownHandler is not registered, so ZooKeeper server won't take any action on ERROR or SHUTDOWN server state changes
   [junit4]   2> 1406235 INFO  (SUITE-TestWithCollection-seed#[EF87C5A37A165324]-worker) [    ] o.a.s.c.ZkTestServer start zk server on port:42963
   [junit4]   2> 1406236 INFO  (zkConnectionManagerCallback-8704-thread-1) [    ] o.a.s.c.c.ConnectionManager zkClient has connected
   [junit4]   2> 1406239 INFO  (jetty-launcher-8701-thread-1) [    ] o.e.j.s.Server jetty-9.4.11.v20180605; built: 2018-06-05T18:24:03.829Z; git: d5fc0523cfa96bfebfbda19606cad384d772f04c; jvm 10.0.1+10
   [junit4]   2> 1406239 INFO  (jetty-launcher-8701-thread-2) [    ] o.e.j.s.Server jetty-9.4.11.v20180605; built: 2018-06-05T18:24:03.829Z; git: d5fc0523cfa96bfebfbda19606cad384d772f04c; jvm 10.0.1+10
   [junit4]   2> 1406240 INFO  (jetty-launcher-8701-thread-1) [    ] o.e.j.s.session DefaultSessionIdManager workerName=node0
   [junit4]   2> 1406240 INFO  (jetty-launcher-8701-thread-1) [    ] o.e.j.s.session No SessionScavenger set, using defaults
   [junit4]   2> 1406240 INFO  (jetty-launcher-8701-thread-1) [    ] o.e.j.s.session node0 Scavenging every 660000ms
   [junit4]   2> 1406240 INFO  (jetty-launcher-8701-thread-2) [    ] o.e.j.s.session DefaultSessionIdManager workerName=node0
   [junit4]   2> 1406240 INFO  (jetty-launcher-8701-thread-2) [    ] o.e.j.s.session No SessionScavenger set, using defaults
   [junit4]   2> 1406240 INFO  (jetty-launcher-8701-thread-2) [    ] o.e.j.s.session node0 Scavenging every 660000ms
   [junit4]   2> 1406241 INFO  (jetty-launcher-8701-thread-1) [    ] o.e.j.s.h.ContextHandler Started o.e.j.s.ServletContextHandler@4ef5389d{/solr,null,AVAILABLE}
   [junit4]   2> 1406241 INFO  (jetty-launcher-8701-thread-2) [    ] o.e.j.s.h.ContextHandler Started o.e.j.s.ServletContextHandler@34ce067{/solr,null,AVAILABLE}
   [junit4]   2> 1406243 INFO  (jetty-launcher-8701-thread-2) [    ] o.e.j.s.AbstractConnector Started ServerConnector@544f703d{SSL,[ssl, http/1.1]}{127.0.0.1:41503}
   [junit4]   2> 1406243 INFO  (jetty-launcher-8701-thread-1) [    ] o.e.j.s.AbstractConnector Started ServerConnector@36c1b820{SSL,[ssl, http/1.1]}{127.0.0.1:33911}
   [junit4]   2> 1406243 INFO  (jetty-launcher-8701-thread-2) [    ] o.e.j.s.Server Started @1406277ms
   [junit4]   2> 1406243 INFO  (jetty-launcher-8701-thread-1) [    ] o.e.j.s.Server Started @1406277ms
   [junit4]   2> 1406243 INFO  (jetty-launcher-8701-thread-2) [    ] o.a.s.c.s.e.JettySolrRunner Jetty properties: {hostContext=/solr, hostPort=41503}
   [junit4]   2> 1406243 INFO  (jetty-launcher-8701-thread-1) [    ] o.a.s.c.s.e.JettySolrRunner Jetty properties: {hostContext=/solr, hostPort=33911}
   [junit4]   2> 1406244 ERROR (jetty-launcher-8701-thread-2) [    ] o.a.s.u.StartupLoggingUtils Missing Java Option solr.log.dir. Logging may be missing or incomplete.
   [junit4]   2> 1406244 ERROR (jetty-launcher-8701-thread-1) [    ] o.a.s.u.StartupLoggingUtils Missing Java Option solr.log.dir. Logging may be missing or incomplete.
   [junit4]   2> 1406244 INFO  (jetty-launcher-8701-thread-2) [    ] o.a.s.s.SolrDispatchFilter Using logger factory org.apache.logging.slf4j.Log4jLoggerFactory
   [junit4]   2> 1406244 INFO  (jetty-launcher-8701-thread-1) [    ] o.a.s.s.SolrDispatchFilter Using logger factory org.apache.logging.slf4j.Log4jLoggerFactory
   [junit4]   2> 1406244 INFO  (jetty-launcher-8701-thread-1) [    ] o.a.s.s.SolrDispatchFilter  ___      _       Welcome to Apache Solr™ version 8.0.0
   [junit4]   2> 1406244 INFO  (jetty-launcher-8701-thread-2) [    ] o.a.s.s.SolrDispatchFilter  ___      _       Welcome to Apache Solr™ version 8.0.0
   [junit4]   2> 1406244 INFO  (jetty-launcher-8701-thread-1) [    ] o.a.s.s.SolrDispatchFilter / __| ___| |_ _   Starting in cloud mode on port null
   [junit4]   2> 1406244 INFO  (jetty-launcher-8701-thread-2) [    ] o.a.s.s.SolrDispatchFilter / __| ___| |_ _   Starting in cloud mode on port null
   [junit4]   2> 1406244 INFO  (jetty-launcher-8701-thread-1) [    ] o.a.s.s.SolrDispatchFilter \__ \/ _ \ | '_|  Install dir: null
   [junit4]   2> 1406244 INFO  (jetty-launcher-8701-thread-2) [    ] o.a.s.s.SolrDispatchFilter \__ \/ _ \ | '_|  Install dir: null
   [junit4]   2> 1406244 INFO  (jetty-launcher-8701-thread-1) [    ] o.a.s.s.SolrDispatchFilter |___/\___/_|_|    Start time: 2018-08-07T11:27:38.460222Z
   [junit4]   2> 1406244 INFO  (jetty-launcher-8701-thread-2) [    ] o.a.s.s.SolrDispatchFilter |___/\___/_|_|    Start time: 2018-08-07T11:27:38.460228Z
   [junit4]   2> 1406245 INFO  (zkConnectionManagerCallback-8707-thread-1) [    ] o.a.s.c.c.ConnectionManager zkClient has connected
   [junit4]   2> 1406245 INFO  (zkConnectionManagerCallback-8708-thread-1) [    ] o.a.s.c.c.ConnectionManager zkClient has connected
   [junit4]   2> 1406245 INFO  (jetty-launcher-8701-thread-2) [    ] o.a.s.s.SolrDispatchFilter solr.xml found in ZooKeeper. Loading...
   [junit4]   2> 1406245 INFO  (jetty-launcher-8701-thread-1) [    ] o.a.s.s.SolrDispatchFilter solr.xml found in ZooKeeper. Loading...
   [junit4]   2> 1406248 WARN  (NIOServerCxn.Factory:0.0.0.0/0.0.0.0:0) [    ] o.a.z.s.NIOServerCnxn Unable to read additional data from client sessionid 0x100383d53b30002, likely client has closed socket
   [junit4]   2> 1406277 INFO  (jetty-launcher-8701-thread-1) [    ] o.a.s.c.ZkContainer Zookeeper client=127.0.0.1:42963/solr
   [junit4]   2> 1406278 INFO  (zkConnectionManagerCallback-8712-thread-1) [    ] o.a.s.c.c.ConnectionManager zkClient has connected
   [junit4]   2> 1406279 INFO  (zkConnectionManagerCallback-8714-thread-1) [    ] o.a.s.c.c.ConnectionManager zkClient has connected
   [junit4]   2> 1406308 INFO  (jetty-launcher-8701-thread-1) [n:127.0.0.1:33911_solr    ] o.a.s.c.OverseerElectionContext I am going to be the leader 127.0.0.1:33911_solr
   [junit4]   2> 1406308 INFO  (jetty-launcher-8701-thread-1) [n:127.0.0.1:33911_solr    ] o.a.s.c.Overseer Overseer (id=72119430086328324-127.0.0.1:33911_solr-n_0000000000) starting
   [junit4]   2> 1406311 INFO  (zkConnectionManagerCallback-8721-thread-1) [    ] o.a.s.c.c.ConnectionManager zkClient has connected
   [junit4]   2> 1406312 INFO  (jetty-launcher-8701-thread-1) [n:127.0.0.1:33911_solr    ] o.a.s.c.s.i.ZkClientClusterStateProvider Cluster at 127.0.0.1:42963/solr ready
   [junit4]   2> 1406312 INFO  (OverseerStateUpdate-72119430086328324-127.0.0.1:33911_solr-n_0000000000) [    ] o.a.s.c.Overseer Starting to work on the main queue : 127.0.0.1:33911_solr
   [junit4]   2> 1406312 INFO  (jetty-launcher-8701-thread-1) [n:127.0.0.1:33911_solr    ] o.a.s.c.ZkController Register node as live in ZooKeeper:/live_nodes/127.0.0.1:33911_solr
   [junit4]   2> 1406312 DEBUG (OverseerAutoScalingTriggerThread-72119430086328324-127.0.0.1:33911_solr-n_0000000000) [    ] o.a.s.c.a.OverseerTriggerThread Adding .auto_add_replicas and .scheduled_maintenance triggers
   [junit4]   2> 1406312 INFO  (OverseerStateUpdate-72119430086328324-127.0.0.1:33911_solr-n_0000000000) [    ] o.a.s.c.c.ZkStateReader Updated live nodes from ZooKeeper... (0) -> (1)
   [junit4]   2> 1406312 DEBUG (OverseerAutoScalingTriggerThread-72119430086328324-127.0.0.1:33911_solr-n_0000000000) [    ] o.a.s.c.a.OverseerTriggerThread Refreshing /autoscaling.json with znode version 1
   [junit4]   2> 1406313 DEBUG (OverseerAutoScalingTriggerThread-72119430086328324-127.0.0.1:33911_solr-n_0000000000) [    ] o.a.s.c.a.OverseerTriggerThread Current znodeVersion 1, lastZnodeVersion -1
   [junit4]   2> 1406313 DEBUG (OverseerAutoScalingTriggerThread-72119430086328324-127.0.0.1:33911_solr-n_0000000000) [    ] o.a.s.c.a.OverseerTriggerThread Processed trigger updates upto znodeVersion 1
   [junit4]   2> 1406313 INFO  (zkCallback-8720-thread-1) [    ] o.a.s.c.c.ZkStateReader Updated live nodes from ZooKeeper... (0) -> (1)
   [junit4]   2> 1406314 DEBUG (OverseerAutoScalingTriggerThread-72119430086328324-127.0.0.1:33911_solr-n_0000000000) [    ] o.a.s.c.a.NodeLostTrigger NodeLostTrigger .auto_add_replicas - Initial livenodes: [127.0.0.1:33911_solr]
   [junit4]   2> 1406314 DEBUG (OverseerAutoScalingTriggerThread-72119430086328324-127.0.0.1:33911_solr-n_0000000000) [    ] o.a.s.c.a.OverseerTriggerThread -- clean old nodeAdded markers
   [junit4]   2> 1406314 DEBUG (OverseerAutoScalingTriggerThread-72119430086328324-127.0.0.1:33911_solr-n_0000000000) [    ] o.a.s.c.a.OverseerTriggerThread Current znodeVersion 1, lastZnodeVersion 1
   [junit4]   2> 1406314 DEBUG (ScheduledTrigger-6586-thread-1) [    ] o.a.s.c.a.NodeLostTrigger Running NodeLostTrigger: .auto_add_replicas with currently live nodes: 1
   [junit4]   2> 1406320 INFO  (jetty-launcher-8701-thread-1) [n:127.0.0.1:33911_solr    ] o.a.s.h.a.MetricsHistoryHandler No .system collection, keeping metrics history in memory.
   [junit4]   2> 1406323 INFO  (jetty-launcher-8701-thread-2) [    ] o.a.s.c.ZkContainer Zookeeper client=127.0.0.1:42963/solr
   [junit4]   2> 1406324 INFO  (zkConnectionManagerCallback-8726-thread-1) [    ] o.a.s.c.c.ConnectionManager zkClient has connected
   [junit4]   2> 1406325 INFO  (zkConnectionManagerCallback-8728-thread-1) [    ] o.a.s.c.c.ConnectionManager zkClient has connected
   [junit4]   2> 1406328 INFO  (jetty-launcher-8701-thread-2) [n:127.0.0.1:41503_solr    ] o.a.s.c.c.ZkStateReader Updated live nodes from ZooKeeper... (0) -> (1)
   [junit4]   2> 1406329 INFO  (jetty-launcher-8701-thread-2) [n:127.0.0.1:41503_solr    ] o.a.s.c.TransientSolrCoreCacheDefault Allocating transient cache for 2147483647 transient cores
   [junit4]   2> 1406329 INFO  (jetty-launcher-8701-thread-2) [n:127.0.0.1:41503_solr    ] o.a.s.c.ZkController Register node as live in ZooKeeper:/live_nodes/127.0.0.1:41503_solr
   [junit4]   2> 1406330 INFO  (zkCallback-8720-thread-1) [    ] o.a.s.c.c.ZkStateReader Updated live nodes from ZooKeeper... (1) -> (2)
   [junit4]   2> 1406330 INFO  (zkCallback-8713-thread-1) [    ] o.a.s.c.c.ZkStateReader Updated live nodes from ZooKeeper... (1) -> (2)
   [junit4]   2> 1406330 INFO  (zkCallback-8727-thread-1) [    ] o.a.s.c.c.ZkStateReader Updated live nodes from ZooKeeper... (1) -> (2)
   [junit4]   2> 1406331 INFO  (jetty-launcher-8701-thread-1) [n:127.0.0.1:33911_solr    ] o.a.s.m.r.SolrJmxReporter JMX monitoring for 'solr_33911.solr.node' (registry 'solr.node') enabled at server: com.sun.jmx.mbeanserver.JmxMBeanServer@603c9810
   [junit4]   2> 1406336 INFO  (jetty-launcher-8701-thread-1) [n:127.0.0.1:33911_solr    ] o.a.s.m.r.SolrJmxReporter JMX monitoring for 'solr_33911.solr.jvm' (registry 'solr.jvm') enabled at server: com.sun.jmx.mbeanserver.JmxMBeanServer@603c9810
   [junit4]   2> 1406336 INFO  (jetty-launcher-8701-thread-1) [n:127.0.0.1:33911_solr    ] o.a.s.m.r.SolrJmxReporter JMX monitoring for 'solr_33911.solr.jetty' (registry 'solr.jetty') enabled at server: com.sun.jmx.mbeanserver.JmxMBeanServer@603c9810
   [junit4]   2> 1406336 INFO  (jetty-launcher-8701-thread-1) [n:127.0.0.1:33911_solr    ] o.a.s.c.CorePropertiesLocator Found 0 core definitions underneath /home/jenkins/workspace/Lucene-Solr-master-Linux/solr/build/solr-core/test/J1/temp/solr.cloud.TestWithCollection_EF87C5A37A165324-001/tempDir-001/node1/.
   [junit4]   2> 1406337 INFO  (zkConnectionManagerCallback-8735-thread-1) [    ] o.a.s.c.c.ConnectionManager zkClient has connected
   [junit4]   2> 1406338 INFO  (jetty-launcher-8701-thread-2) [n:127.0.0.1:41503_solr    ] o.a.s.c.c.ZkStateReader Updated live nodes from ZooKeeper... (0) -> (2)
   [junit4]   2> 1406339 INFO  (jetty-launcher-8701-thread-2) [n:127.0.0.1:41503_solr    ] o.a.s.c.s.i.ZkClientClusterStateProvider Cluster at 127.0.0.1:42963/solr ready
   [junit4]   2> 1406339 INFO  (jetty-launcher-8701-thread-2) [n:127.0.0.1:41503_solr    ] o.a.s.h.a.MetricsHistoryHandler No .system collection, keeping metrics history in memory.
   [junit4]   2> 1406352 INFO  (jetty-launcher-8701-thread-2) [n:127.0.0.1:41503_solr    ] o.a.s.m.r.SolrJmxReporter JMX monitoring for 'solr_41503.solr.node' (registry 'solr.node') enabled at server: com.sun.jmx.mbeanserver.JmxMBeanServer@603c9810
   [junit4]   2> 1406360 INFO  (jetty-launcher-8701-thread-2) [n:127.0.0.1:41503_solr    ] o.a.s.m.r.SolrJmxReporter JMX monitoring for 'solr_41503.solr.jvm' (registry 'solr.jvm') enabled at server: com.sun.jmx.mbeanserver.JmxMBeanServer@603c9810
   [junit4]   2> 1406360 INFO  (jetty-launcher-8701-thread-2) [n:127.0.0.1:41503_solr    ] o.a.s.m.r.SolrJmxReporter JMX monitoring for 'solr_41503.solr.jetty' (registry 'solr.jetty') enabled at server: com.sun.jmx.mbeanserver.JmxMBeanServer@603c9810
   [junit4]   2> 1406361 INFO  (jetty-launcher-8701-thread-2) [n:127.0.0.1:41503_solr    ] o.a.s.c.CorePropertiesLocator Found 0 core definitions underneath /home/jenkins/workspace/Lucene-Solr-master-Linux/solr/build/solr-core/test/J1/temp/solr.cloud.TestWithCollection_EF87C5A37A165324-001/tempDir-001/node2/.
   [junit4]   2> 1406377 INFO  (zkConnectionManagerCallback-8738-thread-1) [    ] o.a.s.c.c.ConnectionManager zkClient has connected
   [junit4]   2> 1406379 INFO  (zkConnectionManagerCallback-8743-thread-1) [    ] o.a.s.c.c.ConnectionManager zkClient has connected
   [junit4]   2> 1406380 INFO  (SUITE-TestWithCollection-seed#[EF87C5A37A165324]-worker) [    ] o.a.s.c.c.ZkStateReader Updated live nodes from ZooKeeper... (0) -> (2)
   [junit4]   2> 1406381 INFO  (SUITE-TestWithCollection-seed#[EF87C5A37A165324]-worker) [    ] o.a.s.c.s.i.ZkClientClusterStateProvider Cluster at 127.0.0.1:42963/solr ready
   [junit4]   2> 1406387 INFO  (TEST-TestWithCollection.testMoveReplicaWithCollection-seed#[EF87C5A37A165324]) [    ] o.a.s.SolrTestCaseJ4 ###Starting testMoveReplicaWithCollection
   [junit4]   2> 1406388 DEBUG (zkCallback-8720-thread-1) [    ] o.a.s.c.a.OverseerTriggerThread Refreshing /autoscaling.json with znode version 2
   [junit4]   2> 1406388 DEBUG (OverseerAutoScalingTriggerThread-72119430086328324-127.0.0.1:33911_solr-n_0000000000) [    ] o.a.s.c.a.OverseerTriggerThread Processed trigger updates upto znodeVersion 2
   [junit4]   2> 1406389 INFO  (TEST-TestWithCollection.testMoveReplicaWithCollection-seed#[EF87C5A37A165324]) [    ] o.a.s.c.c.ZkStateReader Updated live nodes from ZooKeeper... (0) -> (2)
   [junit4]   2> 1406389 DEBUG (OverseerAutoScalingTriggerThread-72119430086328324-127.0.0.1:33911_solr-n_0000000000) [    ] o.a.s.c.a.OverseerTriggerThread -- clean old nodeLost markers
   [junit4]   2> 1406390 DEBUG (OverseerAutoScalingTriggerThread-72119430086328324-127.0.0.1:33911_solr-n_0000000000) [    ] o.a.s.c.a.OverseerTriggerThread -- clean old nodeAdded markers
   [junit4]   2> 1406390 DEBUG (OverseerAutoScalingTriggerThread-72119430086328324-127.0.0.1:33911_solr-n_0000000000) [    ] o.a.s.c.a.OverseerTriggerThread Current znodeVersion 2, lastZnodeVersion 2
   [junit4]   2> 1406404 INFO  (qtp444998032-24472) [n:127.0.0.1:33911_solr    ] o.a.s.s.HttpSolrCall [admin] webapp=null path=/admin/metrics params={prefix=CONTAINER.fs.usableSpace,CORE.coreName&wt=javabin&version=2&group=solr.node,solr.core} status=0 QTime=0
   [junit4]   2> 1406415 INFO  (qtp1707284511-24469) [n:127.0.0.1:41503_solr    ] o.a.s.s.HttpSolrCall [admin] webapp=null path=/admin/metrics params={prefix=CONTAINER.fs.usableSpace,CORE.coreName&wt=javabin&version=2&group=solr.node,solr.core} status=0 QTime=0
   [junit4]   2> 1406415 DEBUG (qtp444998032-24468) [n:127.0.0.1:33911_solr    ] o.a.s.c.a.AutoScalingHandler Verified autoscaling configuration
   [junit4]   2> 1406416 INFO  (qtp444998032-24468) [n:127.0.0.1:33911_solr    ] o.a.s.s.HttpSolrCall [admin] webapp=null path=/admin/autoscaling params={wt=javabin&version=2} status=0 QTime=14
   [junit4]   2> 1406416 DEBUG (zkCallback-8720-thread-1) [    ] o.a.s.c.a.OverseerTriggerThread Refreshing /autoscaling.json with znode version 3
   [junit4]   2> 1406416 INFO  (TEST-TestWithCollection.testMoveReplicaWithCollection-seed#[EF87C5A37A165324]) [    ] o.a.s.c.TestWithCollection Chosen node 127.0.0.1:33911_solr for collection testMoveReplicaWithCollection_abc
   [junit4]   2> 1406416 DEBUG (OverseerAutoScalingTriggerThread-72119430086328324-127.0.0.1:33911_solr-n_0000000000) [    ] o.a.s.c.a.OverseerTriggerThread Processed trigger updates upto znodeVersion 3
   [junit4]   2> 1406416 DEBUG (OverseerAutoScalingTriggerThread-72119430086328324-127.0.0.1:33911_solr-n_0000000000) [    ] o.a.s.c.a.OverseerTriggerThread -- clean old nodeLost markers
   [junit4]   2> 1406416 DEBUG (OverseerAutoScalingTriggerThread-72119430086328324-127.0.0.1:33911_solr-n_0000000000) [    ] o.a.s.c.a.OverseerTriggerThread -- clean old nodeAdded markers
   [junit4]   2> 1406416 DEBUG (OverseerAutoScalingTriggerThread-72119430086328324-127.0.0.1:33911_solr-n_0000000000) [    ] o.a.s.c.a.OverseerTriggerThread Current znodeVersion 3, lastZnodeVersion 3
   [junit4]   2> 1406416 INFO  (qtp444998032-24470) [n:127.0.0.1:33911_solr    ] o.a.s.h.a.CollectionsHandler Invoked Collection Action :create with params pullReplicas=0&name=testMoveReplicaWithCollection_abc&nrtReplicas=1&action=CREATE&numShards=1&tlogReplicas=0&createNodeSet=127.0.0.1:33911_solr&wt=javabin&version=2 and sendToOCPQueue=true
   [junit4]   2> 1406417 INFO  (OverseerThreadFactory-6588-thread-1) [    ] o.a.s.c.a.c.CreateCollectionCmd Create collection testMoveReplicaWithCollection_abc
   [junit4]   2> 1406417 INFO  (OverseerThreadFactory-6588-thread-1) [    ] o.a.s.c.c.ZkConfigManager Copying zk node /configs/_default/protwords.txt to /configs/testMoveReplicaWithCollection_abc.AUTOCREATED/protwords.txt
   [junit4]   2> 1406418 INFO  (OverseerThreadFactory-6588-thread-1) [    ] o.a.s.c.c.ZkConfigManager Copying zk node /configs/_default/managed-schema to /configs/testMoveReplicaWithCollection_abc.AUTOCREATED/managed-schema
   [junit4]   2> 1406418 INFO  (OverseerThreadFactory-6588-thread-1) [    ] o.a.s.c.c.ZkConfigManager Copying zk node /configs/_default/solrconfig.xml to /configs/testMoveReplicaWithCollection_abc.AUTOCREATED/solrconfig.xml
   [junit4]   2> 1406419 INFO  (OverseerThreadFactory-6588-thread-1) [    ] o.a.s.c.c.ZkConfigManager Copying zk node /configs/_default/synonyms.txt to /configs/testMoveReplicaWithCollection_abc.AUTOCREATED/synonyms.txt
   [junit4]   2> 1406420 INFO  (OverseerThreadFactory-6588-thread-1) [    ] o.a.s.c.c.ZkConfigManager Copying zk node /configs/_default/stopwords.txt to /configs/testMoveReplicaWithCollection_abc.AUTOCREATED/stopwords.txt
   [junit4]   2> 1406420 INFO  (OverseerThreadFactory-6588-thread-1) [    ] o.a.s.c.c.ZkConfigManager Copying zk node /configs/_default/lang/contractions_it.txt to /configs/testMoveReplicaWithCollection_abc.AUTOCREATED/lang/contractions_it.txt
   [junit4]   2> 1406421 INFO  (OverseerThreadFactory-6588-thread-1) [    ] o.a.s.c.c.ZkConfigManager Copying zk node /configs/_default/lang/stemdict_nl.txt to /configs/testMoveReplicaWithCollection_abc.AUTOCREATED/lang/stemdict_nl.txt
   [junit4]   2> 1406421 INFO  (OverseerThreadFactory-6588-thread-1) [    ] o.a.s.c.c.ZkConfigManager Copying zk node /configs/_default/lang/stopwords_hy.txt to /configs/testMoveReplicaWithCollection_abc.AUTOCREATED/lang/stopwords_hy.txt
   [junit4]   2> 1406422 INFO  (OverseerThreadFactory-6588-thread-1) [    ] o.a.s.c.c.ZkConfigManager Copying zk node /configs/_default/lang/stopwords_no.txt to /configs/testMoveReplicaWithCollection_abc.AUTOCREATED/lang/stopwords_no.txt
   [junit4]   2> 1406422 INFO  (OverseerThreadFactory-6588-thread-1) [    ] o.a.s.c.c.ZkConfigManager Copying zk node /configs/_default/lang/contractions_ca.txt to /configs/testMoveReplicaWithCollection_abc.AUTOCREATED/lang/contractions_ca.txt
   [junit4]   2> 1406423 INFO  (OverseerThreadFactory-6588-thread-1) [    ] o.a.s.c.c.ZkConfigManager Copying zk node /configs/_default/lang/stopwords_id.txt to /configs/testMoveReplicaWithCollection_abc.AUTOCREATED/lang/stopwords_id.txt
   [junit4]   2> 1406423 INFO  (OverseerThreadFactory-6588-thread-1) [    ] o.a.s.c.c.ZkConfigManager Copying zk node /configs/_default/lang/stopwords_ga.txt to /configs/testMoveReplicaWithCollection_abc.AUTOCREATED/lang/stopwords_ga.txt
   [junit4]   2> 1406424 INFO  (OverseerThreadFactory-6588-thread-1) [    ] o.a.s.c.c.ZkConfigManager Copying zk node /configs/_default/lang/stopwords_hi.txt to /configs/testMoveReplicaWithCollection_abc.AUTOCREATED/lang/stopwords_hi.txt
   [junit4]   2> 1406424 INFO  (OverseerThreadFactory-6588-thread-1) [    ] o.a.s.c.c.ZkConfigManager Copying zk node /configs/_default/lang/stopwords_da.txt to /configs/testMoveReplicaWithCollection_abc.AUTOCREATED/lang/stopwords_da.txt
   [junit4]   2> 1406425 INFO  (OverseerThreadFactory-6588-thread-1) [    ] o.a.s.c.c.ZkConfigManager Copying zk node /configs/_default/lang/stopwords_ja.txt to /configs/testMoveReplicaWithCollection_abc.AUTOCREATED/lang/stopwords_ja.txt
   [junit4]   2> 1406425 INFO  (OverseerThreadFactory-6588-thread-1) [    ] o.a.s.c.c.ZkConfigManager Copying zk node /configs/_default/lang/stopwords_pt.txt to /configs/testMoveReplicaWithCollection_abc.AUTOCREATED/lang/stopwords_pt.txt
   [junit4]   2> 1406426 INFO  (OverseerThreadFactory-6588-thread-1) [    ] o.a.s.c.c.ZkConfigManager Copying zk node /configs/_default/lang/stopwords_hu.txt to /configs/testMoveReplicaWithCollection_abc.AUTOCREATED/lang/stopwords_hu.txt
   [junit4]   2> 1406426 INFO  (OverseerThreadFactory-6588-thread-1) [    ] o.a.s.c.c.ZkConfigManager Copying zk node /configs/_default/lang/stopwords_el.txt to /configs/testMoveReplicaWithCollection_abc.AUTOCREATED/lang/stopwords_el.txt
   [junit4]   2> 1406427 INFO  (OverseerThreadFactory-6588-thread-1) [    ] o.a.s.c.c.ZkConfigManager Copying zk node /configs/_default/lang/stopwords_ru.txt to /configs/testMoveReplicaWithCollection_abc.AUTOCREATED/lang/stopwords_ru.txt
   [junit4]   2> 1406427 INFO  (OverseerThreadFactory-6588-thread-1) [    ] o.a.s.c.c.ZkConfigManager Copying zk node /configs/_default/lang/stopwords_tr.txt to /configs/testMoveReplicaWithCollection_abc.AUTOCREATED/lang/stopwords_tr.txt
   [junit4]   2> 1406428 INFO  (OverseerThreadFactory-6588-thread-1) [    ] o.a.s.c.c.ZkConfigManager Copying zk node /configs/_default/lang/stopwords_ar.txt to /configs/testMoveReplicaWithCollection_abc.AUTOCREATED/lang/stopwords_ar.txt
   [junit4]   2> 1406428 INFO  (OverseerThreadFactory-6588-thread-1) [    ] o.a.s.c.c.ZkConfigManager Copying zk node /configs/_default/lang/userdict_ja.txt to /configs/testMoveReplicaWithCollection_abc.AUTOCREATED/lang/userdict_ja.txt
   [junit4]   2> 1406429 INFO  (OverseerThreadFactory-6588-thread-1) [    ] o.a.s.c.c.ZkConfigManager Copying zk node /configs/_default/lang/stopwords_eu.txt to /configs/testMoveReplicaWithCollection_abc.AUTOCREATED/lang/stopwords_eu.txt
   [junit4]   2> 1406429 INFO  (OverseerThreadFactory-6588-thread-1) [    ] o.a.s.c.c.ZkConfigManager Copying zk node /configs/_default/lang/stopwords_it.txt to /configs/testMoveReplicaWithCollection_abc.AUTOCREATED/lang/stopwords_it.txt
   [junit4]   2> 1406430 INFO  (OverseerThreadFactory-6588-thread-1) [    ] o.a.s.c.c.ZkConfigManager Copying zk node /configs/_default/lang/stopwords_cz.txt to /configs/testMoveReplicaWithCollection_abc.AUTOCREATED/lang/stopwords_cz.txt
   [junit4]   2> 1406431 INFO  (OverseerThreadFactory-6588-thread-1) [    ] o.a.s.c.c.ZkConfigManager Copying zk node /configs/_default/lang/stoptags_ja.txt to /configs/testMoveReplicaWithCollection_abc.AUTOCREATED/lang/stoptags_ja.txt
   [junit4]   2> 1406431 INFO  (OverseerThreadFactory-6588-thread-1) [    ] o.a.s.c.c.ZkConfigManager Copying zk node /configs/_default/lang/contractions_fr.txt to /configs/testMoveReplicaWithCollection_abc.AUTOCREATED/lang/contractions_fr.txt
   [junit4]   2> 1406432 INFO  (OverseerThreadFactory-6588-thread-1) [    ] o.a.s.c.c.ZkConfigManager Copying zk node /configs/_default/lang/stopwords_de.txt to /configs/testMoveReplicaWithCollection_abc.AUTOCREATED/lang/stopwords_de.txt
   [junit4]   2> 1406433 INFO  (OverseerThreadFactory-6588-thread-1) [    ] o.a.s.c.c.ZkConfigManager Copying zk node /configs/_default/lang/stopwords_fa.txt to /configs/testMoveReplicaWithCollection_abc.AUTOCREATED/lang/stopwords_fa.txt
   [junit4]   2> 1406433 INFO  (OverseerThreadFactory-6588-thread-1) [    ] o.a.s.c.c.ZkConfigManager Copying zk node /configs/_default/lang/contractions_ga.txt to /configs/testMoveReplicaWithCollection_abc.AUTOCREATED/lang/contractions_ga.txt
   [junit4]   2> 1406434 INFO  (OverseerThreadFactory-6588-thread-1) [    ] o.a.s.c.c.ZkConfigManager Copying zk node /configs/_default/lang/stopwords_ca.txt to /configs/testMoveReplicaWithCollection_abc.AUTOCREATED/lang/stopwords_ca.txt
   [junit4]   2> 1406434 INFO  (OverseerThreadFactory-6588-thread-1) [    ] o.a.s.c.c.ZkConfigManager Copying zk node /configs/_default/lang/stopwords_nl.txt to /configs/testMoveReplicaWithCollection_abc.AUTOCREATED/lang/stopwords_nl.txt
   [junit4]   2> 1406435 INFO  (OverseerThreadFactory-6588-thread-1) [    ] o.a.s.c.c.ZkConfigManager Copying zk node /configs/_default/lang/stopwords_bg.txt to /configs/testMoveReplicaWithCollection_abc.AUTOCREATED/lang/stopwords_bg.txt
   [junit4]   2> 1406435 INFO  (OverseerThreadFactory-6588-thread-1) [    ] o.a.s.c.c.ZkConfigManager Copying zk node /configs/_default/lang/stopwords_lv.txt to /configs/testMoveReplicaWithCollection_abc.AUTOCREATED/lang/stopwords_lv.txt
   [junit4]   2> 1406436 INFO  (OverseerThreadFactory-6588-thread-1) [    ] o.a.s.c.c.ZkConfigManager Copying zk node /configs/_default/lang/stopwords_en.txt to /configs/testMoveReplicaWithCollection_abc.AUTOCREATED/lang/stopwords_en.txt
   [junit4]   2> 1406437 INFO  (OverseerThreadFactory-6588-thread-1) [    ] o.a.s.c.c.ZkConfigManager Copying zk node /configs/_default/lang/stopwords_es.txt to /configs/testMoveReplicaWithCollection_abc.AUTOCREATED/lang/stopwords_es.txt
   [junit4]   2> 1406437 INFO  (OverseerThreadFactory-6588-thread-1) [    ] o.a.s.c.c.ZkConfigManager Copying zk node /configs/_default/lang/stopwords_th.txt to /configs/testMoveReplicaWithCollection_abc.AUTOCREATED/lang/stopwords_th.txt
   [junit4]   2> 1406438 INFO  (OverseerThreadFactory-6588-thread-1) [    ] o.a.s.c.c.ZkConfigManager Copying zk node /configs/_default/lang/stopwords_ro.txt to /configs/testMoveReplicaWithCollection_abc.AUTOCREATED/lang/stopwords_ro.txt
   [junit4]   2> 1406438 INFO  (OverseerThreadFactory-6588-thread-1) [    ] o.a.s.c.c.ZkConfigManager Copying zk node /configs/_default/lang/stopwords_fr.txt to /configs/testMoveReplicaWithCollection_abc.AUTOCREATED/lang/stopwords_fr.txt
   [junit4]   2> 1406439 INFO  (OverseerThreadFactory-6588-thread-1) [    ] o.a.s.c.c.ZkConfigManager Copying zk node /configs/_default/lang/stopwords_sv.txt to /configs/testMoveReplicaWithCollection_abc.AUTOCREATED/lang/stopwords_sv.txt
   [junit4]   2> 1406439 INFO  (OverseerThreadFactory-6588-thread-1) [    ] o.a.s.c.c.ZkConfigManager Copying zk node /configs/_default/lang/stopwords_fi.txt to /configs/testMoveReplicaWithCollection_abc.AUTOCREATED/lang/stopwords_fi.txt
   [junit4]   2> 1406440 INFO  (OverseerThreadFactory-6588-thread-1) [    ] o.a.s.c.c.ZkConfigManager Copying zk node /configs/_default/lang/hyphenations_ga.txt to /configs/testMoveReplicaWithCollection_abc.AUTOCREATED/lang/hyphenations_ga.txt
   [junit4]   2> 1406440 INFO  (OverseerThreadFactory-6588-thread-1) [    ] o.a.s.c.c.ZkConfigManager Copying zk node /configs/_default/lang/stopwords_gl.txt to /configs/testMoveReplicaWithCollection_abc.AUTOCREATED/lang/stopwords_gl.txt
   [junit4]   2> 1406441 INFO  (OverseerThreadFactory-6588-thread-1) [    ] o.a.s.c.c.ZkConfigManager Copying zk node /configs/_default/params.json to /configs/testMoveReplicaWithCollection_abc.AUTOCREATED/params.json
   [junit4]   2> 1406545 DEBUG (OverseerThreadFactory-6588-thread-1) [    ] o.a.s.c.s.c.a.PolicyHelper Creating a new session
   [junit4]   2> 1406547 INFO  (qtp444998032-24537) [n:127.0.0.1:33911_solr    ] o.a.s.s.HttpSolrCall [admin] webapp=null path=/admin/metrics params={prefix=CONTAINER.fs.usableSpace,CONTAINER.fs.totalSpace,CORE.coreName&wt=javabin&version=2&group=solr.node,solr.core} status=0 QTime=0
   [junit4]   2> 1406548 INFO  (qtp1707284511-24471) [n:127.0.0.1:41503_solr    ] o.a.s.s.HttpSolrCall [admin] webapp=null path=/admin/metrics params={prefix=CONTAINER.fs.usableSpace,CONTAINER.fs.totalSpace,CORE.coreName&wt=javabin&version=2&group=solr.node,solr.core} status=0 QTime=0
   [junit4]   2> 1406548 DEBUG (OverseerThreadFactory-6588-thread-1) [    ] o.a.s.c.s.c.a.PolicyHelper New session created 
   [junit4]   2> 1406549 INFO  (OverseerThreadFactory-6588-thread-1) [    ] o.a.s.c.s.c.a.PolicyHelper returnSession, curr-time 943543633 sessionWrapper.createTime 943543632198490, this.sessionWrapper.createTime 943543632198490 
   [junit4]   2> 1406552 INFO  (OverseerStateUpdate-72119430086328324-127.0.0.1:33911_solr-n_0000000000) [    ] o.a.s.c.o.SliceMutator createReplica() {
   [junit4]   2>   "operation":"ADDREPLICA",
   [junit4]   2>   "collection":"testMoveReplicaWithCollection_abc",
   [junit4]   2>   "shard":"shard1",
   [junit4]   2>   "core":"testMoveReplicaWithCollection_abc_shard1_replica_n1",
   [junit4]   2>   "state":"down",
   [junit4]   2>   "base_url":"https://127.0.0.1:33911/solr",
   [junit4]   2>   "type":"NRT",
   [junit4]   2>   "waitForFinalState":"false"} 
   [junit4]   2> 1406755 INFO  (qtp444998032-24460) [n:127.0.0.1:33911_solr    x:testMoveReplicaWithCollection_abc_shard1_replica_n1] o.a.s.h.a.CoreAdminOperation core create command qt=/admin/cores&coreNodeName=core_node2&collection.configName=testMoveReplicaWithCollection_abc.AUTOCREATED&newCollection=true&name=testMoveReplicaWithCollection_abc_shard1_replica_n1&action=CREATE&numShards=1&collection=testMoveReplicaWithCollection_abc&shard=shard1&wt=javabin&version=2&replicaType=NRT
   [junit4]   2> 1406756 INFO  (qtp444998032-24460) [n:127.0.0.1:33911_solr    x:testMoveReplicaWithCollection_abc_shard1_replica_n1] o.a.s.c.TransientSolrCoreCacheDefault Allocating transient cache for 2147483647 transient cores
   [junit4]   2> 1407764 INFO  (qtp444998032-24460) [n:127.0.0.1:33911_solr c:testMoveReplicaWithCollection_abc s:shard1 r:core_node2 x:testMoveReplicaWithCollection_abc_shard1_replica_n1] o.a.s.c.RequestParams conf resource params.json loaded . version : 0 
   [junit4]   2> 1407764 INFO  (qtp444998032-24460) [n:127.0.0.1:33911_solr c:testMoveReplicaWithCollection_abc s:shard1 r:core_node2 x:testMoveReplicaWithCollection_abc_shard1_replica_n1] o.a.s.c.RequestParams request params refreshed to version 0
   [junit4]   2> 1407765 WARN  (qtp444998032-24460) [n:127.0.0.1:33911_solr c:testMoveReplicaWithCollection_abc s:shard1 r:core_node2 x:testMoveReplicaWithCollection_abc_shard1_replica_n1] o.a.s.c.SolrConfig Couldn't add files from /home/jenkins/workspace/Lucene-Solr-master-Linux/solr/build/solr-core/test/J1/temp/solr.cloud.TestWithCollection_EF87C5A37A165324-001/tempDir-001/node1/testMoveReplicaWithCollection_abc_shard1_replica_n1/../../../../contrib/extraction/lib filtered by .*\.jar to classpath: /home/jenkins/workspace/Lucene-Solr-master-Linux/solr/build/solr-core/test/J1/temp/solr.cloud.TestWithCollection_EF87C5A37A165324-001/tempDir-001/node1/testMoveReplicaWithCollection_abc_shard1_replica_n1/../../../../contrib/extraction/lib
   [junit4]   2> 1407765 WARN  (qtp444998032-24460) [n:127.0.0.1:33911_solr c:testMoveReplicaWithCollection_abc s:shard1 r:core_node2 x:testMoveReplicaWithCollection_abc_shard1_replica_n1] o.a.s.c.SolrConfig Couldn't add files from /home/jenkins/workspace/Lucene-Solr-master-Linux/solr/build/solr-core/test/J1/temp/solr.cloud.TestWithCollection_EF87C5A37A165324-001/tempDir-001/node1/testMoveReplicaWithCollection_abc_shard1_replica_n1/../../../../dist filtered by solr-cell-\d.*\.jar to classpath: /home/jenkins/workspace/Lucene-Solr-master-Linux/solr/build/solr-core/test/J1/temp/solr.cloud.TestWithCollection_EF87C5A37A165324-001/tempDir-001/node1/testMoveReplicaWithCollection_abc_shard1_replica_n1/../../../../dist
   [junit4]   2> 1407765 WARN  (qtp444998032-24460) [n:127.0.0.1:33911_solr c:testMoveReplicaWithCollection_abc s:shard1 r:core_node2 x:testMoveReplicaWithCollection_abc_shard1_replica_n1] o.a.s.c.SolrConfig Couldn't add files from /home/jenkins/workspace/Lucene-Solr-master-Linux/solr/build/solr-core/test/J1/temp/solr.cloud.TestWithCollection_EF87C5A37A165324-001/tempDir-001/node1/testMoveReplicaWithCollection_abc_shard1_replica_n1/../../../../contrib/clustering/lib filtered by .*\.jar to classpath: /home/jenkins/workspace/Lucene-Solr-master-Linux/solr/build/solr-core/test/J1/temp/solr.cloud.TestWithCollection_EF87C5A37A165324-001/tempDir-001/node1/testMoveReplicaWithCollection_abc_shard1_replica_n1/../../../../contrib/clustering/lib
   [junit4]   2> 1407765 WARN  (qtp444998032-24460) [n:127.0.0.1:33911_solr c:testMoveReplicaWithCollection_abc s:shard1 r:core_node2 x:testMoveReplicaWithCollection_abc_shard1_replica_n1] o.a.s.c.SolrConfig Couldn't add files from /home/jenkins/workspace/Lucene-Solr-master-Linux/solr/build/solr-core/test/J1/temp/solr.cloud.TestWithCollection_EF87C5A37A165324-001/tempDir-001/node1/testMoveReplicaWithCollection_abc_shard1_replica_n1/../../../../dist filtered by solr-clustering-\d.*\.jar to classpath: /home/jenkins/workspace/Lucene-Solr-master-Linux/solr/build/solr-core/test/J1/temp/solr.cloud.TestWithCollection_EF87C5A37A165324-001/tempDir-001/node1/testMoveReplicaWithCollection_abc_shard1_replica_n1/../../../../dist
   [junit4]   2> 1407765 WARN  (qtp444998032-24460) [n:127.0.0.1:33911_solr c:testMoveReplicaWithCollection_abc s:shard1 r:core_node2 x:testMoveReplicaWithCollection_abc_shard1_replica_n1] o.a.s.c.SolrConfig Couldn't add files from /home/jenkins/workspace/Lucene-Solr-master-Linux/solr/build/solr-core/test/J1/temp/solr.cloud.TestWithCollection_EF87C5A37A165324-001/tempDir-001/node1/testMoveReplicaWithCollection_abc_shard1_replica_n1/../../../../contrib/langid/lib filtered by .*\.jar to classpath: /home/jenkins/workspace/Lucene-Solr-master-Linux/solr/build/solr-core/test/J1/temp/solr.cloud.TestWithCollection_EF87C5A37A165324-001/tempDir-001/node1/testMoveReplicaWithCollection_abc_shard1_replica_n1/../../../../contrib/langid/lib
   [junit4]   2> 1407765 WARN  (qtp444998032-24460) [n:127.0.0.1:33911_solr c:testMoveReplicaWithCollection_abc s:shard1 r:core_node2 x:testMoveReplicaWithCollection_abc_shard1_replica_n1] o.a.s.c.SolrConfig Couldn't add files from /home/jenkins/workspace/Lucene-Solr-master-Linux/solr/build/solr-core/test/J1/temp/solr.cloud.TestWithCollection_EF87C5A37A165324-001/tempDir-001/node1/testMoveReplicaWithCollection_abc_shard1_replica_n1/../../../../dist filtered by solr-langid-\d.*\.jar to classpath: /home/jenkins/workspace/Lucene-Solr-master-Linux/solr/build/solr-core/test/J1/temp/solr.cloud.TestWithCollection_EF87C5A37A165324-001/tempDir-001/node1/testMoveReplicaWithCollection_abc_shard1_replica_n1/../../../../dist
   [junit4]   2> 1407765 WARN  (qtp444998032-24460) [n:127.0.0.1:33911_solr c:testMoveReplicaWithCollection_abc s:shard1 r:core_node2 x:testMoveReplicaWithCollection_abc_shard1_replica_n1] o.a.s.c.SolrConfig Couldn't add files from /home/jenkins/workspace/Lucene-Solr-master-Linux/solr/build/solr-core/test/J1/temp/solr.cloud.TestWithCollection_EF87C5A37A165324-001/tempDir-001/node1/testMoveReplicaWithCollection_abc_shard1_replica_n1/../../../../contrib/velocity/lib filtered by .*\.jar to classpath: /home/jenkins/workspace/Lucene-Solr-master-Linux/solr/build/solr-core/test/J1/temp/solr.cloud.TestWithCollection_EF87C5A37A165324-001/tempDir-001/node1/testMoveReplicaWithCollection_abc_shard1_replica_n1/../../../../contrib/velocity/lib
   [junit4]   2> 1407765 WARN  (qtp444998032-24460) [n:127.0.0.1:33911_solr c:testMoveReplicaWithCollection_abc s:shard1 r:core_node2 x:testMoveReplicaWithCollection_abc_shard1_replica_n1] o.a.s.c.SolrConfig Couldn't add files from /home/jenkins/workspace/Lucene-Solr-master-Linux/solr/build/solr-core/test/J1/temp/solr.cloud.TestWithCollection_EF87C5A37A165324-001/tempDir-001/node1/testMoveReplicaWithCollection_abc_shard1_replica_n1/../../../../dist filtered by solr-velocity-\d.*\.jar to classpath: /home/jenkins/workspace/Lucene-Solr-master-Linux/solr/build/solr-core/test/J1/temp/solr.cloud.TestWithCollection_EF87C5A37A165324-001/tempDir-001/node1/testMoveReplicaWithCollection_abc_shard1_replica_n1/../../../../dist
   [junit4]   2> 1407765 WARN  (qtp444998032-24460) [n:127.0.0.1:33911_solr c:testMoveReplicaWithCollection_abc s:shard1 r:core_node2 x:testMoveReplicaWithCollection_abc_shard1_replica_n1] o.a.s.c.SolrConfig Couldn't add files from /home/jenkins/workspace/Lucene-Solr-master-Linux/solr/build/solr-core/test/J1/temp/solr.cloud.TestWithCollection_EF87C5A37A165324-001/tempDir-001/node1/testMoveReplicaWithCollection_abc_shard1_replica_n1/../../../../dist filtered by solr-ltr-\d.*\.jar to classpath: /home/jenkins/workspace/Lucene-Solr-master-Linux/solr/build/solr-core/test/J1/temp/solr.cloud.TestWithCollection_EF87C5A37A165324-001/tempDir-001/node1/testMoveReplicaWithCollection_abc_shard1_replica_n1/../../../../dist
   [junit4]   2> 1407770 INFO  (qtp444998032-24460) [n:127.0.0.1:33911_solr c:testMoveReplicaWithCollection_abc s:shard1 r:core_node2 x:testMoveReplicaWithCollection_abc_shard1_replica_n1] o.a.s.c.SolrConfig Using Lucene MatchVersion: 8.0.0
   [junit4]   2> 1407783 INFO  (qtp444998032-24460) [n:127.0.0.1:33911_solr c:testMoveReplicaWithCollection_abc s:shard1 r:core_node2 x:testMoveReplicaWithCollection_abc_shard1_replica_n1] o.a.s.s.IndexSchema [testMoveReplicaWithCollection_abc_shard1_replica_n1] Schema name=default-config
   [junit4]   2> 1407880 INFO  (qtp444998032-24460) [n:127.0.0.1:33911_solr c:testMoveReplicaWithCollection_abc s:shard1 r:core_node2 x:testMoveReplicaWithCollection_abc_shard1_replica_n1] o.a.s.s.IndexSchema Loaded schema default-config/1.6 with uniqueid field id
   [junit4]   2> 1407894 INFO  (qtp444998032-24460) [n:127.0.0.1:33911_solr c:testMoveReplicaWithCollection_abc s:shard1 r:core_node2 x:testMoveReplicaWithCollection_abc_shard1_replica_n1] o.a.s.c.CoreContainer Creating SolrCore 'testMoveReplicaWithCollection_abc_shard1_replica_n1' using configuration from collection testMoveReplicaWithCollection_abc, trusted=true
   [junit4]   2> 1407894 INFO  (qtp444998032-24460) [n:127.0.0.1:33911_solr c:testMoveReplicaWithCollection_abc s:shard1 r:core_node2 x:testMoveReplicaWithCollection_abc_shard1_replica_n1] o.a.s.m.r.SolrJmxReporter JMX monitoring for 'solr_33911.solr.core.testMoveReplicaWithCollection_abc.shard1.replica_n1' (registry 'solr.core.testMoveReplicaWithCollection_abc.shard1.replica_n1') enabled at server: com.sun.jmx.mbeanserver.JmxMBeanServer@603c9810
   [junit4]   2> 1407894 INFO  (qtp444998032-24460) [n:127.0.0.1:33911_solr c:testMoveReplicaWithCollection_abc s:shard1 r:core_node2 x:testMoveReplicaWithCollection_abc_shard1_replica_n1] o.a.s.c.SolrCore solr.RecoveryStrategy.Builder
   [junit4]   2> 1407894 INFO  (qtp444998032-24460) [n:127.0.0.1:33911_solr c:testMoveReplicaWithCollection_abc s:shard1 r:core_node2 x:testMoveReplicaWithCollection_abc_shard1_replica_n1] o.a.s.c.SolrCore [[testMoveReplicaWithCollection_abc_shard1_replica_n1] ] Opening new SolrCore at [/home/jenkins/workspace/Lucene-Solr-master-Linux/solr/build/solr-core/test/J1/temp/solr.cloud.TestWithCollection_EF87C5A37A165324-001/tempDir-001/node1/testMoveReplicaWithCollection_abc_shard1_replica_n1], dataDir=[/home/jenkins/workspace/Lucene-Solr-master-Linux/solr/build/solr-core/test/J1/temp/solr.cloud.TestWithCollection_EF87C5A37A165324-001/tempDir-001/node1/./testMoveReplicaWithCollection_abc_shard1_replica_n1/data/]
   [junit4]   2> 1407897 INFO  (qtp444998032-24460) [n:127.0.0.1:33911_solr c:testMoveReplicaWithCollection_abc s:shard1 r:core_node2 x:testMoveReplicaWithCollection_abc_shard1_replica_n1] o.a.s.r.XSLTResponseWriter xsltCacheLifetimeSeconds=5
   [junit4]   2> 1407940 INFO  (qtp444998032-24460) [n:127.0.0.1:33911_solr c:testMoveReplicaWithCollection_abc s:shard1 r:core_node2 x:testMoveReplicaWithCollection_abc_shard1_replica_n1] o.a.s.u.UpdateHandler Using UpdateLog implementation: org.apache.solr.update.UpdateLog
   [junit4]   2> 1407940 INFO  (qtp444998032-24460) [n:127.0.0.1:33911_solr c:testMoveReplicaWithCollection_abc s:shard1 r:core_node2 x:testMoveReplicaWithCollection_abc_shard1_replica_n1] o.a.s.u.UpdateLog Initializing UpdateLog: dataDir= defaultSyncLevel=FLUSH numRecordsToKeep=100 maxNumLogsToKeep=10 numVersionBuckets=65536
   [junit4]   2> 1407941 INFO  (qtp444998032-24460) [n:127.0.0.1:33911_solr c:testMoveReplicaWithCollection_abc s:shard1 r:core_node2 x:testMoveReplicaWithCollection_abc_shard1_replica_n1] o.a.s.u.CommitTracker Hard AutoCommit: if uncommited for 15000ms; 
   [junit4]   2> 1407941 INFO  (qtp444998032-24460) [n:127.0.0.1:33911_solr c:testMoveReplicaWithCollection_abc s:shard1 r:core_node2 x:testMoveReplicaWithCollection_abc_shard1_replica_n1] o.a.s.u.CommitTracker Soft AutoCommit: disabled
   [junit4]   2> 1407942 INFO  (qtp444998032-24460) [n:127.0.0.1:33911_solr c:testMoveReplicaWithCollection_abc s:shard1 r:core_node2 x:testMoveReplicaWithCollection_abc_shard1_replica_n1] o.a.s.s.SolrIndexSearcher Opening [Searcher@f3c6746[testMoveReplicaWithCollection_abc_shard1_replica_n1] main]
   [junit4]   2> 1407943 INFO  (qtp444998032-24460) [n:127.0.0.1:33911_solr c:testMoveReplicaWithCollection_abc s:shard1 r:core_node2 x:testMoveReplicaWithCollection_abc_shard1_replica_n1] o.a.s.r.ManagedResourceStorage Configured ZooKeeperStorageIO with znodeBase: /configs/testMoveReplicaWithCollection_abc.AUTOCREATED
   [junit4]   2> 1407944 INFO  (qtp444998032-24460) [n:127.0.0.1:33911_solr c:testMoveReplicaWithCollection_abc s:shard1 r:core_node2 x:testMoveReplicaWithCollection_abc_shard1_replica_n1] o.a.s.r.ManagedResourceStorage Loaded null at path _rest_managed.json using ZooKeeperStorageIO:path=/configs/testMoveReplicaWithCollection_abc.AUTOCREATED
   [junit4]   2> 1407944 INFO  (qtp444998032-24460) [n:127.0.0.1:33911_solr c:testMoveReplicaWithCollection_abc s:shard1 r:core_node2 x:testMoveReplicaWithCollection_abc_shard1_replica_n1] o.a.s.s.ZkIndexSchemaReader Creating ZooKeeper watch for the managed schema at /configs/testMoveReplicaWithCollection_abc.AUTOCREATED/managed-schema
   [junit4]   2> 1407944 INFO  (qtp444998032-24460) [n:127.0.0.1:33911_solr c:testMoveReplicaWithCollection_abc s:shard1 r:core_node2 x:testMoveReplicaWithCollection_abc_shard1_replica_n1] o.a.s.s.ZkIndexSchemaReader Current schema version 0 is already the latest
   [junit4]   2> 1407944 INFO  (qtp444998032-24460) [n:127.0.0.1:33911_solr c:testMoveReplicaWithCollection_abc s:shard1 r:core_node2 x:testMoveReplicaWithCollection_abc_shard1_replica_n1] o.a.s.h.c.SpellCheckComponent Initializing spell checkers
   [junit4]   2> 1407945 INFO  (qtp444998032-24460) [n:127.0.0.1:33911_solr c:testMoveReplicaWithCollection_abc s:shard1 r:core_node2 x:testMoveReplicaWithCollection_abc_shard1_replica_n1] o.a.s.s.DirectSolrSpellChecker init: {name=default,field=_text_,classname=solr.DirectSolrSpellChecker,distanceMeasure=internal,accuracy=0.5,maxEdits=2,minPrefix=1,maxInspections=5,minQueryLength=4,maxQueryFrequency=0.01}
   [junit4]   2> 1407946 INFO  (qtp444998032-24460) [n:127.0.0.1:33911_solr c:testMoveReplicaWithCollection_abc s:shard1 r:core_node2 x:testMoveReplicaWithCollection_abc_shard1_replica_n1] o.a.s.h.ReplicationHandler Commits will be reserved for 10000ms.
   [junit4]   2> 1407946 INFO  (searcherExecutor-6600-thread-1-processing-n:127.0.0.1:33911_solr x:testMoveReplicaWithCollection_abc_shard1_replica_n1 c:testMoveReplicaWithCollection_abc s:shard1 r:core_node2) [n:127.0.0.1:33911_solr c:testMoveReplicaWithCollection_abc s:shard1 r:core_node2 x:testMoveReplicaWithCollection_abc_shard1_replica_n1] o.a.s.c.QuerySenderListener QuerySenderListener sending requests to Searcher@f3c6746[testMoveReplicaWithCollection_abc_shard1_replica_n1] main{ExitableDirectoryReader(UninvertingDirectoryReader())}
   [junit4]   2> 1407946 INFO  (qtp444998032-24460) [n:127.0.0.1:33911_solr c:testMoveReplicaWithCollection_abc s:shard1 r:core_node2 x:testMoveReplicaWithCollection_abc_shard1_replica_n1] o.a.s.u.UpdateLog Could not find max version in index or recent updates, using new clock 1608139418015629312
   [junit4]   2> 1407946 INFO  (searcherExecutor-6600-thread-1-processing-n:127.0.0.1:33911_solr x:testMoveReplicaWithCollection_abc_shard1_replica_n1 c:testMoveReplicaWithCollection_abc s:shard1 r:core_node2) [n:127.0.0.1:33911_solr c:testMoveReplicaWithCollection_abc s:shard1 r:core_node2 x:testMoveReplicaWithCollection_abc_shard1_replica_n1] o.a.s.c.QuerySenderListener QuerySenderListener done.
   [junit4]   2> 1407946 INFO  (searcherExecutor-6600-thread-1-processing-n:127.0.0.1:33911_solr x:testMoveReplicaWithCollection_abc_shard1_replica_n1 c:testMoveReplicaWithCollection_abc s:shard1 r:core_node2) [n:127.0.0.1:33911_solr c:testMoveReplicaWithCollection_abc s:shard1 r:core_node2 x:testMoveReplicaWithCollection_abc_shard1_replica_n1] o.a.s.h.c.SpellCheckComponent Loading spell index for spellchecker: default
   [junit4]   2> 1407947 INFO  (searcherExecutor-6600-thread-1-processing-n:127.0.0.1:33911_solr x:testMoveReplicaWithCollection_abc_shard1_replica_n1 c:testMoveReplicaWithCollection_abc s:shard1 r:core_node2) [n:127.0.0.1:33911_solr c:testMoveReplicaWithCollection_abc s:shard1 r:core_node2 x:testMoveReplicaWithCollection_abc_shard1_replica_n1] o.a.s.c.SolrCore [testMoveReplicaWithCollection_abc_shard1_replica_n1] Registered new searcher Searcher@f3c6746[testMoveReplicaWithCollection_abc_shard1_replica_n1] main{ExitableDirectoryReader(UninvertingDirectoryReader())}
   [junit4]   2> 1407950 INFO  (qtp444998032-24460) [n:127.0.0.1:33911_solr c:testMoveReplicaWithCollection_abc s:shard1 r:core_node2 x:testMoveReplicaWithCollection_abc_shard1_replica_n1] o.a.s.c.ZkShardTerms Successful update of terms at /collections/testMoveReplicaWithCollection_abc/terms/shard1 to Terms{values={core_node2=0}, version=0}
   [junit4]   2> 1407951 INFO  (qtp444998032-24460) [n:127.0.0.1:33911_solr c:testMoveReplicaWithCollection_abc s:shard1 r:core_node2 x:testMoveReplicaWithCollection_abc_shard1_replica_n1] o.a.s.c.ShardLeaderElectionContext Enough replicas found to continue.
   [junit4]   2> 1407951 INFO  (qtp444998032-24460) [n:127.0.0.1:33911_solr c:testMoveReplicaWithCollection_abc s:shard1 r:core_node2 x:testMoveReplicaWithCollection_abc_shard1_replica_n1] o.a.s.c.ShardLeaderElectionContext I may be the new leader - try and sync
   [junit4]   2> 1407951 INFO  (qtp444998032-24460) [n:127.0.0.1:33911_solr c:testMoveReplicaWithCollection_abc s:shard1 r:core_node2 x:testMoveReplicaWithCollection_abc_shard1_replica_n1] o.a.s.c.SyncStrategy Sync replicas to https://127.0.0.1:33911/solr/testMoveReplicaWithCollection_abc_shard1_replica_n1/
   [junit4]   2> 1407951 INFO  (qtp444998032-24460) [n:127.0.0.1:33911_solr c:testMoveReplicaWithCollection_abc s:shard1 r:core_node2 x:testMoveReplicaWithCollection_abc_shard1_replica_n1] o.a.s.c.SyncStrategy Sync Success - now sync replicas to me
   [junit4]   2> 1407951 INFO  (qtp444998032-24460) [n:127.0.0.1:33911_solr c:testMoveReplicaWithCollection_abc s:shard1 r:core_node2 x:testMoveReplicaWithCollection_abc_shard1_replica_n1] o.a.s.c.SyncStrategy https://127.0.0.1:33911/solr/testMoveReplicaWithCollection_abc_shard1_replica_n1/ has no replicas
   [junit4]   2> 1407951 INFO  (qtp444998032-24460) [n:127.0.0.1:33911_solr c:testMoveReplicaWithCollection_abc s:shard1 r:core_node2 x:testMoveReplicaWithCollection_abc_shard1_replica_n1] o.a.s.c.ShardLeaderElectionContext Found all replicas participating in election, clear LIR
   [junit4]   2> 1407953 INFO  (qtp444998032-24460) [n:127.0.0.1:33911_solr c:testMoveReplicaWithCollection_abc s:shard1 r:core_node2 x:testMoveReplicaWithCollection_abc_shard1_replica_n1] o.a.s.c.ShardLeaderElectionContext I am the new leader: https://127.0.0.1:33911/solr/testMoveReplicaWithCollection_abc_shard1_replica_n1/ shard1
   [junit4]   2> 1408055 INFO  (qtp444998032-24460) [n:127.0.0.1:33911_solr c:testMoveReplicaWithCollection_abc s:shard1 r:core_node2 x:testMoveReplicaWithCollection_abc_shard1_replica_n1] o.a.s.c.ZkController I am the leader, no recovery necessary
   [junit4]   2> 1408057 INFO  (qtp444998032-24460) [n:127.0.0.1:33911_solr c:testMoveReplicaWithCollection_abc s:shard1 r:core_node2 x:testMoveReplicaWithCollection_abc_shard1_replica_n1] o.a.s.s.HttpSolrCall [admin] webapp=null path=/admin/cores params={qt=/admin/cores&coreNodeName=core_node2&collection.configName=testMoveReplicaWithCollection_abc.AUTOCREATED&newCollection=true&name=testMoveReplicaWithCollection_abc_shard1_replica_n1&action=CREATE&numShards=1&collection=testMoveReplicaWithCollection_abc&shard=shard1&wt=javabin&version=2&replicaType=NRT} status=0 QTime=1301
   [junit4]   2> 1408057 DEBUG (OverseerThreadFactory-6588-thread-1) [    ] o.a.s.c.s.c.a.PolicyHelper session set to NULL
   [junit4]   2> 1408059 INFO  (qtp444998032-24470) [n:127.0.0.1:33911_solr    ] o.a.s.h.a.CollectionsHandler Wait for new collection to be active for at most 30 seconds. Check all shard replicas
   [junit4]   2> 1408156 INFO  (zkCallback-8713-thread-1) [    ] o.a.s.c.c.ZkStateReader A cluster state change: [WatchedEvent state:SyncConnected type:NodeDataChanged path:/collections/testMoveReplicaWithCollection_abc/state.json] for collection [testMoveReplicaWithCollection_abc] has occurred - updating... (live nodes size: [2])
   [junit4]   2> 1408418 INFO  (OverseerCollectionConfigSetProcessor-72119430086328324-127.0.0.1:33911_solr-n_0000000000) [    ] o.a.s.c.OverseerTaskQueue Response ZK path: /overseer/collection-queue-work/qnr-0000000000 doesn't exist.  Requestor may have disconnected from ZooKeeper
   [junit4]   2> 1409059 INFO  (qtp444998032-24470) [n:127.0.0.1:33911_solr    ] o.a.s.s.HttpSolrCall [admin] webapp=null path=/admin/collections params={pullReplicas=0&name=testMoveReplicaWithCollection_abc&nrtReplicas=1&action=CREATE&numShards=1&tlogReplicas=0&createNodeSet=127.0.0.1:33911_solr&wt=javabin&version=2} status=0 QTime=2642
   [junit4]   2> 1409059 INFO  (qtp444998032-24468) [n:127.0.0.1:33911_solr    ] o.a.s.h.a.CollectionsHandler Invoked Collection Action :create with params pullReplicas=0&withCollection=testMoveReplicaWithCollection_abc&name=testMoveReplicaWithCollection_xyz&nrtReplicas=1&action=CREATE&numShards=1&tlogReplicas=0&wt=javabin&version=2 and sendToOCPQueue=true
   [junit4]   2> 1409060 INFO  (OverseerThreadFactory-6588-thread-2) [    ] o.a.s.c.a.c.CreateCollectionCmd Create collection testMoveReplicaWithCollection_xyz
   [junit4]   2> 1409061 INFO  (OverseerThreadFactory-6588-thread-2) [    ] o.a.s.c.c.ZkConfigManager Copying zk node /configs/_default/protwords.txt to /configs/testMoveReplicaWithCollection_xyz.AUTOCREATED/protwords.txt
   [junit4]   2> 1409062 INFO  (OverseerThreadFactory-6588-thread-2) [    ] o.a.s.c.c.ZkConfigManager Copying zk node /configs/_default/managed-schema to /configs/testMoveReplicaWithCollection_xyz.AUTOCREATED/managed-schema
   [junit4]   2> 1409063 INFO  (OverseerThreadFactory-6588-thread-2) [    ] o.a.s.c.c.ZkConfigManager Copying zk node /configs/_default/solrconfig.xml to /configs/testMoveReplicaWithCollection_xyz.AUTOCREATED/solrconfig.xml
   [junit4]   2> 1409063 INFO  (OverseerThreadFactory-6588-thread-2) [    ] o.a.s.c.c.ZkConfigManager Copying zk node /configs/_default/synonyms.txt to /configs/testMoveReplicaWithCollection_xyz.AUTOCREATED/synonyms.txt
   [junit4]   2> 1409064 INFO  (OverseerThreadFactory-6588-thread-2) [    ] o.a.s.c.c.ZkConfigManager Copying zk node /configs/_default/stopwords.txt to /configs/testMoveReplicaWithCollection_xyz.AUTOCREATED/stopwords.txt
   [junit4]   2> 1409064 INFO  (OverseerThreadFactory-6588-thread-2) [    ] o.a.s.c.c.ZkConfigManager Copying zk node /configs/_default/lang/contractions_it.txt to /configs/testMoveReplicaWithCollection_xyz.AUTOCREATED/lang/contractions_it.txt
   [junit4]   2> 1409065 INFO  (OverseerThreadFactory-6588-thread-2) [    ] o.a.s.c.c.ZkConfigManager Copying zk node /configs/_default/lang/stemdict_nl.txt to /configs/testMoveReplicaWithCollection_xyz.AUTOCREATED/lang/stemdict_nl.txt
   [junit4]   2> 1409065 INFO  (OverseerThreadFactory-6588-thread-2) [    ] o.a.s.c.c.ZkConfigManager Copying zk node /configs/_default/lang/stopwords_hy.txt to /configs/testMoveReplicaWithCollection_xyz.AUTOCREATED/lang/stopwords_hy.txt
   [junit4]   2> 1409066 INFO  (OverseerThreadFactory-6588-thread-2) [    ] o.a.s.c.c.ZkConfigManager Copying zk node /configs/_default/lang/stopwords_no.txt to /configs/testMoveReplicaWithCollection_xyz.AUTOCREATED/lang/stopwords_no.txt
   [junit4]   2> 1409066 INFO  (OverseerThreadFactory-6588-thread-2) [    ] o.a.s.c.c.ZkConfigManager Copying zk node /configs/_default/lang/contractions_ca.txt to /configs/testMoveReplicaWithCollection_xyz.AUTOCREATED/lang/contractions_ca.txt
   [junit4]   2> 1409067 INFO  (OverseerThreadFactory-6588-thread-2) [    ] o.a.s.c.c.ZkConfigManager Copying zk node /configs/_default/lang/stopwords_id.txt to /configs/testMoveReplicaWithCollection_xyz.AUTOCREATED/lang/stopwords_id.txt
   [junit4]   2> 1409067 INFO  (OverseerThreadFactory-6588-thread-2) [    ] o.a.s.c.c.ZkConfigManager Copying zk node /configs/_default/lang/stopwords_ga.txt to /configs/testMoveReplicaWithCollection_xyz.AUTOCREATED/lang/stopwords_ga.txt
   [junit4]   2> 1409068 INFO  (OverseerThreadFactory-6588-thread-2) [    ] o.a.s.c.c.ZkConfigManager Copying zk node /configs/_default/lang/stopwords_hi.txt to /configs/testMoveReplicaWithCollection_xyz.AUTOCREATED/lang/stopwords_hi.txt
   [junit4]   2> 1409068 INFO  (OverseerThreadFactory-6588-thread-2) [    ] o.a.s.c.c.ZkConfigManager Copying zk node /configs/_default/lang/stopwords_da.txt to /configs/testMoveReplicaWithCollection_xyz.AUTOCREATED/lang/stopwords_da.txt
   [junit4]   2> 1409069 INFO  (OverseerThreadFactory-6588-thread-2) [    ] o.a.s.c.c.ZkConfigManager Copying zk node /configs/_default/lang/stopwords_ja.txt to /configs/testMoveReplicaWithCollection_xyz.AUTOCREATED/lang/stopwords_ja.txt
   [junit4]   2> 1409069 INFO  (OverseerThreadFactory-6588-thread-2) [    ] o.a.s.c.c.ZkConfigManager Copying zk node /configs/_default/lang/stopwords_pt.txt to /configs/testMoveReplicaWithCollection_xyz.AUTOCREATED/lang/stopwords_pt.txt
   [junit4]   2> 1409070 INFO  (OverseerThreadFactory-6588-thread-2) [    ] o.a.s.c.c.ZkConfigManager Copying zk node /configs/_default/lang/stopwords_hu.txt to /configs/testMoveReplicaWithCollection_xyz.AUTOCREATED/lang/stopwords_hu.txt
   [junit4]   2> 1409071 INFO  (OverseerThreadFactory-6588-thread-2) [    ] o.a.s.c.c.ZkConfigManager Copying zk node /configs/_default/lang/stopwords_el.txt to /configs/testMoveReplicaWithCollection_xyz.AUTOCREATED/lang/stopwords_el.txt
   [junit4]   2> 1409071 INFO  (OverseerThreadFactory-6588-thread-2) [    ] o.a.s.c.c.ZkConfigManager Copying zk node /configs/_default/lang/stopwords_ru.txt to /configs/testMoveReplicaWithCollection_xyz.AUTOCREATED/lang/stopwords_ru.txt
   [junit4]   2> 1409072 INFO  (OverseerThreadFactory-6588-thread-2) [    ] o.a.s.c.c.ZkConfigManager Copying zk node /configs/_default/lang/stopwords_tr.txt to /configs/testMoveReplicaWithCollection_xyz.AUTOCREATED/lang/stopwords_tr.txt
   [junit4]   2> 1409072 INFO  (OverseerThreadFactory-6588-thread-2) [    ] o.a.s.c.c.ZkConfigManager Copying zk node /configs/_default/lang/stopwords_ar.txt to /configs/testMoveReplicaWithCollection_xyz.AUTOCREATED/lang/stopwords_ar.txt
   [junit4]   2> 1409073 INFO  (OverseerThreadFactory-6588-thread-2) [    ] o.a.s.c.c.ZkConfigManager Copying zk node /configs/_default/lang/userdict_ja.txt to /configs/testMoveReplicaWithCollection_xyz.AUTOCREATED/lang/userdict_ja.txt
   [junit4]   2> 1409073 INFO  (OverseerThreadFactory-6588-thread-2) [    ] o.a.s.c.c.ZkConfigManager Copying zk node /configs/_default/lang/stopwords_eu.txt to /configs/testMoveReplicaWithCollection_xyz.AUTOCREATED/lang/stopwords_eu.txt
   [junit4]   2> 1409074 INFO  (OverseerThreadFactory-6588-thread-2) [    ] o.a.s.c.c.ZkConfigManager Copying zk node /configs/_default/lang/stopwords_it.txt to /configs/testMoveReplicaWithCollection_xyz.AUTOCREATED/lang/stopwords_it.txt
   [junit4]   2> 1409075 INFO  (OverseerThreadFactory-6588-thread-2) [    ] o.a.s.c.c.ZkConfigManager Copying zk node /configs/_default/lang/stopwords_cz.txt to /configs/testMoveReplicaWithCollection_xyz.AUTOCREATED/lang/stopwords_cz.txt
   [junit4]   2> 1409075 INFO  (OverseerThreadFactory-6588-thread-2) [    ] o.a.s.c.c.ZkConfigManager Copying zk node /configs/_default/lang/stoptags_ja.txt to /configs/testMoveReplicaWithCollection_xyz.AUTOCREATED/lang/stoptags_ja.txt
   [junit4]   2> 1409076 INFO  (OverseerThreadFactory-6588-thread-2) [    ] o.a.s.c.c.ZkConfigManager Copying zk node /configs/_default/lang/contractions_fr.txt to /configs/testMoveReplicaWithCollection_xyz.AUTOCREATED/lang/contractions_fr.txt
   [junit4]   2> 1409076 INFO  (OverseerThreadFactory-6588-thread-2) [    ] o.a.s.c.c.ZkConfigManager Copying zk node /configs/_default/lang/stopwords_de.txt to /configs/testMoveReplicaWithCollection_xyz.AUTOCREATED/lang/stopwords_de.txt
   [junit4]   2> 1409077 INFO  (OverseerThreadFactory-6588-thread-2) [    ] o.a.s.c.c.ZkConfigManager Copying zk node /configs/_default/lang/stopwords_fa.txt to /configs/testMoveReplicaWithCollection_xyz.AUTOCREATED/lang/stopwords_fa.txt
   [junit4]   2> 1409078 INFO  (OverseerThreadFactory-6588-thread-2) [    ] o.a.s.c.c.ZkConfigManager Copying zk node /configs/_default/lang/contractions_ga.txt to /configs/testMoveReplicaWithCollection_xyz.AUTOCREATED/lang/contractions_ga.txt
   [junit4]   2> 1409078 INFO  (OverseerThreadFactory-6588-thread-2) [    ] o.a.s.c.c.ZkConfigManager Copying zk node /configs/_default/lang/stopwords_ca.txt to /configs/testMoveReplicaWithCollection_xyz.AUTOCREATED/lang/stopwords_ca.txt
   [junit4]   2> 1409079 INFO  (OverseerThreadFactory-6588-thread-2) [    ] o.a.s.c.c.ZkConfigManager Copying zk node /configs/_default/lang/stopwords_nl.txt to /configs/testMoveReplicaWithCollection_xyz.AUTOCREATED/lang/stopwords_nl.txt
   [junit4]   2> 1409079 INFO  (OverseerThreadFactory-6588-thread-2) [    ] o.a.s.c.c.ZkConfigManager Copying zk node /configs/_default/lang/stopwords_bg.txt to /configs/testMoveReplicaWithCollection_xyz.AUTOCREATED/lang/stopwords_bg.txt
   [junit4]   2> 1409080 INFO  (OverseerThreadFactory-6588-thread-2) [    ] o.a.s.c.c.ZkConfigManager Copying zk node /configs/_default/lang/stopwords_lv.txt to /configs/testMoveReplicaWithCollection_xyz.AUTOCREATED/lang/stopwords_lv.txt
   [junit4]   2> 1409080 INFO  (OverseerThreadFactory-6588-thread-2) [    ] o.a.s.c.c.ZkConfigManager Copying zk node /configs/_default/lang/stopwords_en.txt to /configs/testMoveReplicaWithCollection_xyz.AUTOCREATED/lang/stopwords_en.txt
   [junit4]   2> 1409081 INFO  (OverseerThreadFactory-6588-thread-2) [    ] o.a.s.c.c.ZkConfigManager Copying zk node /configs/_default/lang/stopwords_es.txt to /configs/testMoveReplicaWithCollection_xyz.AUTOCREATED/lang/stopwords_es.txt
   [junit4]   2> 1409081 INFO  (OverseerThreadFactory-6588-thread-2) [    ] o.a.s.c.c.ZkConfigManager Copying zk node /configs/_default/lang/stopwords_th.txt to /configs/testMoveReplicaWithCollection_xyz.AUTOCREATED/lang/stopwords_th.txt
   [junit4]   2> 1409082 INFO  (OverseerThreadFactory-6588-thread-2) [    ] o.a.s.c.c.ZkConfigManager Copying zk node /configs/_default/lang/stopwords_ro.txt to /configs/testMoveReplicaWithCollection_xyz.AUTOCREATED/lang/stopwords_ro.txt
   [junit4]   2> 1409083 INFO  (OverseerThreadFactory-6588-thread-2) [    ] o.a.s.c.c.ZkConfigManager Copying zk node /configs/_default/lang/stopwords_fr.txt to /configs/testMoveReplicaWithCollection_xyz.AUTOCREATED/lang/stopwords_fr.txt
   [junit4]   2> 1409083 INFO  (OverseerThreadFactory-6588-thread-2) [    ] o.a.s.c.c.ZkConfigManager Copying zk node /configs/_default/lang/stopwords_sv.txt to /configs/testMoveReplicaWithCollection_xyz.AUTOCREATED/lang/stopwords_sv.txt
   [junit4]   2> 1409084 INFO  (OverseerThreadFactory-6588-thread-2) [    ] o.a.s.c.c.ZkConfigManager Copying zk node /configs/_default/lang/stopwords_fi.txt to /configs/testMoveReplicaWithCollection_xyz.AUTOCREATED/lang/stopwords_fi.txt
   [junit4]   2> 1409084 INFO  (OverseerThreadFactory-6588-thread-2) [    ] o.a.s.c.c.ZkConfigManager Copying zk node /configs/_default/lang/hyphenations_ga.txt to /configs/testMoveReplicaWithCollection_xyz.AUTOCREATED/lang/hyphenations_ga.txt
   [junit4]   2> 1409085 INFO  (OverseerThreadFactory-6588-thread-2) [    ] o.a.s.c.c.ZkConfigManager Copying zk node /configs/_default/lang/stopwords_gl.txt to /configs/testMoveReplicaWithCollection_xyz.AUTOCREATED/lang/stopwords_gl.txt
   [junit4]   2> 1409085 INFO  (OverseerThreadFactory-6588-thread-2) [    ] o.a.s.c.c.ZkConfigManager Copying zk node /configs/_default/params.json to /configs/testMoveReplicaWithCollection_xyz.AUTOCREATED/params.json
   [junit4]   2> 1409289 DEBUG (OverseerThreadFactory-6588-thread-2) [    ] o.a.s.c.s.c.a.PolicyHelper Creating a new session
   [junit4]   2> 1409291 INFO  (qtp444998032-24472) [n:127.0.0.1:33911_solr    ] o.a.s.s.HttpSolrCall [admin] webapp=null path=/admin/metrics params={wt=javabin&version=2&key=solr.core.testMoveReplicaWithCollection_abc.shard1.replica_n1:INDEX.sizeInBytes} status=0 QTime=0
   [junit4]   2> 1409291 INFO  (qtp444998032-24460) [n:127.0.0.1:33911_solr    ] o.a.s.s.HttpSolrCall [admin] webapp=null path=/admin/metrics params={prefix=CONTAINER.fs.usableSpace,CONTAINER.fs.totalSpace,CORE.coreName&wt=javabin&version=2&group=solr.node,solr.core} status=0 QTime=0
   [junit4]   2> 1409292 INFO  (qtp1707284511-24469) [n:127.0.0.1:41503_solr    ] o.a.s.s.HttpSolrCall [admin] webapp=null path=/admin/metrics params={prefix=CONTAINER.fs.usableSpace,CONTAINER.fs.totalSpace,CORE.coreName&wt=javabin&version=2&group=solr.node,solr.core} status=0 QTime=0
   [junit4]   2> 1409293 DEBUG (OverseerThreadFactory-6588-thread-2) [    ] o.a.s.c.s.c.a.PolicyHelper New session created 
   [junit4]   2> 1409294 INFO  (OverseerThreadFactory-6588-thread-2) [    ] o.a.s.c.s.c.a.PolicyHelper returnSession, curr-time 943546378 sessionWrapper.createTime 943546376651151, this.sessionWrapper.createTime 943546376651151 
   [junit4]   2> 1409296 INFO  (OverseerStateUpdate-72119430086328324-127.0.0.1:33911_solr-n_0000000000) [    ] o.a.s.c.o.SliceMutator createReplica() {
   [junit4]   2>   "operation":"ADDREPLICA",
   [junit4]   2>   "collection":"testMoveReplicaWithCollection_xyz",
   [junit4]   2>   "shard":"shard1",
   [junit4]   2>   "core":"testMoveReplicaWithCollection_xyz_shard1_replica_n1",
   [junit4]   2>   "state":"down",
   [junit4]   2>   "base_url":"https://127.0.0.1:33911/solr",
   [junit4]   2>   "type":"NRT",
   [junit4]   2>   "waitForFinalState":"false"} 
   [junit4]   2> 1409498 INFO  (qtp444998032-24537) [n:127.0.0.1:33911_solr    x:testMoveReplicaWithCollection_xyz_shard1_replica_n1] o.a.s.h.a.CoreAdminOperation core create command qt=/admin/cores&coreNodeName=core_node2&collection.configName=testMoveReplicaWithCollection_xyz.AUTOCREATED&newCollection=true&name=testMoveReplicaWithCollection_xyz_shard1_replica_n1&action=CREATE&numShards=1&collection=testMoveReplicaWithCollection_xyz&shard=shard1&wt=javabin&version=2&replicaType=NRT
   [junit4]   2> 1410506 INFO  (qtp444998032-24537) [n:127.0.0.1:33911_solr c:testMoveReplicaWithCollection_xyz s:shard1 r:core_node2 x:testMoveReplicaWithCollection_xyz_shard1_replica_n1] o.a.s.c.RequestParams conf resource params.json loaded . version : 0 
   [junit4]   2> 1410506 INFO  (qtp444998032-24537) [n:127.0.0.1:33911_solr c:testMoveReplicaWithCollection_xyz s:shard1 r:core_node2 x:testMoveReplicaWithCollection_xyz_shard1_replica_n1] o.a.s.c.RequestParams request params refreshed to version 0
   [junit4]   2> 1410507 WARN  (qtp444998032-24537) [n:127.0.0.1:33911_solr c:testMoveReplicaWithCollection_xyz s:shard1 r:core_node2 x:testMoveReplicaWithCollection_xyz_shard1_replica_n1] o.a.s.c.SolrConfig Couldn't add files from /home/jenkins/workspace/Lucene-Solr-master-Linux/solr/build/solr-core/test/J1/temp/solr.cloud.TestWithCollection_EF87C5A37A165324-001/tempDir-001/node1/testMoveReplicaWithCollection_xyz_shard1_replica_n1/../../../../contrib/extraction/lib filtered by .*\.jar to classpath: /home/jenkins/workspace/Lucene-Solr-master-Linux/solr/build/solr-core/test/J1/temp/solr.cloud.TestWithCollection_EF87C5A37A165324-001/tempDir-001/node1/testMoveReplicaWithCollection_xyz_shard1_replica_n1/../../../../contrib/extraction/lib
   [junit4]   2> 1410507 WARN  (qtp444998032-24537) [n:127.0.0.1:33911_solr c:testMoveReplicaWithCollection_xyz s:shard1 r:core_node2 x:testMoveReplicaWithCollection_xyz_shard1_replica_n1] o.a.s.c.SolrConfig Couldn't add files from /home/jenkins/workspace/Lucene-Solr-master-Linux/solr/build/solr-core/test/J1/temp/solr.cloud.TestWithCollection_EF87C5A37A165324-001/tempDir-001/node1/testMoveReplicaWithCollection_xyz_shard1_replica_n1/../../../../dist filtered by solr-cell-\d.*\.jar to classpath: /home/jenkins/workspace/Lucene-Solr-master-Linux/solr/build/solr-core/test/J1/temp/solr.cloud.TestWithCollection_EF87C5A37A165324-001/tempDir-001/node1/testMoveReplicaWithCollection_xyz_shard1_replica_n1/../../../../dist
   [junit4]   2> 1410507 WARN  (qtp444998032-24537) [n:127.0.0.1:33911_solr c:testMoveReplicaWithCollection_xyz s:shard1 r:core_node2 x:testMoveReplicaWithCollection_xyz_shard1_replica_n1] o.a.s.c.SolrConfig Couldn't add files from /home/jenkins/workspace/Lucene-Solr-master-Linux/solr/build/solr-core/test/J1/temp/solr.cloud.TestWithCollection_EF87C5A37A165324-001/tempDir-001/node1/testMoveReplicaWithCollection_xyz_shard1_replica_n1/../../../../contrib/clustering/lib filtered by .*\.jar to classpath: /home/jenkins/workspace/Lucene-Solr-master-Linux/solr/build/solr-core/test/J1/temp/solr.cloud.TestWithCollection_EF87C5A37A165324-001/tempDir-001/node1/testMoveReplicaWithCollection_xyz_shard1_replica_n1/../../../../contrib/clustering/lib
   [junit4]   2> 1410507 WARN  (qtp444998032-24537) [n:127.0.0.1:33911_solr c:testMoveReplicaWithCollection_xyz s:shard1 r:core_node2 x:testMoveReplicaWithCollection_xyz_shard1_replica_n1] o.a.s.c.SolrConfig Couldn't add files from /home/jenkins/workspace/Lucene-Solr-master-Linux/solr/build/solr-core/test/J1/temp/solr.cloud.TestWithCollection_EF87C5A37A165324-001/tempDir-001/node1/testMoveReplicaWithCollection_xyz_shard1_replica_n1/../../../../dist filtered by solr-clustering-\d.*\.jar to classpath: /home/jenkins/workspace/Lucene-Solr-master-Linux/solr/build/solr-core/test/J1/temp/solr.cloud.TestWithCollection_EF87C5A37A165324-001/tempDir-001/node1/testMoveReplicaWithCollection_xyz_shard1_replica_n1/../../../../dist
   [junit4]   2> 1410507 WARN  (qtp444998032-24537) [n:127.0.0.1:33911_solr c:testMoveReplicaWithCollection_xyz s:shard1 r:core_node2 x:testMoveReplicaWithCollection_xyz_shard1_replica_n1] o.a.s.c.SolrConfig Couldn't add files from /home/jenkins/workspace/Lucene-Solr-master-Linux/solr/build/solr-core/test/J1/temp/solr.cloud.TestWithCollection_EF87C5A37A165324-001/tempDir-001/node1/testMoveReplicaWithCollection_xyz_shard1_replica_n1/../../../../contrib/langid/lib filtered by .*\.jar to classpath: /home/jenkins/workspace/Lucene-Solr-master-Linux/solr/build/solr-core/test/J1/temp/solr.cloud.TestWithCollection_EF87C5A37A165324-001/tempDir-001/node1/testMoveReplicaWithCollection_xyz_shard1_replica_n1/../../../../contrib/langid/lib
   [junit4]   2> 1410507 WARN  (qtp444998032-24537) [n:127.0.0.1:33911_solr c:testMoveReplicaWithCollection_xyz s:shard1 r:core_node2 x:testMoveReplicaWithCollection_xyz_shard1_replica_n1] o.a.s.c.SolrConfig Couldn't add files from /home/jenkins/workspace/Lucene-Solr-master-Linux/solr/build/solr-core/test/J1/temp/solr.cloud.TestWithCollection_EF87C5A37A165324-001/tempDir-001/node1/testMoveReplicaWithCollection_xyz_shard1_replica_n1/../../../../dist filtered by solr-langid-\d.*\.jar to classpath: /home/jenkins/workspace/Lucene-Solr-master-Linux/solr/build/solr-core/test/J1/temp/solr.cloud.TestWithCollection_EF87C5A37A165324-001/tempDir-001/node1/testMoveReplicaWithCollection_xyz_shard1_replica_n1/../../../../dist
   [junit4]   2> 1410507 WARN  (qtp444998032-24537) [n:127.0.0.1:33911_solr c:testMoveReplicaWithCollection_xyz s:shard1 r:core_node2 x:testMoveReplicaWithCollection_xyz_shard1_replica_n1] o.a.s.c.SolrConfig Couldn't add files from /home/jenkins/workspace/Lucene-Solr-master-Linux/solr/build/solr-core/test/J1/temp/solr.cloud.TestWithCollection_EF87C5A37A165324-001/tempDir-001/node1/testMoveReplicaWithCollection_xyz_shard1_replica_n1/../../../../contrib/velocity/lib filtered by .*\.jar to classpath: /home/jenkins/workspace/Lucene-Solr-master-Linux/solr/build/solr-core/test/J1/temp/solr.cloud.TestWithCollection_EF87C5A37A165324-001/tempDir-001/node1/testMoveReplicaWithCollection_xyz_shard1_replica_n1/../../../../contrib/velocity/lib
   [junit4]   2> 1410507 WARN  (qtp444998032-24537) [n:127.0.0.1:33911_solr c:testMoveReplicaWithCollection_xyz s:shard1 r:core_node2 x:testMoveReplicaWithCollection_xyz_shard1_replica_n1] o.a.s.c.SolrConfig Couldn't add files from /home/jenkins/workspace/Lucene-Solr-master-Linux/solr/build/solr-core/test/J1/temp/solr.cloud.TestWithCollection_EF87C5A37A165324-001/tempDir-001/node1/testMoveReplicaWithCollection_xyz_shard1_replica_n1/../../../../dist filtered by solr-velocity-\d.*\.jar to classpath: /home/jenkins/workspace/Lucene-Solr-master-Linux/solr/build/solr-core/test/J1/temp/solr.cloud.TestWithCollection_EF87C5A37A165324-001/tempDir-001/node1/testMoveReplicaWithCollection_xyz_shard1_replica_n1/../../../../dist
   [junit4]   2> 1410507 WARN  (qtp444998032-24537) [n:127.0.0.1:33911_solr c:testMoveReplicaWithCollection_xyz s:shard1 r:core_node2 x:testMoveReplicaWithCollection_xyz_shard1_replica_n1] o.a.s.c.SolrConfig Couldn't add files from /home/jenkins/workspace/Lucene-Solr-master-Linux/solr/build/solr-core/test/J1/temp/solr.cloud.TestWithCollection_EF87C5A37A165324-001/tempDir-001/node1/testMoveReplicaWithCollection_xyz_shard1_replica_n1/../../../../dist filtered by solr-ltr-\d.*\.jar to classpath: /home/jenkins/workspace/Lucene-Solr-master-Linux/solr/build/solr-core/test/J1/temp/solr.cloud.TestWithCollection_EF87C5A37A165324-001/tempDir-001/node1/testMoveReplicaWithCollection_xyz_shard1_replica_n1/../../../../dist
   [junit4]   2> 1410511 INFO  (qtp444998032-24537) [n:127.0.0.1:33911_solr c:testMoveReplicaWithCollection_xyz s:shard1 r:core_node2 x:testMoveReplicaWithCollection_xyz_shard1_replica_n1] o.a.s.c.SolrConfig Using Lucene MatchVersion: 8.0.0
   [junit4]   2> 1410523 INFO  (qtp444998032-24537) [n:127.0.0.1:33911_solr c:testMoveReplicaWithCollection_xyz s:shard1 r:core_node2 x:testMoveReplicaWithCollection_xyz_shard1_replica_n1] o.a.s.s.IndexSchema [testMoveReplicaWithCollection_xyz_shard1_replica_n1] Schema name=default-config
   [junit4]   2> 1410598 INFO  (qtp444998032-24537) [n:127.0.0.1:33911_solr c:testMoveReplicaWithCollection_xyz s:shard1 r:core_node2 x:testMoveReplicaWithCollection_xyz_shard1_replica_n1] o.a.s.s.IndexSchema Loaded schema default-config/1.6 with uniqueid field id
   [junit4]   2> 1410610 INFO  (qtp444998032-24537) [n:127.0.0.1:33911_solr c:testMoveReplicaWithCollection_xyz s:shard1 r:core_node2 x:testMoveReplicaWithCollection_xyz_shard1_replica_n1] o.a.s.c.CoreContainer Creating SolrCore 'testMoveReplicaWithCollection_xyz_shard1_replica_n1' using configuration from collection testMoveReplicaWithCollection_xyz, trusted=true
   [junit4]   2> 1410610 INFO  (qtp444998032-24537) [n:127.0.0.1:33911_solr c:testMoveReplicaWithCollection_xyz s:shard1 r:core_node2 x:testMoveReplicaWithCollection_xyz_shard1_replica_n1] o.a.s.m.r.SolrJmxReporter JMX monitoring for 'solr_33911.solr.core.testMoveReplicaWithCollection_xyz.shard1.replica_n1' (registry 'solr.core.testMoveReplicaWithCollection_xyz.shard1.replica_n1') enabled at server: com.sun.jmx.mbeanserver.JmxMBeanServer@603c9810
   [junit4]   2> 1410611 INFO  (qtp444998032-24537) [n:127.0.0.1:33911_solr c:testMoveReplicaWithCollection_xyz s:shard1 r:core_node2 x:testMoveReplicaWithCollection_xyz_shard1_replica_n1] o.a.s.c.SolrCore solr.RecoveryStrategy.Builder
   [junit4]   2> 1410611 INFO  (qtp444998032-24537) [n:127.0.0.1:33911_solr c:testMoveReplicaWithCollection_xyz s:shard1 r:core_node2 x:testMoveReplicaWithCollection_xyz_shard1_replica_n1] o.a.s.c.SolrCore [[testMoveReplicaWithCollection_xyz_shard1_replica_n1] ] Opening new SolrCore at [/home/jenkins/workspace/Lucene-Solr-master-Linux/solr/build/solr-core/test/J1/temp/solr.cloud.TestWithCollection_EF87C5A37A165324-001/tempDir-001/node1/testMoveReplicaWithCollection_xyz_shard1_replica_n1], dataDir=[/home/jenkins/workspace/Lucene-Solr-master-Linux/solr/build/solr-core/test/J1/temp/solr.cloud.TestWithCollection_EF87C5A37A165324-001/tempDir-001/node1/./testMoveReplicaWithCollection_xyz_shard1_replica_n1/data/]
   [junit4]   2> 1410613 INFO  (qtp444998032-24537) [n:127.0.0.1:33911_solr c:testMoveReplicaWithCollection_xyz s:shard1 r:core_node2 x:testMoveReplicaWithCollection_xyz_shard1_replica_n1] o.a.s.r.XSLTResponseWriter xsltCacheLifetimeSeconds=5
   [junit4]   2> 1410645 INFO  (qtp444998032-24537) [n:127.0.0.1:33911_solr c:testMoveReplicaWithCollection_xyz s:shard1 r:core_node2 x:testMoveReplicaWithCollection_xyz_shard1_replica_n1] o.a.s.u.UpdateHandler Using UpdateLog implementation: org.apache.solr.update.UpdateLog
   [junit4]   2> 1410645 INFO  (qtp444998032-24537) [n:127.0.0.1:33911_solr c:testMoveReplicaWithCollection_xyz s:shard1 r:core_node2 x:testMoveReplicaWithCollection_xyz_shard1_replica_n1] o.a.s.u.UpdateLog Initializing UpdateLog: dataDir= defaultSyncLevel=FLUSH numRecordsToKeep=100 maxNumLogsToKeep=10 numVersionBuckets=65536
   [junit4]   2> 1410679 INFO  (qtp444998032-24537) [n:127.0.0.1:33911_solr c:testMoveReplicaWithCollection_xyz s:shard1 r:core_node2 x:testMoveReplicaWithCollection_xyz_shard1_replica_n1] o.a.s.u.CommitTracker Hard AutoCommit: if uncommited for 15000ms; 
   [junit4]   2> 1410679 INFO  (qtp444998032-24537) [n:127.0.0.1:33911_solr c:testMoveReplicaWithCollection_xyz s:shard1 r:core_node2 x:testMoveReplicaWithCollection_xyz_shard1_replica_n1] o.a.s.u.CommitTracker Soft AutoCommit: disabled
   [junit4]   2> 1410680 INFO  (qtp444998032-24537) [n:127.0.0.1:33911_solr c:testMoveReplicaWithCollection_xyz s:shard1 r:core_node2 x:testMoveReplicaWithCollection_xyz_shard1_replica_n1] o.a.s.s.SolrIndexSearcher Opening [Searcher@5b578073[testMoveReplicaWithCollection_xyz_shard1_replica_n1] main]
   [junit4]   2> 1410681 INFO  (qtp444998032-24537) [n:127.0.0.1:33911_solr c:testMoveReplicaWithCollection_xyz s:shard1 r:core_node2 x:testMoveReplicaWithCollection_xyz_shard1_replica_n1] o.a.s.r.ManagedResourceStorage Configured ZooKeeperStorageIO with znodeBase: /configs/testMoveReplicaWithCollection_xyz.AUTOCREATED
   [junit4]   2> 1410681 INFO  (qtp444998032-24537) [n:127.0.0.1:33911_solr c:testMoveReplicaWithCollection_xyz s:shard1 r:core_node2 x:testMoveReplicaWithCollection_xyz_shard1_replica_n1] o.a.s.r.ManagedResourceStorage Loaded null at path _rest_managed.json using ZooKeeperStorageIO:path=/configs/testMoveReplicaWithCollection_xyz.AUTOCREATED
   [junit4]   2> 1410681 INFO  (qtp444998032-24537) [n:127.0.0.1:33911_solr c:testMoveReplicaWithCollection_xyz s:shard1 r:core_node2 x:testMoveReplicaWithCollection_xyz_shard1_replica_n1] o.a.s.s.ZkIndexSchemaReader Creating ZooKeeper watch for the managed schema at /configs/testMoveReplicaWithCollection_xyz.AUTOCREATED/managed-schema
   [junit4]   2> 1410681 INFO  (qtp444998032-24537) [n:127.0.0.1:33911_solr c:testMoveReplicaWithCollection_xyz s:shard1 r:core_node2 x:testMoveReplicaWithCollection_xyz_shard1_replica_n1] o.a.s.s.ZkIndexSchemaReader Current schema version 0 is already the latest
   [junit4]   2> 1410682 INFO  (qtp444998032-24537) [n:127.0.0.1:33911_solr c:testMoveReplicaWithCollection_xyz s:shard1 r:core_node2 x:testMoveReplicaWithCollection_xyz_shard1_replica_n1] o.a.s.h.c.SpellCheckComponent Initializing spell checkers
   [junit4]   2> 1410682 INFO  (qtp444998032-24537) [n:127.0.0.1:33911_solr c:testMoveReplicaWithCollection_xyz s:shard1 r:core_node2 x:testMoveReplicaWithCollection_xyz_shard1_replica_n1] o.a.s.s.DirectSolrSpellChecker init: {name=default,field=_text_,classname=solr.DirectSolrSpellChecker,distanceMeasure=internal,accuracy=0.5,maxEdits=2,minPrefix=1,maxInspections=5,minQueryLength=4,maxQueryFrequency=0.01}
   [junit4]   2> 1410683 INFO  (qtp444998032-24537) [n:127.0.0.1:33911_solr c:testMoveReplicaWithCollection_xyz s:shard1 r:core_node2 x:testMoveReplicaWithCollection_xyz_shard1_replica_n1] o.a.s.h.ReplicationHandler Commits will be reserved for 10000ms.
   [junit4]   2> 1410683 INFO  (qtp444998032-24537) [n:127.0.0.1:33911_solr c:testMoveReplicaWithCollection_xyz s:shard1 r:core_node2 x:testMoveReplicaWithCollection_xyz_shard1_replica_n1] o.a.s.u.UpdateLog Could not find max version in index or recent updates, using new clock 1608139420885581824
   [junit4]   2> 1410683 INFO  (searcherExecutor-6605-thread-1-processing-n:127.0.0.1:33911_solr x:testMoveReplicaWithCollection_xyz_shard1_replica_n1 c:testMoveReplicaWithCollection_xyz s:shard1 r:core_node2) [n:127.0.0.1:33911_solr c:testMoveReplicaWithCollection_xyz s:shard1 r:core_node2 x:testMoveReplicaWithCollection_xyz_shard1_replica_n1] o.a.s.c.QuerySenderListener QuerySenderListener sending requests to Searcher@5b578073[testMoveReplicaWithCollection_xyz_s

[...truncated too long message...]

solr c:testMoveReplicaMainCollection_xyz s:shard1 r:core_node4 x:testMoveReplicaMainCollection_xyz_shard1_replica_n3] o.a.s.m.SolrMetricManager Closing metric reporters for registry=solr.collection.testMoveReplicaMainCollection_xyz.shard1.leader, tag=7e733388
   [junit4]   2> 199136 INFO  (jetty-closer-127-thread-1) [    ] o.e.j.s.h.ContextHandler Stopped o.e.j.s.ServletContextHandler@2598751c{/solr,null,UNAVAILABLE}
   [junit4]   2> 199136 INFO  (jetty-closer-127-thread-1) [    ] o.e.j.s.session node0 Stopped scavenging
   [junit4]   2> 199136 ERROR (SUITE-TestWithCollection-seed#[EF87C5A37A165324]-worker) [    ] o.a.z.s.ZooKeeperServer ZKShutdownHandler is not registered, so ZooKeeper server won't take any action on ERROR or SHUTDOWN server state changes
   [junit4]   2> 199137 INFO  (SUITE-TestWithCollection-seed#[EF87C5A37A165324]-worker) [    ] o.a.s.c.ZkTestServer connecting to 127.0.0.1:46757 46757
   [junit4]   2> 199242 INFO  (Thread-63) [    ] o.a.s.c.ZkTestServer connecting to 127.0.0.1:46757 46757
   [junit4]   2> 199243 WARN  (Thread-63) [    ] o.a.s.c.ZkTestServer Watch limit violations: 
   [junit4]   2> Maximum concurrent create/delete watches above limit:
   [junit4]   2> 
   [junit4]   2> 	25	/solr/collections/testNodeAdded_xyz/terms/shard1
   [junit4]   2> 	25	/solr/collections/testNodeAdded_abc/terms/shard1
   [junit4]   2> 	20	/solr/aliases.json
   [junit4]   2> 	12	/solr/collections/testMultipleWithCollections_abc/terms/shard1
   [junit4]   2> 	12	/solr/collections/testAddReplica_abc/terms/shard1
   [junit4]   2> 	12	/solr/collections/testDeleteWithCollection_abc/terms/shard1
   [junit4]   2> 	12	/solr/collections/testMultipleWithCollections_xyz/terms/shard1
   [junit4]   2> 	11	/solr/collections/testMultipleWithCollections_abc2/terms/shard1
   [junit4]   2> 	11	/solr/collections/testAddReplicaWithPolicy_abc/terms/shard1
   [junit4]   2> 	11	/solr/collections/testMoveReplicaMainCollection_xyz/terms/shard1
   [junit4]   2> 	10	/solr/collections/testMultipleWithCollections_xyz2/terms/shard1
   [junit4]   2> 	10	/solr/collections/testAddReplica_xyz/terms/shard1
   [junit4]   2> 	10	/solr/collections/testAddReplicaWithPolicy_xyz/terms/shard1
   [junit4]   2> 	9	/solr/collections/testMoveReplicaMainCollection_abc/terms/shard1
   [junit4]   2> 	5	/solr/security.json
   [junit4]   2> 	3	/solr/configs/testNodeAdded_xyz.AUTOCREATED
   [junit4]   2> 	3	/solr/collections/testCreateCollection_abc/terms/shard1
   [junit4]   2> 	3	/solr/configs/testNodeAdded_abc.AUTOCREATED/managed-schema
   [junit4]   2> 	3	/solr/collections/testCreateCollectionNoWithCollection_abc/terms/shard2
   [junit4]   2> 	3	/solr/collections/testMoveReplicaWithCollection_abc/terms/shard1
   [junit4]   2> 	3	/solr/collections/testCreateCollectionNoWithCollection_abc/terms/shard1
   [junit4]   2> 	3	/solr/configs/testNodeAdded_xyz.AUTOCREATED/managed-schema
   [junit4]   2> 	3	/solr/collections/testCreateCollection_xyz/terms/shard1
   [junit4]   2> 	3	/solr/configs/testNodeAdded_abc.AUTOCREATED
   [junit4]   2> 	3	/solr/collections/testMoveReplicaWithCollection_xyz/terms/shard1
   [junit4]   2> 	2	/solr/configs/testAddReplicaWithPolicy_xyz.AUTOCREATED
   [junit4]   2> 	2	/solr/collections/testNodeAdded_xyz/state.json
   [junit4]   2> 	2	/solr/configs/testAddReplica_abc.AUTOCREATED
   [junit4]   2> 	2	/solr/configs/testCreateCollectionNoWithCollection_abc.AUTOCREATED
   [junit4]   2> 	2	/solr/configs/testMultipleWithCollections_xyz2.AUTOCREATED
   [junit4]   2> 	2	/solr/configs/testMoveReplicaMainCollection_xyz.AUTOCREATED
   [junit4]   2> 	2	/solr/configs/testAddReplica_abc.AUTOCREATED/managed-schema
   [junit4]   2> 	2	/solr/configs/testMultipleWithCollections_abc2.AUTOCREATED/managed-schema
   [junit4]   2> 	2	/solr/configs/testAddReplicaWithPolicy_abc.AUTOCREATED/managed-schema
   [junit4]   2> 	2	/solr/configs/testAddReplicaWithPolicy_abc.AUTOCREATED
   [junit4]   2> 	2	/solr/collections/testNodeAdded_abc/state.json
   [junit4]   2> 	2	/solr/configs/testMultipleWithCollections_abc.AUTOCREATED/managed-schema
   [junit4]   2> 	2	/solr/configs/testMultipleWithCollections_abc2.AUTOCREATED
   [junit4]   2> 	2	/solr/configs/testMultipleWithCollections_xyz.AUTOCREATED/managed-schema
   [junit4]   2> 	2	/solr/configs/testMoveReplicaMainCollection_abc.AUTOCREATED
   [junit4]   2> 	2	/solr/configs/testDeleteWithCollection_abc.AUTOCREATED/managed-schema
   [junit4]   2> 	2	/solr/configs/testAddReplica_xyz.AUTOCREATED/managed-schema
   [junit4]   2> 	2	/solr/configs/testAddReplicaWithPolicy_xyz.AUTOCREATED/managed-schema
   [junit4]   2> 	2	/solr/configs/testAddReplica_xyz.AUTOCREATED
   [junit4]   2> 	2	/solr/collections/testDeleteWithCollection_xyz/terms/shard1
   [junit4]   2> 	2	/solr/configs/testDeleteWithCollection_abc.AUTOCREATED
   [junit4]   2> 	2	/solr/configs/testCreateCollectionNoWithCollection_abc.AUTOCREATED/managed-schema
   [junit4]   2> 	2	/solr/configs/testMoveReplicaMainCollection_abc.AUTOCREATED/managed-schema
   [junit4]   2> 	2	/solr/configs/testMultipleWithCollections_abc.AUTOCREATED
   [junit4]   2> 	2	/solr/configs/testMultipleWithCollections_xyz2.AUTOCREATED/managed-schema
   [junit4]   2> 	2	/solr/configs/testMultipleWithCollections_xyz.AUTOCREATED
   [junit4]   2> 	2	/solr/configs/testMoveReplicaMainCollection_xyz.AUTOCREATED/managed-schema
   [junit4]   2> 
   [junit4]   2> Maximum concurrent data watches above limit:
   [junit4]   2> 
   [junit4]   2> 	45	/solr/aliases.json
   [junit4]   2> 	20	/solr/clusterprops.json
   [junit4]   2> 	20	/solr/clusterstate.json
   [junit4]   2> 	13	/solr/collections/testNodeAdded_xyz/state.json
   [junit4]   2> 	13	/solr/collections/testNodeAdded_abc/state.json
   [junit4]   2> 	6	/solr/collections/testMultipleWithCollections_abc/state.json
   [junit4]   2> 	6	/solr/collections/testMoveReplicaMainCollection_xyz/state.json
   [junit4]   2> 	5	/solr/collections/testMoveReplicaMainCollection_abc/state.json
   [junit4]   2> 	5	/solr/collections/testAddReplica_abc/state.json
   [junit4]   2> 	5	/solr/collections/testAddReplicaWithPolicy_abc/state.json
   [junit4]   2> 	5	/solr/collections/testMultipleWithCollections_abc2/state.json
   [junit4]   2> 	5	/solr/collections/testDeleteWithCollection_abc/state.json
   [junit4]   2> 	5	/solr/collections/testMultipleWithCollections_xyz/state.json
   [junit4]   2> 	4	/solr/collections/testMultipleWithCollections_xyz2/state.json
   [junit4]   2> 	4	/solr/collections/testAddReplica_xyz/state.json
   [junit4]   2> 	3	/solr/collections/testAddReplicaWithPolicy_xyz/state.json
   [junit4]   2> 	2	/solr/collections/testNodeAdded_xyz/leader_elect/shard1/election/72119516263284742-core_node2-n_0000000000
   [junit4]   2> 	2	/solr/collections/testCreateCollectionNoWithCollection_abc/state.json
   [junit4]   2> 	2	/solr/overseer_elect/election/72119516263284740-127.0.0.1:35493_solr-n_0000000001
   [junit4]   2> 
   [junit4]   2> Maximum concurrent children watches above limit:
   [junit4]   2> 
   [junit4]   2> 	194	/solr/collections
   [junit4]   2> 	51	/solr/live_nodes
   [junit4]   2> 
   [junit4]   2> NOTE: leaving temporary files on disk at: /home/jenkins/workspace/Lucene-Solr-master-Linux/solr/build/solr-core/test/J0/temp/solr.cloud.TestWithCollection_EF87C5A37A165324-001
   [junit4]   2> Aug 07, 2018 11:50:58 AM com.carrotsearch.randomizedtesting.ThreadLeakControl checkThreadLeaks
   [junit4]   2> WARNING: Will linger awaiting termination of 1 leaked thread(s).
   [junit4]   2> NOTE: test params are: codec=Asserting(Lucene70): {}, docValues:{}, maxPointsInLeafNode=1389, maxMBSortInHeap=7.143685513444962, sim=Asserting(org.apache.lucene.search.similarities.AssertingSimilarity@6bf255b0), locale=ka, timezone=America/Mazatlan
   [junit4]   2> NOTE: Linux 4.15.0-29-generic amd64/Oracle Corporation 10.0.1 (64-bit)/cpus=8,threads=1,free=353907064,total=536870912
   [junit4]   2> NOTE: All tests run in this JVM: [TestWithCollection, TestWithCollection]
   [junit4] Completed [4/5 (1!)] on J0 in 85.02s, 9 tests, 1 error <<< FAILURES!

[...truncated 23 lines...]
BUILD FAILED
/home/jenkins/workspace/Lucene-Solr-master-Linux/lucene/common-build.xml:1568: The following error occurred while executing this line:
/home/jenkins/workspace/Lucene-Solr-master-Linux/lucene/common-build.xml:1092: There were test failures: 5 suites, 45 tests, 1 error [seed: EF87C5A37A165324]

Total time: 3 minutes 36 seconds

[repro] Setting last failure code to 256

[repro] Failures:
[repro]   1/5 failed: org.apache.solr.cloud.TestWithCollection
[repro] Exiting with code 256
+ mv lucene/build lucene/build.repro
+ mv solr/build solr/build.repro
+ mv lucene/build.orig lucene/build
+ mv solr/build.orig solr/build
Archiving artifacts
Setting ANT_1_8_2_HOME=/var/lib/jenkins/tools/hudson.tasks.Ant_AntInstallation/ANT_1.8.2
[WARNINGS] Parsing warnings in console log with parser Java Compiler (javac)
Setting ANT_1_8_2_HOME=/var/lib/jenkins/tools/hudson.tasks.Ant_AntInstallation/ANT_1.8.2
Setting ANT_1_8_2_HOME=/var/lib/jenkins/tools/hudson.tasks.Ant_AntInstallation/ANT_1.8.2
<Git Blamer> Using GitBlamer to create author and commit information for all warnings.
<Git Blamer> GIT_COMMIT=08ca54f1f89eb98f6a3238f0f91c1f8383c12119, workspace=/var/lib/jenkins/workspace/Lucene-Solr-master-Linux
[WARNINGS] Computing warning deltas based on reference build #22619
Recording test results
Setting ANT_1_8_2_HOME=/var/lib/jenkins/tools/hudson.tasks.Ant_AntInstallation/ANT_1.8.2
Build step 'Publish JUnit test result report' changed build result to UNSTABLE
Email was triggered for: Unstable (Test Failures)
Sending email for trigger: Unstable (Test Failures)
Setting ANT_1_8_2_HOME=/var/lib/jenkins/tools/hudson.tasks.Ant_AntInstallation/ANT_1.8.2
Setting ANT_1_8_2_HOME=/var/lib/jenkins/tools/hudson.tasks.Ant_AntInstallation/ANT_1.8.2
Setting ANT_1_8_2_HOME=/var/lib/jenkins/tools/hudson.tasks.Ant_AntInstallation/ANT_1.8.2
Setting ANT_1_8_2_HOME=/var/lib/jenkins/tools/hudson.tasks.Ant_AntInstallation/ANT_1.8.2

[JENKINS] Lucene-Solr-master-Linux (64bit/jdk1.8.0_172) - Build # 22621 - Still Unstable!

Posted by Policeman Jenkins Server <je...@thetaphi.de>.
Build: https://jenkins.thetaphi.de/job/Lucene-Solr-master-Linux/22621/
Java: 64bit/jdk1.8.0_172 -XX:+UseCompressedOops -XX:+UseSerialGC

4 tests failed.
FAILED:  junit.framework.TestSuite.org.apache.solr.cloud.BasicZkTest

Error Message:
SolrCore.getOpenCount()==2

Stack Trace:
java.lang.RuntimeException: SolrCore.getOpenCount()==2
	at __randomizedtesting.SeedInfo.seed([45B66A5FF1C81659]:0)
	at org.apache.solr.util.TestHarness.close(TestHarness.java:379)
	at org.apache.solr.SolrTestCaseJ4.deleteCore(SolrTestCaseJ4.java:802)
	at org.apache.solr.cloud.AbstractZkTestCase.azt_afterClass(AbstractZkTestCase.java:147)
	at sun.reflect.NativeMethodAccessorImpl.invoke0(Native Method)
	at sun.reflect.NativeMethodAccessorImpl.invoke(NativeMethodAccessorImpl.java:62)
	at sun.reflect.DelegatingMethodAccessorImpl.invoke(DelegatingMethodAccessorImpl.java:43)
	at java.lang.reflect.Method.invoke(Method.java:498)
	at com.carrotsearch.randomizedtesting.RandomizedRunner.invoke(RandomizedRunner.java:1737)
	at com.carrotsearch.randomizedtesting.RandomizedRunner$7.evaluate(RandomizedRunner.java:897)
	at com.carrotsearch.randomizedtesting.rules.StatementAdapter.evaluate(StatementAdapter.java:36)
	at com.carrotsearch.randomizedtesting.rules.SystemPropertiesRestoreRule$1.evaluate(SystemPropertiesRestoreRule.java:57)
	at org.apache.lucene.util.AbstractBeforeAfterRule$1.evaluate(AbstractBeforeAfterRule.java:45)
	at com.carrotsearch.randomizedtesting.rules.StatementAdapter.evaluate(StatementAdapter.java:36)
	at org.apache.lucene.util.TestRuleStoreClassName$1.evaluate(TestRuleStoreClassName.java:41)
	at com.carrotsearch.randomizedtesting.rules.NoShadowingOrOverridesOnMethodsRule$1.evaluate(NoShadowingOrOverridesOnMethodsRule.java:40)
	at com.carrotsearch.randomizedtesting.rules.NoShadowingOrOverridesOnMethodsRule$1.evaluate(NoShadowingOrOverridesOnMethodsRule.java:40)
	at com.carrotsearch.randomizedtesting.rules.StatementAdapter.evaluate(StatementAdapter.java:36)
	at com.carrotsearch.randomizedtesting.rules.StatementAdapter.evaluate(StatementAdapter.java:36)
	at com.carrotsearch.randomizedtesting.rules.StatementAdapter.evaluate(StatementAdapter.java:36)
	at org.apache.lucene.util.TestRuleAssertionsRequired$1.evaluate(TestRuleAssertionsRequired.java:53)
	at org.apache.lucene.util.TestRuleMarkFailure$1.evaluate(TestRuleMarkFailure.java:47)
	at org.apache.lucene.util.TestRuleIgnoreAfterMaxFailures$1.evaluate(TestRuleIgnoreAfterMaxFailures.java:64)
	at org.apache.lucene.util.TestRuleIgnoreTestSuites$1.evaluate(TestRuleIgnoreTestSuites.java:54)
	at com.carrotsearch.randomizedtesting.rules.StatementAdapter.evaluate(StatementAdapter.java:36)
	at com.carrotsearch.randomizedtesting.ThreadLeakControl$StatementRunner.run(ThreadLeakControl.java:368)
	at java.lang.Thread.run(Thread.java:748)


FAILED:  junit.framework.TestSuite.org.apache.solr.cloud.BasicZkTest

Error Message:
SolrCore.getOpenCount()==2

Stack Trace:
java.lang.RuntimeException: SolrCore.getOpenCount()==2
	at __randomizedtesting.SeedInfo.seed([45B66A5FF1C81659]:0)
	at org.apache.solr.util.TestHarness.close(TestHarness.java:379)
	at org.apache.solr.SolrTestCaseJ4.deleteCore(SolrTestCaseJ4.java:802)
	at org.apache.solr.SolrTestCaseJ4.teardownTestCases(SolrTestCaseJ4.java:297)
	at sun.reflect.GeneratedMethodAccessor50.invoke(Unknown Source)
	at sun.reflect.DelegatingMethodAccessorImpl.invoke(DelegatingMethodAccessorImpl.java:43)
	at java.lang.reflect.Method.invoke(Method.java:498)
	at com.carrotsearch.randomizedtesting.RandomizedRunner.invoke(RandomizedRunner.java:1737)
	at com.carrotsearch.randomizedtesting.RandomizedRunner$7.evaluate(RandomizedRunner.java:897)
	at com.carrotsearch.randomizedtesting.rules.StatementAdapter.evaluate(StatementAdapter.java:36)
	at com.carrotsearch.randomizedtesting.rules.SystemPropertiesRestoreRule$1.evaluate(SystemPropertiesRestoreRule.java:57)
	at org.apache.lucene.util.AbstractBeforeAfterRule$1.evaluate(AbstractBeforeAfterRule.java:45)
	at com.carrotsearch.randomizedtesting.rules.StatementAdapter.evaluate(StatementAdapter.java:36)
	at org.apache.lucene.util.TestRuleStoreClassName$1.evaluate(TestRuleStoreClassName.java:41)
	at com.carrotsearch.randomizedtesting.rules.NoShadowingOrOverridesOnMethodsRule$1.evaluate(NoShadowingOrOverridesOnMethodsRule.java:40)
	at com.carrotsearch.randomizedtesting.rules.NoShadowingOrOverridesOnMethodsRule$1.evaluate(NoShadowingOrOverridesOnMethodsRule.java:40)
	at com.carrotsearch.randomizedtesting.rules.StatementAdapter.evaluate(StatementAdapter.java:36)
	at com.carrotsearch.randomizedtesting.rules.StatementAdapter.evaluate(StatementAdapter.java:36)
	at com.carrotsearch.randomizedtesting.rules.StatementAdapter.evaluate(StatementAdapter.java:36)
	at org.apache.lucene.util.TestRuleAssertionsRequired$1.evaluate(TestRuleAssertionsRequired.java:53)
	at org.apache.lucene.util.TestRuleMarkFailure$1.evaluate(TestRuleMarkFailure.java:47)
	at org.apache.lucene.util.TestRuleIgnoreAfterMaxFailures$1.evaluate(TestRuleIgnoreAfterMaxFailures.java:64)
	at org.apache.lucene.util.TestRuleIgnoreTestSuites$1.evaluate(TestRuleIgnoreTestSuites.java:54)
	at com.carrotsearch.randomizedtesting.rules.StatementAdapter.evaluate(StatementAdapter.java:36)
	at com.carrotsearch.randomizedtesting.ThreadLeakControl$StatementRunner.run(ThreadLeakControl.java:368)
	at java.lang.Thread.run(Thread.java:748)


FAILED:  junit.framework.TestSuite.org.apache.solr.cloud.BasicZkTest

Error Message:
26 threads leaked from SUITE scope at org.apache.solr.cloud.BasicZkTest:     1) Thread[id=4019, name=Connection evictor, state=TIMED_WAITING, group=TGRP-BasicZkTest]         at java.lang.Thread.sleep(Native Method)         at org.apache.http.impl.client.IdleConnectionEvictor$1.run(IdleConnectionEvictor.java:66)         at java.lang.Thread.run(Thread.java:748)    2) Thread[id=4042, name=Thread-680, state=WAITING, group=TGRP-BasicZkTest]         at java.lang.Object.wait(Native Method)         at java.lang.Object.wait(Object.java:502)         at org.apache.solr.core.CloserThread.run(CoreContainer.java:1854)    3) Thread[id=4040, name=MetricsHistoryHandler-1950-thread-1, state=WAITING, group=TGRP-BasicZkTest]         at sun.misc.Unsafe.park(Native Method)         at java.util.concurrent.locks.LockSupport.park(LockSupport.java:175)         at java.util.concurrent.locks.AbstractQueuedSynchronizer$ConditionObject.await(AbstractQueuedSynchronizer.java:2039)         at java.util.concurrent.ScheduledThreadPoolExecutor$DelayedWorkQueue.take(ScheduledThreadPoolExecutor.java:1081)         at java.util.concurrent.ScheduledThreadPoolExecutor$DelayedWorkQueue.take(ScheduledThreadPoolExecutor.java:809)         at java.util.concurrent.ThreadPoolExecutor.getTask(ThreadPoolExecutor.java:1074)         at java.util.concurrent.ThreadPoolExecutor.runWorker(ThreadPoolExecutor.java:1134)         at java.util.concurrent.ThreadPoolExecutor$Worker.run(ThreadPoolExecutor.java:624)         at java.lang.Thread.run(Thread.java:748)    4) Thread[id=4055, name=SessionTracker, state=TIMED_WAITING, group=TGRP-BasicZkTest]         at java.lang.Object.wait(Native Method)         at org.apache.zookeeper.server.SessionTrackerImpl.run(SessionTrackerImpl.java:147)    5) Thread[id=4028, name=SUITE-BasicZkTest-seed#[45B66A5FF1C81659]-worker-SendThread(127.0.0.1:33595), state=RUNNABLE, group=TGRP-BasicZkTest]         at sun.nio.ch.EPollArrayWrapper.epollWait(Native Method)         at sun.nio.ch.EPollArrayWrapper.poll(EPollArrayWrapper.java:269)         at sun.nio.ch.EPollSelectorImpl.doSelect(EPollSelectorImpl.java:93)         at sun.nio.ch.SelectorImpl.lockAndDoSelect(SelectorImpl.java:86)         at sun.nio.ch.SelectorImpl.select(SelectorImpl.java:97)         at org.apache.zookeeper.ClientCnxnSocketNIO.doTransport(ClientCnxnSocketNIO.java:349)         at org.apache.zookeeper.ClientCnxn$SendThread.run(ClientCnxn.java:1144)    6) Thread[id=4035, name=ScheduledTrigger-1945-thread-1, state=WAITING, group=TGRP-BasicZkTest]         at sun.misc.Unsafe.park(Native Method)         at java.util.concurrent.locks.LockSupport.park(LockSupport.java:175)         at java.util.concurrent.locks.AbstractQueuedSynchronizer$ConditionObject.await(AbstractQueuedSynchronizer.java:2039)         at java.util.concurrent.ScheduledThreadPoolExecutor$DelayedWorkQueue.take(ScheduledThreadPoolExecutor.java:1088)         at java.util.concurrent.ScheduledThreadPoolExecutor$DelayedWorkQueue.take(ScheduledThreadPoolExecutor.java:809)         at java.util.concurrent.ThreadPoolExecutor.getTask(ThreadPoolExecutor.java:1074)         at java.util.concurrent.ThreadPoolExecutor.runWorker(ThreadPoolExecutor.java:1134)         at java.util.concurrent.ThreadPoolExecutor$Worker.run(ThreadPoolExecutor.java:624)         at java.lang.Thread.run(Thread.java:748)    7) Thread[id=4032, name=OverseerAutoScalingTriggerThread-72120053600813059-88.99.242.108:8983_-n_0000000000, state=WAITING, group=Overseer autoscaling triggers]         at sun.misc.Unsafe.park(Native Method)         at java.util.concurrent.locks.LockSupport.park(LockSupport.java:175)         at java.util.concurrent.locks.AbstractQueuedSynchronizer$ConditionObject.await(AbstractQueuedSynchronizer.java:2039)         at org.apache.solr.cloud.autoscaling.OverseerTriggerThread.run(OverseerTriggerThread.java:189)         at java.lang.Thread.run(Thread.java:748)    8) Thread[id=4038, name=ScheduledTrigger-1945-thread-4, state=WAITING, group=TGRP-BasicZkTest]         at sun.misc.Unsafe.park(Native Method)         at java.util.concurrent.locks.LockSupport.park(LockSupport.java:175)         at java.util.concurrent.locks.AbstractQueuedSynchronizer$ConditionObject.await(AbstractQueuedSynchronizer.java:2039)         at java.util.concurrent.ScheduledThreadPoolExecutor$DelayedWorkQueue.take(ScheduledThreadPoolExecutor.java:1088)         at java.util.concurrent.ScheduledThreadPoolExecutor$DelayedWorkQueue.take(ScheduledThreadPoolExecutor.java:809)         at java.util.concurrent.ThreadPoolExecutor.getTask(ThreadPoolExecutor.java:1074)         at java.util.concurrent.ThreadPoolExecutor.runWorker(ThreadPoolExecutor.java:1134)         at java.util.concurrent.ThreadPoolExecutor$Worker.run(ThreadPoolExecutor.java:624)         at java.lang.Thread.run(Thread.java:748)    9) Thread[id=4039, name=SolrRrdBackendFactory-1949-thread-1, state=TIMED_WAITING, group=TGRP-BasicZkTest]         at sun.misc.Unsafe.park(Native Method)         at java.util.concurrent.locks.LockSupport.parkNanos(LockSupport.java:215)         at java.util.concurrent.locks.AbstractQueuedSynchronizer$ConditionObject.awaitNanos(AbstractQueuedSynchronizer.java:2078)         at java.util.concurrent.ScheduledThreadPoolExecutor$DelayedWorkQueue.take(ScheduledThreadPoolExecutor.java:1093)         at java.util.concurrent.ScheduledThreadPoolExecutor$DelayedWorkQueue.take(ScheduledThreadPoolExecutor.java:809)         at java.util.concurrent.ThreadPoolExecutor.getTask(ThreadPoolExecutor.java:1074)         at java.util.concurrent.ThreadPoolExecutor.runWorker(ThreadPoolExecutor.java:1134)         at java.util.concurrent.ThreadPoolExecutor$Worker.run(ThreadPoolExecutor.java:624)         at java.lang.Thread.run(Thread.java:748)   10) Thread[id=4057, name=ProcessThread(sid:0 cport:33595):, state=WAITING, group=TGRP-BasicZkTest]         at sun.misc.Unsafe.park(Native Method)         at java.util.concurrent.locks.LockSupport.park(LockSupport.java:175)         at java.util.concurrent.locks.AbstractQueuedSynchronizer$ConditionObject.await(AbstractQueuedSynchronizer.java:2039)         at java.util.concurrent.LinkedBlockingQueue.take(LinkedBlockingQueue.java:442)         at org.apache.zookeeper.server.PrepRequestProcessor.run(PrepRequestProcessor.java:123)   11) Thread[id=4023, name=SUITE-BasicZkTest-seed#[45B66A5FF1C81659]-worker-SendThread(127.0.0.1:33595), state=RUNNABLE, group=TGRP-BasicZkTest]         at sun.nio.ch.EPollArrayWrapper.epollWait(Native Method)         at sun.nio.ch.EPollArrayWrapper.poll(EPollArrayWrapper.java:269)         at sun.nio.ch.EPollSelectorImpl.doSelect(EPollSelectorImpl.java:93)         at sun.nio.ch.SelectorImpl.lockAndDoSelect(SelectorImpl.java:86)         at sun.nio.ch.SelectorImpl.select(SelectorImpl.java:97)         at org.apache.zookeeper.ClientCnxnSocketNIO.doTransport(ClientCnxnSocketNIO.java:349)         at org.apache.zookeeper.ClientCnxn$SendThread.run(ClientCnxn.java:1144)   12) Thread[id=4024, name=SUITE-BasicZkTest-seed#[45B66A5FF1C81659]-worker-EventThread, state=WAITING, group=TGRP-BasicZkTest]         at sun.misc.Unsafe.park(Native Method)         at java.util.concurrent.locks.LockSupport.park(LockSupport.java:175)         at java.util.concurrent.locks.AbstractQueuedSynchronizer$ConditionObject.await(AbstractQueuedSynchronizer.java:2039)         at java.util.concurrent.LinkedBlockingQueue.take(LinkedBlockingQueue.java:442)         at org.apache.zookeeper.ClientCnxn$EventThread.run(ClientCnxn.java:502)   13) Thread[id=4036, name=ScheduledTrigger-1945-thread-2, state=TIMED_WAITING, group=TGRP-BasicZkTest]         at sun.misc.Unsafe.park(Native Method)         at java.util.concurrent.locks.LockSupport.parkNanos(LockSupport.java:215)         at java.util.concurrent.locks.AbstractQueuedSynchronizer$ConditionObject.awaitNanos(AbstractQueuedSynchronizer.java:2078)         at java.util.concurrent.ScheduledThreadPoolExecutor$DelayedWorkQueue.take(ScheduledThreadPoolExecutor.java:1093)         at java.util.concurrent.ScheduledThreadPoolExecutor$DelayedWorkQueue.take(ScheduledThreadPoolExecutor.java:809)         at java.util.concurrent.ThreadPoolExecutor.getTask(ThreadPoolExecutor.java:1074)         at java.util.concurrent.ThreadPoolExecutor.runWorker(ThreadPoolExecutor.java:1134)         at java.util.concurrent.ThreadPoolExecutor$Worker.run(ThreadPoolExecutor.java:624)         at java.lang.Thread.run(Thread.java:748)   14) Thread[id=4045, name=searcherExecutor-1952-thread-1, state=WAITING, group=TGRP-BasicZkTest]         at sun.misc.Unsafe.park(Native Method)         at java.util.concurrent.locks.LockSupport.park(LockSupport.java:175)         at java.util.concurrent.locks.AbstractQueuedSynchronizer$ConditionObject.await(AbstractQueuedSynchronizer.java:2039)         at java.util.concurrent.LinkedBlockingQueue.take(LinkedBlockingQueue.java:442)         at java.util.concurrent.ThreadPoolExecutor.getTask(ThreadPoolExecutor.java:1074)         at java.util.concurrent.ThreadPoolExecutor.runWorker(ThreadPoolExecutor.java:1134)         at java.util.concurrent.ThreadPoolExecutor$Worker.run(ThreadPoolExecutor.java:624)         at java.lang.Thread.run(Thread.java:748)   15) Thread[id=4017, name=Connection evictor, state=TIMED_WAITING, group=TGRP-BasicZkTest]         at java.lang.Thread.sleep(Native Method)         at org.apache.http.impl.client.IdleConnectionEvictor$1.run(IdleConnectionEvictor.java:66)         at java.lang.Thread.run(Thread.java:748)   16) Thread[id=4029, name=SUITE-BasicZkTest-seed#[45B66A5FF1C81659]-worker-EventThread, state=WAITING, group=TGRP-BasicZkTest]         at sun.misc.Unsafe.park(Native Method)         at java.util.concurrent.locks.LockSupport.park(LockSupport.java:175)         at java.util.concurrent.locks.AbstractQueuedSynchronizer$ConditionObject.await(AbstractQueuedSynchronizer.java:2039)         at java.util.concurrent.LinkedBlockingQueue.take(LinkedBlockingQueue.java:442)         at org.apache.zookeeper.ClientCnxn$EventThread.run(ClientCnxn.java:502)   17) Thread[id=4026, name=OverseerStateUpdate-72120053600813059-88.99.242.108:8983_-n_0000000000, state=TIMED_WAITING, group=Overseer state updater.]         at sun.misc.Unsafe.park(Native Method)         at java.util.concurrent.locks.LockSupport.parkNanos(LockSupport.java:215)         at java.util.concurrent.locks.AbstractQueuedSynchronizer$ConditionObject.awaitNanos(AbstractQueuedSynchronizer.java:2078)         at org.apache.solr.cloud.ZkDistributedQueue.peekElements(ZkDistributedQueue.java:463)         at org.apache.solr.cloud.Overseer$ClusterStateUpdater.run(Overseer.java:205)         at java.lang.Thread.run(Thread.java:748)   18) Thread[id=4054, name=NIOServerCxn.Factory:0.0.0.0/0.0.0.0:33595, state=RUNNABLE, group=TGRP-BasicZkTest]         at sun.nio.ch.EPollArrayWrapper.epollWait(Native Method)         at sun.nio.ch.EPollArrayWrapper.poll(EPollArrayWrapper.java:269)         at sun.nio.ch.EPollSelectorImpl.doSelect(EPollSelectorImpl.java:93)         at sun.nio.ch.SelectorImpl.lockAndDoSelect(SelectorImpl.java:86)         at sun.nio.ch.SelectorImpl.select(SelectorImpl.java:97)         at org.apache.zookeeper.server.NIOServerCnxnFactory.run(NIOServerCnxnFactory.java:196)         at java.lang.Thread.run(Thread.java:748)   19) Thread[id=4027, name=Connection evictor, state=TIMED_WAITING, group=TGRP-BasicZkTest]         at java.lang.Thread.sleep(Native Method)         at org.apache.http.impl.client.IdleConnectionEvictor$1.run(IdleConnectionEvictor.java:66)         at java.lang.Thread.run(Thread.java:748)   20) Thread[id=4053, name=Thread-681, state=WAITING, group=TGRP-BasicZkTest]         at java.lang.Object.wait(Native Method)         at java.lang.Thread.join(Thread.java:1252)         at java.lang.Thread.join(Thread.java:1326)         at org.apache.zookeeper.server.NIOServerCnxnFactory.join(NIOServerCnxnFactory.java:313)         at org.apache.solr.cloud.ZkTestServer$ZKServerMain.runFromConfig(ZkTestServer.java:313)         at org.apache.solr.cloud.ZkTestServer$2.run(ZkTestServer.java:496)   21) Thread[id=4062, name=SolrRrdBackendFactory-1949-thread-2, state=WAITING, group=TGRP-BasicZkTest]         at sun.misc.Unsafe.park(Native Method)         at java.util.concurrent.locks.LockSupport.park(LockSupport.java:175)         at java.util.concurrent.locks.AbstractQueuedSynchronizer$ConditionObject.await(AbstractQueuedSynchronizer.java:2039)         at java.util.concurrent.ScheduledThreadPoolExecutor$DelayedWorkQueue.take(ScheduledThreadPoolExecutor.java:1088)         at java.util.concurrent.ScheduledThreadPoolExecutor$DelayedWorkQueue.take(ScheduledThreadPoolExecutor.java:809)         at java.util.concurrent.ThreadPoolExecutor.getTask(ThreadPoolExecutor.java:1074)         at java.util.concurrent.ThreadPoolExecutor.runWorker(ThreadPoolExecutor.java:1134)         at java.util.concurrent.ThreadPoolExecutor$Worker.run(ThreadPoolExecutor.java:624)         at java.lang.Thread.run(Thread.java:748)   22) Thread[id=4037, name=ScheduledTrigger-1945-thread-3, state=WAITING, group=TGRP-BasicZkTest]         at sun.misc.Unsafe.park(Native Method)         at java.util.concurrent.locks.LockSupport.park(LockSupport.java:175)         at java.util.concurrent.locks.AbstractQueuedSynchronizer$ConditionObject.await(AbstractQueuedSynchronizer.java:2039)         at java.util.concurrent.ScheduledThreadPoolExecutor$DelayedWorkQueue.take(ScheduledThreadPoolExecutor.java:1088)         at java.util.concurrent.ScheduledThreadPoolExecutor$DelayedWorkQueue.take(ScheduledThreadPoolExecutor.java:809)         at java.util.concurrent.ThreadPoolExecutor.getTask(ThreadPoolExecutor.java:1074)         at java.util.concurrent.ThreadPoolExecutor.runWorker(ThreadPoolExecutor.java:1134)         at java.util.concurrent.ThreadPoolExecutor$Worker.run(ThreadPoolExecutor.java:624)         at java.lang.Thread.run(Thread.java:748)   23) Thread[id=4030, name=zkConnectionManagerCallback-992-thread-1, state=WAITING, group=TGRP-BasicZkTest]         at sun.misc.Unsafe.park(Native Method)         at java.util.concurrent.locks.LockSupport.park(LockSupport.java:175)         at java.util.concurrent.locks.AbstractQueuedSynchronizer$ConditionObject.await(AbstractQueuedSynchronizer.java:2039)         at java.util.concurrent.LinkedBlockingQueue.take(LinkedBlockingQueue.java:442)         at java.util.concurrent.ThreadPoolExecutor.getTask(ThreadPoolExecutor.java:1074)         at java.util.concurrent.ThreadPoolExecutor.runWorker(ThreadPoolExecutor.java:1134)         at java.util.concurrent.ThreadPoolExecutor$Worker.run(ThreadPoolExecutor.java:624)         at java.lang.Thread.run(Thread.java:748)   24) Thread[id=4031, name=OverseerCollectionConfigSetProcessor-72120053600813059-88.99.242.108:8983_-n_0000000000, state=TIMED_WAITING, group=Overseer collection creation process.]         at sun.misc.Unsafe.park(Native Method)         at java.util.concurrent.locks.LockSupport.parkNanos(LockSupport.java:215)         at java.util.concurrent.locks.AbstractQueuedSynchronizer$ConditionObject.awaitNanos(AbstractQueuedSynchronizer.java:2078)         at org.apache.solr.cloud.ZkDistributedQueue.peekElements(ZkDistributedQueue.java:463)         at org.apache.solr.cloud.OverseerTaskQueue.peekTopN(OverseerTaskQueue.java:243)         at org.apache.solr.cloud.OverseerTaskProcessor.run(OverseerTaskProcessor.java:228)         at java.lang.Thread.run(Thread.java:748)   25) Thread[id=4025, name=zkConnectionManagerCallback-985-thread-1, state=WAITING, group=TGRP-BasicZkTest]         at sun.misc.Unsafe.park(Native Method)         at java.util.concurrent.locks.LockSupport.park(LockSupport.java:175)         at java.util.concurrent.locks.AbstractQueuedSynchronizer$ConditionObject.await(AbstractQueuedSynchronizer.java:2039)         at java.util.concurrent.LinkedBlockingQueue.take(LinkedBlockingQueue.java:442)         at java.util.concurrent.ThreadPoolExecutor.getTask(ThreadPoolExecutor.java:1074)         at java.util.concurrent.ThreadPoolExecutor.runWorker(ThreadPoolExecutor.java:1134)         at java.util.concurrent.ThreadPoolExecutor$Worker.run(ThreadPoolExecutor.java:624)         at java.lang.Thread.run(Thread.java:748)   26) Thread[id=4018, name=Connection evictor, state=TIMED_WAITING, group=TGRP-BasicZkTest]         at java.lang.Thread.sleep(Native Method)         at org.apache.http.impl.client.IdleConnectionEvictor$1.run(IdleConnectionEvictor.java:66)         at java.lang.Thread.run(Thread.java:748)

Stack Trace:
com.carrotsearch.randomizedtesting.ThreadLeakError: 26 threads leaked from SUITE scope at org.apache.solr.cloud.BasicZkTest: 
   1) Thread[id=4019, name=Connection evictor, state=TIMED_WAITING, group=TGRP-BasicZkTest]
        at java.lang.Thread.sleep(Native Method)
        at org.apache.http.impl.client.IdleConnectionEvictor$1.run(IdleConnectionEvictor.java:66)
        at java.lang.Thread.run(Thread.java:748)
   2) Thread[id=4042, name=Thread-680, state=WAITING, group=TGRP-BasicZkTest]
        at java.lang.Object.wait(Native Method)
        at java.lang.Object.wait(Object.java:502)
        at org.apache.solr.core.CloserThread.run(CoreContainer.java:1854)
   3) Thread[id=4040, name=MetricsHistoryHandler-1950-thread-1, state=WAITING, group=TGRP-BasicZkTest]
        at sun.misc.Unsafe.park(Native Method)
        at java.util.concurrent.locks.LockSupport.park(LockSupport.java:175)
        at java.util.concurrent.locks.AbstractQueuedSynchronizer$ConditionObject.await(AbstractQueuedSynchronizer.java:2039)
        at java.util.concurrent.ScheduledThreadPoolExecutor$DelayedWorkQueue.take(ScheduledThreadPoolExecutor.java:1081)
        at java.util.concurrent.ScheduledThreadPoolExecutor$DelayedWorkQueue.take(ScheduledThreadPoolExecutor.java:809)
        at java.util.concurrent.ThreadPoolExecutor.getTask(ThreadPoolExecutor.java:1074)
        at java.util.concurrent.ThreadPoolExecutor.runWorker(ThreadPoolExecutor.java:1134)
        at java.util.concurrent.ThreadPoolExecutor$Worker.run(ThreadPoolExecutor.java:624)
        at java.lang.Thread.run(Thread.java:748)
   4) Thread[id=4055, name=SessionTracker, state=TIMED_WAITING, group=TGRP-BasicZkTest]
        at java.lang.Object.wait(Native Method)
        at org.apache.zookeeper.server.SessionTrackerImpl.run(SessionTrackerImpl.java:147)
   5) Thread[id=4028, name=SUITE-BasicZkTest-seed#[45B66A5FF1C81659]-worker-SendThread(127.0.0.1:33595), state=RUNNABLE, group=TGRP-BasicZkTest]
        at sun.nio.ch.EPollArrayWrapper.epollWait(Native Method)
        at sun.nio.ch.EPollArrayWrapper.poll(EPollArrayWrapper.java:269)
        at sun.nio.ch.EPollSelectorImpl.doSelect(EPollSelectorImpl.java:93)
        at sun.nio.ch.SelectorImpl.lockAndDoSelect(SelectorImpl.java:86)
        at sun.nio.ch.SelectorImpl.select(SelectorImpl.java:97)
        at org.apache.zookeeper.ClientCnxnSocketNIO.doTransport(ClientCnxnSocketNIO.java:349)
        at org.apache.zookeeper.ClientCnxn$SendThread.run(ClientCnxn.java:1144)
   6) Thread[id=4035, name=ScheduledTrigger-1945-thread-1, state=WAITING, group=TGRP-BasicZkTest]
        at sun.misc.Unsafe.park(Native Method)
        at java.util.concurrent.locks.LockSupport.park(LockSupport.java:175)
        at java.util.concurrent.locks.AbstractQueuedSynchronizer$ConditionObject.await(AbstractQueuedSynchronizer.java:2039)
        at java.util.concurrent.ScheduledThreadPoolExecutor$DelayedWorkQueue.take(ScheduledThreadPoolExecutor.java:1088)
        at java.util.concurrent.ScheduledThreadPoolExecutor$DelayedWorkQueue.take(ScheduledThreadPoolExecutor.java:809)
        at java.util.concurrent.ThreadPoolExecutor.getTask(ThreadPoolExecutor.java:1074)
        at java.util.concurrent.ThreadPoolExecutor.runWorker(ThreadPoolExecutor.java:1134)
        at java.util.concurrent.ThreadPoolExecutor$Worker.run(ThreadPoolExecutor.java:624)
        at java.lang.Thread.run(Thread.java:748)
   7) Thread[id=4032, name=OverseerAutoScalingTriggerThread-72120053600813059-88.99.242.108:8983_-n_0000000000, state=WAITING, group=Overseer autoscaling triggers]
        at sun.misc.Unsafe.park(Native Method)
        at java.util.concurrent.locks.LockSupport.park(LockSupport.java:175)
        at java.util.concurrent.locks.AbstractQueuedSynchronizer$ConditionObject.await(AbstractQueuedSynchronizer.java:2039)
        at org.apache.solr.cloud.autoscaling.OverseerTriggerThread.run(OverseerTriggerThread.java:189)
        at java.lang.Thread.run(Thread.java:748)
   8) Thread[id=4038, name=ScheduledTrigger-1945-thread-4, state=WAITING, group=TGRP-BasicZkTest]
        at sun.misc.Unsafe.park(Native Method)
        at java.util.concurrent.locks.LockSupport.park(LockSupport.java:175)
        at java.util.concurrent.locks.AbstractQueuedSynchronizer$ConditionObject.await(AbstractQueuedSynchronizer.java:2039)
        at java.util.concurrent.ScheduledThreadPoolExecutor$DelayedWorkQueue.take(ScheduledThreadPoolExecutor.java:1088)
        at java.util.concurrent.ScheduledThreadPoolExecutor$DelayedWorkQueue.take(ScheduledThreadPoolExecutor.java:809)
        at java.util.concurrent.ThreadPoolExecutor.getTask(ThreadPoolExecutor.java:1074)
        at java.util.concurrent.ThreadPoolExecutor.runWorker(ThreadPoolExecutor.java:1134)
        at java.util.concurrent.ThreadPoolExecutor$Worker.run(ThreadPoolExecutor.java:624)
        at java.lang.Thread.run(Thread.java:748)
   9) Thread[id=4039, name=SolrRrdBackendFactory-1949-thread-1, state=TIMED_WAITING, group=TGRP-BasicZkTest]
        at sun.misc.Unsafe.park(Native Method)
        at java.util.concurrent.locks.LockSupport.parkNanos(LockSupport.java:215)
        at java.util.concurrent.locks.AbstractQueuedSynchronizer$ConditionObject.awaitNanos(AbstractQueuedSynchronizer.java:2078)
        at java.util.concurrent.ScheduledThreadPoolExecutor$DelayedWorkQueue.take(ScheduledThreadPoolExecutor.java:1093)
        at java.util.concurrent.ScheduledThreadPoolExecutor$DelayedWorkQueue.take(ScheduledThreadPoolExecutor.java:809)
        at java.util.concurrent.ThreadPoolExecutor.getTask(ThreadPoolExecutor.java:1074)
        at java.util.concurrent.ThreadPoolExecutor.runWorker(ThreadPoolExecutor.java:1134)
        at java.util.concurrent.ThreadPoolExecutor$Worker.run(ThreadPoolExecutor.java:624)
        at java.lang.Thread.run(Thread.java:748)
  10) Thread[id=4057, name=ProcessThread(sid:0 cport:33595):, state=WAITING, group=TGRP-BasicZkTest]
        at sun.misc.Unsafe.park(Native Method)
        at java.util.concurrent.locks.LockSupport.park(LockSupport.java:175)
        at java.util.concurrent.locks.AbstractQueuedSynchronizer$ConditionObject.await(AbstractQueuedSynchronizer.java:2039)
        at java.util.concurrent.LinkedBlockingQueue.take(LinkedBlockingQueue.java:442)
        at org.apache.zookeeper.server.PrepRequestProcessor.run(PrepRequestProcessor.java:123)
  11) Thread[id=4023, name=SUITE-BasicZkTest-seed#[45B66A5FF1C81659]-worker-SendThread(127.0.0.1:33595), state=RUNNABLE, group=TGRP-BasicZkTest]
        at sun.nio.ch.EPollArrayWrapper.epollWait(Native Method)
        at sun.nio.ch.EPollArrayWrapper.poll(EPollArrayWrapper.java:269)
        at sun.nio.ch.EPollSelectorImpl.doSelect(EPollSelectorImpl.java:93)
        at sun.nio.ch.SelectorImpl.lockAndDoSelect(SelectorImpl.java:86)
        at sun.nio.ch.SelectorImpl.select(SelectorImpl.java:97)
        at org.apache.zookeeper.ClientCnxnSocketNIO.doTransport(ClientCnxnSocketNIO.java:349)
        at org.apache.zookeeper.ClientCnxn$SendThread.run(ClientCnxn.java:1144)
  12) Thread[id=4024, name=SUITE-BasicZkTest-seed#[45B66A5FF1C81659]-worker-EventThread, state=WAITING, group=TGRP-BasicZkTest]
        at sun.misc.Unsafe.park(Native Method)
        at java.util.concurrent.locks.LockSupport.park(LockSupport.java:175)
        at java.util.concurrent.locks.AbstractQueuedSynchronizer$ConditionObject.await(AbstractQueuedSynchronizer.java:2039)
        at java.util.concurrent.LinkedBlockingQueue.take(LinkedBlockingQueue.java:442)
        at org.apache.zookeeper.ClientCnxn$EventThread.run(ClientCnxn.java:502)
  13) Thread[id=4036, name=ScheduledTrigger-1945-thread-2, state=TIMED_WAITING, group=TGRP-BasicZkTest]
        at sun.misc.Unsafe.park(Native Method)
        at java.util.concurrent.locks.LockSupport.parkNanos(LockSupport.java:215)
        at java.util.concurrent.locks.AbstractQueuedSynchronizer$ConditionObject.awaitNanos(AbstractQueuedSynchronizer.java:2078)
        at java.util.concurrent.ScheduledThreadPoolExecutor$DelayedWorkQueue.take(ScheduledThreadPoolExecutor.java:1093)
        at java.util.concurrent.ScheduledThreadPoolExecutor$DelayedWorkQueue.take(ScheduledThreadPoolExecutor.java:809)
        at java.util.concurrent.ThreadPoolExecutor.getTask(ThreadPoolExecutor.java:1074)
        at java.util.concurrent.ThreadPoolExecutor.runWorker(ThreadPoolExecutor.java:1134)
        at java.util.concurrent.ThreadPoolExecutor$Worker.run(ThreadPoolExecutor.java:624)
        at java.lang.Thread.run(Thread.java:748)
  14) Thread[id=4045, name=searcherExecutor-1952-thread-1, state=WAITING, group=TGRP-BasicZkTest]
        at sun.misc.Unsafe.park(Native Method)
        at java.util.concurrent.locks.LockSupport.park(LockSupport.java:175)
        at java.util.concurrent.locks.AbstractQueuedSynchronizer$ConditionObject.await(AbstractQueuedSynchronizer.java:2039)
        at java.util.concurrent.LinkedBlockingQueue.take(LinkedBlockingQueue.java:442)
        at java.util.concurrent.ThreadPoolExecutor.getTask(ThreadPoolExecutor.java:1074)
        at java.util.concurrent.ThreadPoolExecutor.runWorker(ThreadPoolExecutor.java:1134)
        at java.util.concurrent.ThreadPoolExecutor$Worker.run(ThreadPoolExecutor.java:624)
        at java.lang.Thread.run(Thread.java:748)
  15) Thread[id=4017, name=Connection evictor, state=TIMED_WAITING, group=TGRP-BasicZkTest]
        at java.lang.Thread.sleep(Native Method)
        at org.apache.http.impl.client.IdleConnectionEvictor$1.run(IdleConnectionEvictor.java:66)
        at java.lang.Thread.run(Thread.java:748)
  16) Thread[id=4029, name=SUITE-BasicZkTest-seed#[45B66A5FF1C81659]-worker-EventThread, state=WAITING, group=TGRP-BasicZkTest]
        at sun.misc.Unsafe.park(Native Method)
        at java.util.concurrent.locks.LockSupport.park(LockSupport.java:175)
        at java.util.concurrent.locks.AbstractQueuedSynchronizer$ConditionObject.await(AbstractQueuedSynchronizer.java:2039)
        at java.util.concurrent.LinkedBlockingQueue.take(LinkedBlockingQueue.java:442)
        at org.apache.zookeeper.ClientCnxn$EventThread.run(ClientCnxn.java:502)
  17) Thread[id=4026, name=OverseerStateUpdate-72120053600813059-88.99.242.108:8983_-n_0000000000, state=TIMED_WAITING, group=Overseer state updater.]
        at sun.misc.Unsafe.park(Native Method)
        at java.util.concurrent.locks.LockSupport.parkNanos(LockSupport.java:215)
        at java.util.concurrent.locks.AbstractQueuedSynchronizer$ConditionObject.awaitNanos(AbstractQueuedSynchronizer.java:2078)
        at org.apache.solr.cloud.ZkDistributedQueue.peekElements(ZkDistributedQueue.java:463)
        at org.apache.solr.cloud.Overseer$ClusterStateUpdater.run(Overseer.java:205)
        at java.lang.Thread.run(Thread.java:748)
  18) Thread[id=4054, name=NIOServerCxn.Factory:0.0.0.0/0.0.0.0:33595, state=RUNNABLE, group=TGRP-BasicZkTest]
        at sun.nio.ch.EPollArrayWrapper.epollWait(Native Method)
        at sun.nio.ch.EPollArrayWrapper.poll(EPollArrayWrapper.java:269)
        at sun.nio.ch.EPollSelectorImpl.doSelect(EPollSelectorImpl.java:93)
        at sun.nio.ch.SelectorImpl.lockAndDoSelect(SelectorImpl.java:86)
        at sun.nio.ch.SelectorImpl.select(SelectorImpl.java:97)
        at org.apache.zookeeper.server.NIOServerCnxnFactory.run(NIOServerCnxnFactory.java:196)
        at java.lang.Thread.run(Thread.java:748)
  19) Thread[id=4027, name=Connection evictor, state=TIMED_WAITING, group=TGRP-BasicZkTest]
        at java.lang.Thread.sleep(Native Method)
        at org.apache.http.impl.client.IdleConnectionEvictor$1.run(IdleConnectionEvictor.java:66)
        at java.lang.Thread.run(Thread.java:748)
  20) Thread[id=4053, name=Thread-681, state=WAITING, group=TGRP-BasicZkTest]
        at java.lang.Object.wait(Native Method)
        at java.lang.Thread.join(Thread.java:1252)
        at java.lang.Thread.join(Thread.java:1326)
        at org.apache.zookeeper.server.NIOServerCnxnFactory.join(NIOServerCnxnFactory.java:313)
        at org.apache.solr.cloud.ZkTestServer$ZKServerMain.runFromConfig(ZkTestServer.java:313)
        at org.apache.solr.cloud.ZkTestServer$2.run(ZkTestServer.java:496)
  21) Thread[id=4062, name=SolrRrdBackendFactory-1949-thread-2, state=WAITING, group=TGRP-BasicZkTest]
        at sun.misc.Unsafe.park(Native Method)
        at java.util.concurrent.locks.LockSupport.park(LockSupport.java:175)
        at java.util.concurrent.locks.AbstractQueuedSynchronizer$ConditionObject.await(AbstractQueuedSynchronizer.java:2039)
        at java.util.concurrent.ScheduledThreadPoolExecutor$DelayedWorkQueue.take(ScheduledThreadPoolExecutor.java:1088)
        at java.util.concurrent.ScheduledThreadPoolExecutor$DelayedWorkQueue.take(ScheduledThreadPoolExecutor.java:809)
        at java.util.concurrent.ThreadPoolExecutor.getTask(ThreadPoolExecutor.java:1074)
        at java.util.concurrent.ThreadPoolExecutor.runWorker(ThreadPoolExecutor.java:1134)
        at java.util.concurrent.ThreadPoolExecutor$Worker.run(ThreadPoolExecutor.java:624)
        at java.lang.Thread.run(Thread.java:748)
  22) Thread[id=4037, name=ScheduledTrigger-1945-thread-3, state=WAITING, group=TGRP-BasicZkTest]
        at sun.misc.Unsafe.park(Native Method)
        at java.util.concurrent.locks.LockSupport.park(LockSupport.java:175)
        at java.util.concurrent.locks.AbstractQueuedSynchronizer$ConditionObject.await(AbstractQueuedSynchronizer.java:2039)
        at java.util.concurrent.ScheduledThreadPoolExecutor$DelayedWorkQueue.take(ScheduledThreadPoolExecutor.java:1088)
        at java.util.concurrent.ScheduledThreadPoolExecutor$DelayedWorkQueue.take(ScheduledThreadPoolExecutor.java:809)
        at java.util.concurrent.ThreadPoolExecutor.getTask(ThreadPoolExecutor.java:1074)
        at java.util.concurrent.ThreadPoolExecutor.runWorker(ThreadPoolExecutor.java:1134)
        at java.util.concurrent.ThreadPoolExecutor$Worker.run(ThreadPoolExecutor.java:624)
        at java.lang.Thread.run(Thread.java:748)
  23) Thread[id=4030, name=zkConnectionManagerCallback-992-thread-1, state=WAITING, group=TGRP-BasicZkTest]
        at sun.misc.Unsafe.park(Native Method)
        at java.util.concurrent.locks.LockSupport.park(LockSupport.java:175)
        at java.util.concurrent.locks.AbstractQueuedSynchronizer$ConditionObject.await(AbstractQueuedSynchronizer.java:2039)
        at java.util.concurrent.LinkedBlockingQueue.take(LinkedBlockingQueue.java:442)
        at java.util.concurrent.ThreadPoolExecutor.getTask(ThreadPoolExecutor.java:1074)
        at java.util.concurrent.ThreadPoolExecutor.runWorker(ThreadPoolExecutor.java:1134)
        at java.util.concurrent.ThreadPoolExecutor$Worker.run(ThreadPoolExecutor.java:624)
        at java.lang.Thread.run(Thread.java:748)
  24) Thread[id=4031, name=OverseerCollectionConfigSetProcessor-72120053600813059-88.99.242.108:8983_-n_0000000000, state=TIMED_WAITING, group=Overseer collection creation process.]
        at sun.misc.Unsafe.park(Native Method)
        at java.util.concurrent.locks.LockSupport.parkNanos(LockSupport.java:215)
        at java.util.concurrent.locks.AbstractQueuedSynchronizer$ConditionObject.awaitNanos(AbstractQueuedSynchronizer.java:2078)
        at org.apache.solr.cloud.ZkDistributedQueue.peekElements(ZkDistributedQueue.java:463)
        at org.apache.solr.cloud.OverseerTaskQueue.peekTopN(OverseerTaskQueue.java:243)
        at org.apache.solr.cloud.OverseerTaskProcessor.run(OverseerTaskProcessor.java:228)
        at java.lang.Thread.run(Thread.java:748)
  25) Thread[id=4025, name=zkConnectionManagerCallback-985-thread-1, state=WAITING, group=TGRP-BasicZkTest]
        at sun.misc.Unsafe.park(Native Method)
        at java.util.concurrent.locks.LockSupport.park(LockSupport.java:175)
        at java.util.concurrent.locks.AbstractQueuedSynchronizer$ConditionObject.await(AbstractQueuedSynchronizer.java:2039)
        at java.util.concurrent.LinkedBlockingQueue.take(LinkedBlockingQueue.java:442)
        at java.util.concurrent.ThreadPoolExecutor.getTask(ThreadPoolExecutor.java:1074)
        at java.util.concurrent.ThreadPoolExecutor.runWorker(ThreadPoolExecutor.java:1134)
        at java.util.concurrent.ThreadPoolExecutor$Worker.run(ThreadPoolExecutor.java:624)
        at java.lang.Thread.run(Thread.java:748)
  26) Thread[id=4018, name=Connection evictor, state=TIMED_WAITING, group=TGRP-BasicZkTest]
        at java.lang.Thread.sleep(Native Method)
        at org.apache.http.impl.client.IdleConnectionEvictor$1.run(IdleConnectionEvictor.java:66)
        at java.lang.Thread.run(Thread.java:748)
	at __randomizedtesting.SeedInfo.seed([45B66A5FF1C81659]:0)


FAILED:  junit.framework.TestSuite.org.apache.solr.cloud.BasicZkTest

Error Message:
There are still zombie threads that couldn't be terminated:    1) Thread[id=4042, name=Thread-680, state=WAITING, group=TGRP-BasicZkTest]         at java.lang.Object.wait(Native Method)         at java.lang.Object.wait(Object.java:502)         at org.apache.solr.core.CloserThread.run(CoreContainer.java:1854)    2) Thread[id=4040, name=MetricsHistoryHandler-1950-thread-1, state=WAITING, group=TGRP-BasicZkTest]         at sun.misc.Unsafe.park(Native Method)         at java.util.concurrent.locks.LockSupport.park(LockSupport.java:175)         at java.util.concurrent.locks.AbstractQueuedSynchronizer$ConditionObject.await(AbstractQueuedSynchronizer.java:2039)         at java.util.concurrent.ScheduledThreadPoolExecutor$DelayedWorkQueue.take(ScheduledThreadPoolExecutor.java:1081)         at java.util.concurrent.ScheduledThreadPoolExecutor$DelayedWorkQueue.take(ScheduledThreadPoolExecutor.java:809)         at java.util.concurrent.ThreadPoolExecutor.getTask(ThreadPoolExecutor.java:1074)         at java.util.concurrent.ThreadPoolExecutor.runWorker(ThreadPoolExecutor.java:1134)         at java.util.concurrent.ThreadPoolExecutor$Worker.run(ThreadPoolExecutor.java:624)         at java.lang.Thread.run(Thread.java:748)    3) Thread[id=4028, name=SUITE-BasicZkTest-seed#[45B66A5FF1C81659]-worker-SendThread(127.0.0.1:33595), state=TIMED_WAITING, group=TGRP-BasicZkTest]         at java.lang.Thread.sleep(Native Method)         at org.apache.zookeeper.client.StaticHostProvider.next(StaticHostProvider.java:105)         at org.apache.zookeeper.ClientCnxn$SendThread.startConnect(ClientCnxn.java:1000)         at org.apache.zookeeper.ClientCnxn$SendThread.run(ClientCnxn.java:1063)    4) Thread[id=4035, name=ScheduledTrigger-1945-thread-1, state=WAITING, group=TGRP-BasicZkTest]         at sun.misc.Unsafe.park(Native Method)         at java.util.concurrent.locks.LockSupport.park(LockSupport.java:175)         at java.util.concurrent.locks.AbstractQueuedSynchronizer$ConditionObject.await(AbstractQueuedSynchronizer.java:2039)         at java.util.concurrent.ScheduledThreadPoolExecutor$DelayedWorkQueue.take(ScheduledThreadPoolExecutor.java:1088)         at java.util.concurrent.ScheduledThreadPoolExecutor$DelayedWorkQueue.take(ScheduledThreadPoolExecutor.java:809)         at java.util.concurrent.ThreadPoolExecutor.getTask(ThreadPoolExecutor.java:1074)         at java.util.concurrent.ThreadPoolExecutor.runWorker(ThreadPoolExecutor.java:1134)         at java.util.concurrent.ThreadPoolExecutor$Worker.run(ThreadPoolExecutor.java:624)         at java.lang.Thread.run(Thread.java:748)    5) Thread[id=4062, name=SolrRrdBackendFactory-1949-thread-2, state=WAITING, group=TGRP-BasicZkTest]         at sun.misc.Unsafe.park(Native Method)         at java.util.concurrent.locks.LockSupport.park(LockSupport.java:175)         at java.util.concurrent.locks.AbstractQueuedSynchronizer$ConditionObject.await(AbstractQueuedSynchronizer.java:2039)         at java.util.concurrent.ScheduledThreadPoolExecutor$DelayedWorkQueue.take(ScheduledThreadPoolExecutor.java:1088)         at java.util.concurrent.ScheduledThreadPoolExecutor$DelayedWorkQueue.take(ScheduledThreadPoolExecutor.java:809)         at java.util.concurrent.ThreadPoolExecutor.getTask(ThreadPoolExecutor.java:1074)         at java.util.concurrent.ThreadPoolExecutor.runWorker(ThreadPoolExecutor.java:1134)         at java.util.concurrent.ThreadPoolExecutor$Worker.run(ThreadPoolExecutor.java:624)         at java.lang.Thread.run(Thread.java:748)    6) Thread[id=4037, name=ScheduledTrigger-1945-thread-3, state=WAITING, group=TGRP-BasicZkTest]         at sun.misc.Unsafe.park(Native Method)         at java.util.concurrent.locks.LockSupport.park(LockSupport.java:175)         at java.util.concurrent.locks.AbstractQueuedSynchronizer$ConditionObject.await(AbstractQueuedSynchronizer.java:2039)         at java.util.concurrent.ScheduledThreadPoolExecutor$DelayedWorkQueue.take(ScheduledThreadPoolExecutor.java:1088)         at java.util.concurrent.ScheduledThreadPoolExecutor$DelayedWorkQueue.take(ScheduledThreadPoolExecutor.java:809)         at java.util.concurrent.ThreadPoolExecutor.getTask(ThreadPoolExecutor.java:1074)         at java.util.concurrent.ThreadPoolExecutor.runWorker(ThreadPoolExecutor.java:1134)         at java.util.concurrent.ThreadPoolExecutor$Worker.run(ThreadPoolExecutor.java:624)         at java.lang.Thread.run(Thread.java:748)    7) Thread[id=4030, name=zkConnectionManagerCallback-992-thread-1, state=WAITING, group=TGRP-BasicZkTest]         at sun.misc.Unsafe.park(Native Method)         at java.util.concurrent.locks.LockSupport.park(LockSupport.java:175)         at java.util.concurrent.locks.AbstractQueuedSynchronizer$ConditionObject.await(AbstractQueuedSynchronizer.java:2039)         at java.util.concurrent.LinkedBlockingQueue.take(LinkedBlockingQueue.java:442)         at java.util.concurrent.ThreadPoolExecutor.getTask(ThreadPoolExecutor.java:1074)         at java.util.concurrent.ThreadPoolExecutor.runWorker(ThreadPoolExecutor.java:1134)         at java.util.concurrent.ThreadPoolExecutor$Worker.run(ThreadPoolExecutor.java:624)         at java.lang.Thread.run(Thread.java:748)    8) Thread[id=4038, name=ScheduledTrigger-1945-thread-4, state=WAITING, group=TGRP-BasicZkTest]         at sun.misc.Unsafe.park(Native Method)         at java.util.concurrent.locks.LockSupport.park(LockSupport.java:175)         at java.util.concurrent.locks.AbstractQueuedSynchronizer$ConditionObject.await(AbstractQueuedSynchronizer.java:2039)         at java.util.concurrent.ScheduledThreadPoolExecutor$DelayedWorkQueue.take(ScheduledThreadPoolExecutor.java:1088)         at java.util.concurrent.ScheduledThreadPoolExecutor$DelayedWorkQueue.take(ScheduledThreadPoolExecutor.java:809)         at java.util.concurrent.ThreadPoolExecutor.getTask(ThreadPoolExecutor.java:1074)         at java.util.concurrent.ThreadPoolExecutor.runWorker(ThreadPoolExecutor.java:1134)         at java.util.concurrent.ThreadPoolExecutor$Worker.run(ThreadPoolExecutor.java:624)         at java.lang.Thread.run(Thread.java:748)    9) Thread[id=4025, name=zkConnectionManagerCallback-985-thread-1, state=WAITING, group=TGRP-BasicZkTest]         at sun.misc.Unsafe.park(Native Method)         at java.util.concurrent.locks.LockSupport.park(LockSupport.java:175)         at java.util.concurrent.locks.AbstractQueuedSynchronizer$ConditionObject.await(AbstractQueuedSynchronizer.java:2039)         at java.util.concurrent.LinkedBlockingQueue.take(LinkedBlockingQueue.java:442)         at java.util.concurrent.ThreadPoolExecutor.getTask(ThreadPoolExecutor.java:1074)         at java.util.concurrent.ThreadPoolExecutor.runWorker(ThreadPoolExecutor.java:1134)         at java.util.concurrent.ThreadPoolExecutor$Worker.run(ThreadPoolExecutor.java:624)         at java.lang.Thread.run(Thread.java:748)   10) Thread[id=4039, name=SolrRrdBackendFactory-1949-thread-1, state=TIMED_WAITING, group=TGRP-BasicZkTest]         at sun.misc.Unsafe.park(Native Method)         at java.util.concurrent.locks.LockSupport.parkNanos(LockSupport.java:215)         at java.util.concurrent.locks.AbstractQueuedSynchronizer$ConditionObject.awaitNanos(AbstractQueuedSynchronizer.java:2078)         at java.util.concurrent.ScheduledThreadPoolExecutor$DelayedWorkQueue.take(ScheduledThreadPoolExecutor.java:1093)         at java.util.concurrent.ScheduledThreadPoolExecutor$DelayedWorkQueue.take(ScheduledThreadPoolExecutor.java:809)         at java.util.concurrent.ThreadPoolExecutor.getTask(ThreadPoolExecutor.java:1074)         at java.util.concurrent.ThreadPoolExecutor.runWorker(ThreadPoolExecutor.java:1134)         at java.util.concurrent.ThreadPoolExecutor$Worker.run(ThreadPoolExecutor.java:624)         at java.lang.Thread.run(Thread.java:748)   11) Thread[id=4023, name=SUITE-BasicZkTest-seed#[45B66A5FF1C81659]-worker-SendThread(127.0.0.1:33595), state=TIMED_WAITING, group=TGRP-BasicZkTest]         at java.lang.Thread.sleep(Native Method)         at org.apache.zookeeper.client.StaticHostProvider.next(StaticHostProvider.java:105)         at org.apache.zookeeper.ClientCnxn$SendThread.startConnect(ClientCnxn.java:1000)         at org.apache.zookeeper.ClientCnxn$SendThread.run(ClientCnxn.java:1063)   12) Thread[id=4036, name=ScheduledTrigger-1945-thread-2, state=TIMED_WAITING, group=TGRP-BasicZkTest]         at sun.misc.Unsafe.park(Native Method)         at java.util.concurrent.locks.LockSupport.parkNanos(LockSupport.java:215)         at java.util.concurrent.locks.AbstractQueuedSynchronizer$ConditionObject.awaitNanos(AbstractQueuedSynchronizer.java:2078)         at java.util.concurrent.ScheduledThreadPoolExecutor$DelayedWorkQueue.take(ScheduledThreadPoolExecutor.java:1093)         at java.util.concurrent.ScheduledThreadPoolExecutor$DelayedWorkQueue.take(ScheduledThreadPoolExecutor.java:809)         at java.util.concurrent.ThreadPoolExecutor.getTask(ThreadPoolExecutor.java:1074)         at java.util.concurrent.ThreadPoolExecutor.runWorker(ThreadPoolExecutor.java:1134)         at java.util.concurrent.ThreadPoolExecutor$Worker.run(ThreadPoolExecutor.java:624)         at java.lang.Thread.run(Thread.java:748)   13) Thread[id=4045, name=searcherExecutor-1952-thread-1, state=WAITING, group=TGRP-BasicZkTest]         at sun.misc.Unsafe.park(Native Method)         at java.util.concurrent.locks.LockSupport.park(LockSupport.java:175)         at java.util.concurrent.locks.AbstractQueuedSynchronizer$ConditionObject.await(AbstractQueuedSynchronizer.java:2039)         at java.util.concurrent.LinkedBlockingQueue.take(LinkedBlockingQueue.java:442)         at java.util.concurrent.ThreadPoolExecutor.getTask(ThreadPoolExecutor.java:1074)         at java.util.concurrent.ThreadPoolExecutor.runWorker(ThreadPoolExecutor.java:1134)         at java.util.concurrent.ThreadPoolExecutor$Worker.run(ThreadPoolExecutor.java:624)         at java.lang.Thread.run(Thread.java:748)

Stack Trace:
com.carrotsearch.randomizedtesting.ThreadLeakError: There are still zombie threads that couldn't be terminated:
   1) Thread[id=4042, name=Thread-680, state=WAITING, group=TGRP-BasicZkTest]
        at java.lang.Object.wait(Native Method)
        at java.lang.Object.wait(Object.java:502)
        at org.apache.solr.core.CloserThread.run(CoreContainer.java:1854)
   2) Thread[id=4040, name=MetricsHistoryHandler-1950-thread-1, state=WAITING, group=TGRP-BasicZkTest]
        at sun.misc.Unsafe.park(Native Method)
        at java.util.concurrent.locks.LockSupport.park(LockSupport.java:175)
        at java.util.concurrent.locks.AbstractQueuedSynchronizer$ConditionObject.await(AbstractQueuedSynchronizer.java:2039)
        at java.util.concurrent.ScheduledThreadPoolExecutor$DelayedWorkQueue.take(ScheduledThreadPoolExecutor.java:1081)
        at java.util.concurrent.ScheduledThreadPoolExecutor$DelayedWorkQueue.take(ScheduledThreadPoolExecutor.java:809)
        at java.util.concurrent.ThreadPoolExecutor.getTask(ThreadPoolExecutor.java:1074)
        at java.util.concurrent.ThreadPoolExecutor.runWorker(ThreadPoolExecutor.java:1134)
        at java.util.concurrent.ThreadPoolExecutor$Worker.run(ThreadPoolExecutor.java:624)
        at java.lang.Thread.run(Thread.java:748)
   3) Thread[id=4028, name=SUITE-BasicZkTest-seed#[45B66A5FF1C81659]-worker-SendThread(127.0.0.1:33595), state=TIMED_WAITING, group=TGRP-BasicZkTest]
        at java.lang.Thread.sleep(Native Method)
        at org.apache.zookeeper.client.StaticHostProvider.next(StaticHostProvider.java:105)
        at org.apache.zookeeper.ClientCnxn$SendThread.startConnect(ClientCnxn.java:1000)
        at org.apache.zookeeper.ClientCnxn$SendThread.run(ClientCnxn.java:1063)
   4) Thread[id=4035, name=ScheduledTrigger-1945-thread-1, state=WAITING, group=TGRP-BasicZkTest]
        at sun.misc.Unsafe.park(Native Method)
        at java.util.concurrent.locks.LockSupport.park(LockSupport.java:175)
        at java.util.concurrent.locks.AbstractQueuedSynchronizer$ConditionObject.await(AbstractQueuedSynchronizer.java:2039)
        at java.util.concurrent.ScheduledThreadPoolExecutor$DelayedWorkQueue.take(ScheduledThreadPoolExecutor.java:1088)
        at java.util.concurrent.ScheduledThreadPoolExecutor$DelayedWorkQueue.take(ScheduledThreadPoolExecutor.java:809)
        at java.util.concurrent.ThreadPoolExecutor.getTask(ThreadPoolExecutor.java:1074)
        at java.util.concurrent.ThreadPoolExecutor.runWorker(ThreadPoolExecutor.java:1134)
        at java.util.concurrent.ThreadPoolExecutor$Worker.run(ThreadPoolExecutor.java:624)
        at java.lang.Thread.run(Thread.java:748)
   5) Thread[id=4062, name=SolrRrdBackendFactory-1949-thread-2, state=WAITING, group=TGRP-BasicZkTest]
        at sun.misc.Unsafe.park(Native Method)
        at java.util.concurrent.locks.LockSupport.park(LockSupport.java:175)
        at java.util.concurrent.locks.AbstractQueuedSynchronizer$ConditionObject.await(AbstractQueuedSynchronizer.java:2039)
        at java.util.concurrent.ScheduledThreadPoolExecutor$DelayedWorkQueue.take(ScheduledThreadPoolExecutor.java:1088)
        at java.util.concurrent.ScheduledThreadPoolExecutor$DelayedWorkQueue.take(ScheduledThreadPoolExecutor.java:809)
        at java.util.concurrent.ThreadPoolExecutor.getTask(ThreadPoolExecutor.java:1074)
        at java.util.concurrent.ThreadPoolExecutor.runWorker(ThreadPoolExecutor.java:1134)
        at java.util.concurrent.ThreadPoolExecutor$Worker.run(ThreadPoolExecutor.java:624)
        at java.lang.Thread.run(Thread.java:748)
   6) Thread[id=4037, name=ScheduledTrigger-1945-thread-3, state=WAITING, group=TGRP-BasicZkTest]
        at sun.misc.Unsafe.park(Native Method)
        at java.util.concurrent.locks.LockSupport.park(LockSupport.java:175)
        at java.util.concurrent.locks.AbstractQueuedSynchronizer$ConditionObject.await(AbstractQueuedSynchronizer.java:2039)
        at java.util.concurrent.ScheduledThreadPoolExecutor$DelayedWorkQueue.take(ScheduledThreadPoolExecutor.java:1088)
        at java.util.concurrent.ScheduledThreadPoolExecutor$DelayedWorkQueue.take(ScheduledThreadPoolExecutor.java:809)
        at java.util.concurrent.ThreadPoolExecutor.getTask(ThreadPoolExecutor.java:1074)
        at java.util.concurrent.ThreadPoolExecutor.runWorker(ThreadPoolExecutor.java:1134)
        at java.util.concurrent.ThreadPoolExecutor$Worker.run(ThreadPoolExecutor.java:624)
        at java.lang.Thread.run(Thread.java:748)
   7) Thread[id=4030, name=zkConnectionManagerCallback-992-thread-1, state=WAITING, group=TGRP-BasicZkTest]
        at sun.misc.Unsafe.park(Native Method)
        at java.util.concurrent.locks.LockSupport.park(LockSupport.java:175)
        at java.util.concurrent.locks.AbstractQueuedSynchronizer$ConditionObject.await(AbstractQueuedSynchronizer.java:2039)
        at java.util.concurrent.LinkedBlockingQueue.take(LinkedBlockingQueue.java:442)
        at java.util.concurrent.ThreadPoolExecutor.getTask(ThreadPoolExecutor.java:1074)
        at java.util.concurrent.ThreadPoolExecutor.runWorker(ThreadPoolExecutor.java:1134)
        at java.util.concurrent.ThreadPoolExecutor$Worker.run(ThreadPoolExecutor.java:624)
        at java.lang.Thread.run(Thread.java:748)
   8) Thread[id=4038, name=ScheduledTrigger-1945-thread-4, state=WAITING, group=TGRP-BasicZkTest]
        at sun.misc.Unsafe.park(Native Method)
        at java.util.concurrent.locks.LockSupport.park(LockSupport.java:175)
        at java.util.concurrent.locks.AbstractQueuedSynchronizer$ConditionObject.await(AbstractQueuedSynchronizer.java:2039)
        at java.util.concurrent.ScheduledThreadPoolExecutor$DelayedWorkQueue.take(ScheduledThreadPoolExecutor.java:1088)
        at java.util.concurrent.ScheduledThreadPoolExecutor$DelayedWorkQueue.take(ScheduledThreadPoolExecutor.java:809)
        at java.util.concurrent.ThreadPoolExecutor.getTask(ThreadPoolExecutor.java:1074)
        at java.util.concurrent.ThreadPoolExecutor.runWorker(ThreadPoolExecutor.java:1134)
        at java.util.concurrent.ThreadPoolExecutor$Worker.run(ThreadPoolExecutor.java:624)
        at java.lang.Thread.run(Thread.java:748)
   9) Thread[id=4025, name=zkConnectionManagerCallback-985-thread-1, state=WAITING, group=TGRP-BasicZkTest]
        at sun.misc.Unsafe.park(Native Method)
        at java.util.concurrent.locks.LockSupport.park(LockSupport.java:175)
        at java.util.concurrent.locks.AbstractQueuedSynchronizer$ConditionObject.await(AbstractQueuedSynchronizer.java:2039)
        at java.util.concurrent.LinkedBlockingQueue.take(LinkedBlockingQueue.java:442)
        at java.util.concurrent.ThreadPoolExecutor.getTask(ThreadPoolExecutor.java:1074)
        at java.util.concurrent.ThreadPoolExecutor.runWorker(ThreadPoolExecutor.java:1134)
        at java.util.concurrent.ThreadPoolExecutor$Worker.run(ThreadPoolExecutor.java:624)
        at java.lang.Thread.run(Thread.java:748)
  10) Thread[id=4039, name=SolrRrdBackendFactory-1949-thread-1, state=TIMED_WAITING, group=TGRP-BasicZkTest]
        at sun.misc.Unsafe.park(Native Method)
        at java.util.concurrent.locks.LockSupport.parkNanos(LockSupport.java:215)
        at java.util.concurrent.locks.AbstractQueuedSynchronizer$ConditionObject.awaitNanos(AbstractQueuedSynchronizer.java:2078)
        at java.util.concurrent.ScheduledThreadPoolExecutor$DelayedWorkQueue.take(ScheduledThreadPoolExecutor.java:1093)
        at java.util.concurrent.ScheduledThreadPoolExecutor$DelayedWorkQueue.take(ScheduledThreadPoolExecutor.java:809)
        at java.util.concurrent.ThreadPoolExecutor.getTask(ThreadPoolExecutor.java:1074)
        at java.util.concurrent.ThreadPoolExecutor.runWorker(ThreadPoolExecutor.java:1134)
        at java.util.concurrent.ThreadPoolExecutor$Worker.run(ThreadPoolExecutor.java:624)
        at java.lang.Thread.run(Thread.java:748)
  11) Thread[id=4023, name=SUITE-BasicZkTest-seed#[45B66A5FF1C81659]-worker-SendThread(127.0.0.1:33595), state=TIMED_WAITING, group=TGRP-BasicZkTest]
        at java.lang.Thread.sleep(Native Method)
        at org.apache.zookeeper.client.StaticHostProvider.next(StaticHostProvider.java:105)
        at org.apache.zookeeper.ClientCnxn$SendThread.startConnect(ClientCnxn.java:1000)
        at org.apache.zookeeper.ClientCnxn$SendThread.run(ClientCnxn.java:1063)
  12) Thread[id=4036, name=ScheduledTrigger-1945-thread-2, state=TIMED_WAITING, group=TGRP-BasicZkTest]
        at sun.misc.Unsafe.park(Native Method)
        at java.util.concurrent.locks.LockSupport.parkNanos(LockSupport.java:215)
        at java.util.concurrent.locks.AbstractQueuedSynchronizer$ConditionObject.awaitNanos(AbstractQueuedSynchronizer.java:2078)
        at java.util.concurrent.ScheduledThreadPoolExecutor$DelayedWorkQueue.take(ScheduledThreadPoolExecutor.java:1093)
        at java.util.concurrent.ScheduledThreadPoolExecutor$DelayedWorkQueue.take(ScheduledThreadPoolExecutor.java:809)
        at java.util.concurrent.ThreadPoolExecutor.getTask(ThreadPoolExecutor.java:1074)
        at java.util.concurrent.ThreadPoolExecutor.runWorker(ThreadPoolExecutor.java:1134)
        at java.util.concurrent.ThreadPoolExecutor$Worker.run(ThreadPoolExecutor.java:624)
        at java.lang.Thread.run(Thread.java:748)
  13) Thread[id=4045, name=searcherExecutor-1952-thread-1, state=WAITING, group=TGRP-BasicZkTest]
        at sun.misc.Unsafe.park(Native Method)
        at java.util.concurrent.locks.LockSupport.park(LockSupport.java:175)
        at java.util.concurrent.locks.AbstractQueuedSynchronizer$ConditionObject.await(AbstractQueuedSynchronizer.java:2039)
        at java.util.concurrent.LinkedBlockingQueue.take(LinkedBlockingQueue.java:442)
        at java.util.concurrent.ThreadPoolExecutor.getTask(ThreadPoolExecutor.java:1074)
        at java.util.concurrent.ThreadPoolExecutor.runWorker(ThreadPoolExecutor.java:1134)
        at java.util.concurrent.ThreadPoolExecutor$Worker.run(ThreadPoolExecutor.java:624)
        at java.lang.Thread.run(Thread.java:748)
	at __randomizedtesting.SeedInfo.seed([45B66A5FF1C81659]:0)




Build Log:
[...truncated 12755 lines...]
   [junit4] Suite: org.apache.solr.cloud.BasicZkTest
   [junit4]   2> 419753 INFO  (SUITE-BasicZkTest-seed#[45B66A5FF1C81659]-worker) [    ] o.a.s.SolrTestCaseJ4 SecureRandom sanity checks: test.solr.allowed.securerandom=null & java.security.egd=file:/dev/./urandom
   [junit4]   2> Creating dataDir: /home/jenkins/workspace/Lucene-Solr-master-Linux/solr/build/solr-core/test/J2/temp/solr.cloud.BasicZkTest_45B66A5FF1C81659-001/init-core-data-001
   [junit4]   2> 419753 INFO  (SUITE-BasicZkTest-seed#[45B66A5FF1C81659]-worker) [    ] o.a.s.SolrTestCaseJ4 Using PointFields (NUMERIC_POINTS_SYSPROP=true) w/NUMERIC_DOCVALUES_SYSPROP=true
   [junit4]   2> 419755 INFO  (SUITE-BasicZkTest-seed#[45B66A5FF1C81659]-worker) [    ] o.a.s.SolrTestCaseJ4 Randomized ssl (false) and clientAuth (true) via: @org.apache.solr.util.RandomizeSSL(reason=, ssl=NaN, value=NaN, clientAuth=NaN)
   [junit4]   2> 419755 INFO  (SUITE-BasicZkTest-seed#[45B66A5FF1C81659]-worker) [    ] o.a.s.c.ZkTestServer STARTING ZK TEST SERVER
   [junit4]   2> 419755 INFO  (Thread-679) [    ] o.a.s.c.ZkTestServer client port:0.0.0.0/0.0.0.0:0
   [junit4]   2> 419755 INFO  (Thread-679) [    ] o.a.s.c.ZkTestServer Starting server
   [junit4]   2> 419756 ERROR (Thread-679) [    ] o.a.z.s.ZooKeeperServer ZKShutdownHandler is not registered, so ZooKeeper server won't take any action on ERROR or SHUTDOWN server state changes
   [junit4]   2> 419855 INFO  (SUITE-BasicZkTest-seed#[45B66A5FF1C81659]-worker) [    ] o.a.s.c.ZkTestServer start zk server on port:33595
   [junit4]   2> 419857 INFO  (zkConnectionManagerCallback-977-thread-1) [    ] o.a.s.c.c.ConnectionManager zkClient has connected
   [junit4]   2> 419860 INFO  (zkConnectionManagerCallback-979-thread-1) [    ] o.a.s.c.c.ConnectionManager zkClient has connected
   [junit4]   2> 419863 INFO  (SUITE-BasicZkTest-seed#[45B66A5FF1C81659]-worker) [    ] o.a.s.c.AbstractZkTestCase put /home/jenkins/workspace/Lucene-Solr-master-Linux/solr/core/src/test-files/solr/collection1/conf/solrconfig.xml to /configs/conf1/solrconfig.xml
   [junit4]   2> 419879 INFO  (SUITE-BasicZkTest-seed#[45B66A5FF1C81659]-worker) [    ] o.a.s.c.AbstractZkTestCase put /home/jenkins/workspace/Lucene-Solr-master-Linux/solr/core/src/test-files/solr/collection1/conf/schema.xml to /configs/conf1/schema.xml
   [junit4]   2> 419880 INFO  (SUITE-BasicZkTest-seed#[45B66A5FF1C81659]-worker) [    ] o.a.s.c.AbstractZkTestCase put /home/jenkins/workspace/Lucene-Solr-master-Linux/solr/core/src/test-files/solr/collection1/conf/solrconfig.snippet.randomindexconfig.xml to /configs/conf1/solrconfig.snippet.randomindexconfig.xml
   [junit4]   2> 419881 INFO  (SUITE-BasicZkTest-seed#[45B66A5FF1C81659]-worker) [    ] o.a.s.c.AbstractZkTestCase put /home/jenkins/workspace/Lucene-Solr-master-Linux/solr/core/src/test-files/solr/collection1/conf/stopwords.txt to /configs/conf1/stopwords.txt
   [junit4]   2> 419881 INFO  (SUITE-BasicZkTest-seed#[45B66A5FF1C81659]-worker) [    ] o.a.s.c.AbstractZkTestCase put /home/jenkins/workspace/Lucene-Solr-master-Linux/solr/core/src/test-files/solr/collection1/conf/protwords.txt to /configs/conf1/protwords.txt
   [junit4]   2> 419882 INFO  (SUITE-BasicZkTest-seed#[45B66A5FF1C81659]-worker) [    ] o.a.s.c.AbstractZkTestCase put /home/jenkins/workspace/Lucene-Solr-master-Linux/solr/core/src/test-files/solr/collection1/conf/currency.xml to /configs/conf1/currency.xml
   [junit4]   2> 419883 INFO  (SUITE-BasicZkTest-seed#[45B66A5FF1C81659]-worker) [    ] o.a.s.c.AbstractZkTestCase put /home/jenkins/workspace/Lucene-Solr-master-Linux/solr/core/src/test-files/solr/collection1/conf/enumsConfig.xml to /configs/conf1/enumsConfig.xml
   [junit4]   2> 419884 INFO  (SUITE-BasicZkTest-seed#[45B66A5FF1C81659]-worker) [    ] o.a.s.c.AbstractZkTestCase put /home/jenkins/workspace/Lucene-Solr-master-Linux/solr/core/src/test-files/solr/collection1/conf/open-exchange-rates.json to /configs/conf1/open-exchange-rates.json
   [junit4]   2> 419884 INFO  (SUITE-BasicZkTest-seed#[45B66A5FF1C81659]-worker) [    ] o.a.s.c.AbstractZkTestCase put /home/jenkins/workspace/Lucene-Solr-master-Linux/solr/core/src/test-files/solr/collection1/conf/mapping-ISOLatin1Accent.txt to /configs/conf1/mapping-ISOLatin1Accent.txt
   [junit4]   2> 419885 INFO  (SUITE-BasicZkTest-seed#[45B66A5FF1C81659]-worker) [    ] o.a.s.c.AbstractZkTestCase put /home/jenkins/workspace/Lucene-Solr-master-Linux/solr/core/src/test-files/solr/collection1/conf/old_synonyms.txt to /configs/conf1/old_synonyms.txt
   [junit4]   2> 419886 INFO  (SUITE-BasicZkTest-seed#[45B66A5FF1C81659]-worker) [    ] o.a.s.c.AbstractZkTestCase put /home/jenkins/workspace/Lucene-Solr-master-Linux/solr/core/src/test-files/solr/collection1/conf/synonyms.txt to /configs/conf1/synonyms.txt
   [junit4]   2> 419887 INFO  (SUITE-BasicZkTest-seed#[45B66A5FF1C81659]-worker) [    ] o.a.s.SolrTestCaseJ4 ####initCore
   [junit4]   2> 419887 INFO  (SUITE-BasicZkTest-seed#[45B66A5FF1C81659]-worker) [    ] o.a.s.c.SolrResourceLoader [null] Added 2 libs to classloader, from paths: [/home/jenkins/workspace/Lucene-Solr-master-Linux/solr/core/src/test-files/solr/collection1/lib, /home/jenkins/workspace/Lucene-Solr-master-Linux/solr/core/src/test-files/solr/collection1/lib/classes]
   [junit4]   2> 419908 INFO  (SUITE-BasicZkTest-seed#[45B66A5FF1C81659]-worker) [    ] o.a.s.c.SolrConfig Using Lucene MatchVersion: 8.0.0
   [junit4]   2> 419921 INFO  (SUITE-BasicZkTest-seed#[45B66A5FF1C81659]-worker) [    ] o.a.s.s.IndexSchema [null] Schema name=test
   [junit4]   2> 419993 INFO  (SUITE-BasicZkTest-seed#[45B66A5FF1C81659]-worker) [    ] o.a.s.s.IndexSchema Loaded schema test/1.0 with uniqueid field id
   [junit4]   2> 420054 INFO  (SUITE-BasicZkTest-seed#[45B66A5FF1C81659]-worker) [    ] o.a.s.c.ZkContainer Zookeeper client=127.0.0.1:33595/solr
   [junit4]   2> 420055 INFO  (zkConnectionManagerCallback-983-thread-1) [    ] o.a.s.c.c.ConnectionManager zkClient has connected
   [junit4]   2> 420058 INFO  (zkConnectionManagerCallback-985-thread-1) [    ] o.a.s.c.c.ConnectionManager zkClient has connected
   [junit4]   2> 420107 INFO  (SUITE-BasicZkTest-seed#[45B66A5FF1C81659]-worker) [n:88.99.242.108:8983_    ] o.a.s.c.OverseerElectionContext I am going to be the leader 88.99.242.108:8983_
   [junit4]   2> 420107 INFO  (SUITE-BasicZkTest-seed#[45B66A5FF1C81659]-worker) [n:88.99.242.108:8983_    ] o.a.s.c.Overseer Overseer (id=72120053600813059-88.99.242.108:8983_-n_0000000000) starting
   [junit4]   2> 420112 INFO  (zkConnectionManagerCallback-992-thread-1) [    ] o.a.s.c.c.ConnectionManager zkClient has connected
   [junit4]   2> 420113 INFO  (SUITE-BasicZkTest-seed#[45B66A5FF1C81659]-worker) [n:88.99.242.108:8983_    ] o.a.s.c.s.i.ZkClientClusterStateProvider Cluster at 127.0.0.1:33595/solr ready
   [junit4]   2> 420114 INFO  (OverseerStateUpdate-72120053600813059-88.99.242.108:8983_-n_0000000000) [    ] o.a.s.c.Overseer Starting to work on the main queue : 88.99.242.108:8983_
   [junit4]   2> 420117 INFO  (SUITE-BasicZkTest-seed#[45B66A5FF1C81659]-worker) [n:88.99.242.108:8983_    ] o.a.s.c.ZkController Register node as live in ZooKeeper:/live_nodes/88.99.242.108:8983_
   [junit4]   2> 420121 INFO  (zkCallback-991-thread-1) [    ] o.a.s.c.c.ZkStateReader Updated live nodes from ZooKeeper... (0) -> (1)
   [junit4]   2> 420121 INFO  (zkCallback-984-thread-1) [    ] o.a.s.c.c.ZkStateReader Updated live nodes from ZooKeeper... (0) -> (1)
   [junit4]   2> 420133 INFO  (SUITE-BasicZkTest-seed#[45B66A5FF1C81659]-worker) [n:88.99.242.108:8983_    ] o.a.s.h.a.MetricsHistoryHandler No .system collection, keeping metrics history in memory.
   [junit4]   2> 420148 INFO  (SUITE-BasicZkTest-seed#[45B66A5FF1C81659]-worker) [n:88.99.242.108:8983_    ] o.a.s.m.r.SolrJmxReporter JMX monitoring for 'solr.node' (registry 'solr.node') enabled at server: com.sun.jmx.mbeanserver.JmxMBeanServer@3e83c213
   [junit4]   2> 420155 INFO  (SUITE-BasicZkTest-seed#[45B66A5FF1C81659]-worker) [n:88.99.242.108:8983_    ] o.a.s.m.r.SolrJmxReporter JMX monitoring for 'solr.jvm' (registry 'solr.jvm') enabled at server: com.sun.jmx.mbeanserver.JmxMBeanServer@3e83c213
   [junit4]   2> 420155 INFO  (SUITE-BasicZkTest-seed#[45B66A5FF1C81659]-worker) [n:88.99.242.108:8983_    ] o.a.s.m.r.SolrJmxReporter JMX monitoring for 'solr.jetty' (registry 'solr.jetty') enabled at server: com.sun.jmx.mbeanserver.JmxMBeanServer@3e83c213
   [junit4]   2> 420157 INFO  (coreLoadExecutor-1951-thread-1-processing-n:88.99.242.108:8983_) [n:88.99.242.108:8983_    ] o.a.s.c.TransientSolrCoreCacheDefault Allocating transient cache for 2147483647 transient cores
   [junit4]   2> 421160 INFO  (coreLoadExecutor-1951-thread-1-processing-n:88.99.242.108:8983_) [n:88.99.242.108:8983_ c:collection1 s:shard1  x:collection1] o.a.s.c.SolrResourceLoader [null] Added 2 libs to classloader, from paths: [/home/jenkins/workspace/Lucene-Solr-master-Linux/solr/core/src/test-files/solr/collection1/lib, /home/jenkins/workspace/Lucene-Solr-master-Linux/solr/core/src/test-files/solr/collection1/lib/classes]
   [junit4]   2> 421177 INFO  (coreLoadExecutor-1951-thread-1-processing-n:88.99.242.108:8983_) [n:88.99.242.108:8983_ c:collection1 s:shard1  x:collection1] o.a.s.c.SolrConfig Using Lucene MatchVersion: 8.0.0
   [junit4]   2> 421190 INFO  (coreLoadExecutor-1951-thread-1-processing-n:88.99.242.108:8983_) [n:88.99.242.108:8983_ c:collection1 s:shard1  x:collection1] o.a.s.s.IndexSchema [collection1] Schema name=test
   [junit4]   2> 421251 INFO  (coreLoadExecutor-1951-thread-1-processing-n:88.99.242.108:8983_) [n:88.99.242.108:8983_ c:collection1 s:shard1  x:collection1] o.a.s.s.IndexSchema Loaded schema test/1.0 with uniqueid field id
   [junit4]   2> 421270 INFO  (coreLoadExecutor-1951-thread-1-processing-n:88.99.242.108:8983_) [n:88.99.242.108:8983_ c:collection1 s:shard1  x:collection1] o.a.s.c.CoreContainer Creating SolrCore 'collection1' using configuration from collection collection1, trusted=true
   [junit4]   2> 421270 INFO  (coreLoadExecutor-1951-thread-1-processing-n:88.99.242.108:8983_) [n:88.99.242.108:8983_ c:collection1 s:shard1  x:collection1] o.a.s.m.r.SolrJmxReporter JMX monitoring for 'solr.core.collection1.shard1.88.99.242.108:8983__collection1' (registry 'solr.core.collection1.shard1.88.99.242.108:8983__collection1') enabled at server: com.sun.jmx.mbeanserver.JmxMBeanServer@3e83c213
   [junit4]   2> 421270 INFO  (coreLoadExecutor-1951-thread-1-processing-n:88.99.242.108:8983_) [n:88.99.242.108:8983_ c:collection1 s:shard1  x:collection1] o.a.s.c.SolrCore solr.RecoveryStrategy.Builder
   [junit4]   2> 421270 INFO  (coreLoadExecutor-1951-thread-1-processing-n:88.99.242.108:8983_) [n:88.99.242.108:8983_ c:collection1 s:shard1  x:collection1] o.a.s.c.SolrCore [[collection1] ] Opening new SolrCore at [/home/jenkins/workspace/Lucene-Solr-master-Linux/solr/core/src/test-files/solr/collection1], dataDir=[/home/jenkins/workspace/Lucene-Solr-master-Linux/solr/build/solr-core/test/J2/temp/solr.cloud.BasicZkTest_45B66A5FF1C81659-001/init-core-data-001/]
   [junit4]   2> 421272 INFO  (coreLoadExecutor-1951-thread-1-processing-n:88.99.242.108:8983_) [n:88.99.242.108:8983_ c:collection1 s:shard1  x:collection1] o.a.s.u.RandomMergePolicy RandomMergePolicy wrapping class org.apache.lucene.index.TieredMergePolicy: [TieredMergePolicy: maxMergeAtOnce=50, maxMergeAtOnceExplicit=11, maxMergedSegmentMB=42.73828125, floorSegmentMB=0.96484375, forceMergeDeletesPctAllowed=3.6328365105256513, segmentsPerTier=18.0, maxCFSSegmentSizeMB=8.796093022207999E12, noCFSRatio=0.0, deletesPctAllowed=31.445197028495876
   [junit4]   2> 421316 INFO  (coreLoadExecutor-1951-thread-1-processing-n:88.99.242.108:8983_) [n:88.99.242.108:8983_ c:collection1 s:shard1  x:collection1] o.a.s.u.UpdateHandler Using UpdateLog implementation: org.apache.solr.update.UpdateLog
   [junit4]   2> 421316 INFO  (coreLoadExecutor-1951-thread-1-processing-n:88.99.242.108:8983_) [n:88.99.242.108:8983_ c:collection1 s:shard1  x:collection1] o.a.s.u.UpdateLog Initializing UpdateLog: dataDir= defaultSyncLevel=FLUSH numRecordsToKeep=100 maxNumLogsToKeep=10 numVersionBuckets=65536
   [junit4]   2> 421317 INFO  (coreLoadExecutor-1951-thread-1-processing-n:88.99.242.108:8983_) [n:88.99.242.108:8983_ c:collection1 s:shard1  x:collection1] o.a.s.u.CommitTracker Hard AutoCommit: disabled
   [junit4]   2> 421317 INFO  (coreLoadExecutor-1951-thread-1-processing-n:88.99.242.108:8983_) [n:88.99.242.108:8983_ c:collection1 s:shard1  x:collection1] o.a.s.u.CommitTracker Soft AutoCommit: disabled
   [junit4]   2> 421318 INFO  (coreLoadExecutor-1951-thread-1-processing-n:88.99.242.108:8983_) [n:88.99.242.108:8983_ c:collection1 s:shard1  x:collection1] o.a.s.u.RandomMergePolicy RandomMergePolicy wrapping class org.apache.lucene.index.LogDocMergePolicy: [LogDocMergePolicy: minMergeSize=1000, mergeFactor=15, maxMergeSize=9223372036854775807, maxMergeSizeForForcedMerge=9223372036854775807, calibrateSizeByDeletes=false, maxMergeDocs=2147483647, maxCFSSegmentSizeMB=8.796093022207999E12, noCFSRatio=1.0]
   [junit4]   2> 421318 INFO  (coreLoadExecutor-1951-thread-1-processing-n:88.99.242.108:8983_) [n:88.99.242.108:8983_ c:collection1 s:shard1  x:collection1] o.a.s.s.SolrIndexSearcher Opening [Searcher@7017198f[collection1] main]
   [junit4]   2> 421319 INFO  (coreLoadExecutor-1951-thread-1-processing-n:88.99.242.108:8983_) [n:88.99.242.108:8983_ c:collection1 s:shard1  x:collection1] o.a.s.h.c.SpellCheckComponent Initializing spell checkers
   [junit4]   2> 421576 INFO  (coreLoadExecutor-1951-thread-1-processing-n:88.99.242.108:8983_) [n:88.99.242.108:8983_ c:collection1 s:shard1  x:collection1] o.a.s.s.DirectSolrSpellChecker init: {name=direct,classname=DirectSolrSpellChecker,field=lowerfilt,minQueryLength=3}
   [junit4]   2> 421671 INFO  (coreLoadExecutor-1951-thread-1-processing-n:88.99.242.108:8983_) [n:88.99.242.108:8983_ c:collection1 s:shard1  x:collection1] o.a.s.h.ReplicationHandler Commits will be reserved for 10000ms.
   [junit4]   2> 421671 INFO  (searcherExecutor-1952-thread-1-processing-n:88.99.242.108:8983_ x:collection1 c:collection1 s:shard1) [n:88.99.242.108:8983_ c:collection1 s:shard1  x:collection1] o.a.s.h.c.SpellCheckComponent Loading spell index for spellchecker: default
   [junit4]   2> 421671 INFO  (coreLoadExecutor-1951-thread-1-processing-n:88.99.242.108:8983_) [n:88.99.242.108:8983_ c:collection1 s:shard1  x:collection1] o.a.s.u.UpdateLog Could not find max version in index or recent updates, using new clock 1608149394357485568
   [junit4]   2> 421671 INFO  (searcherExecutor-1952-thread-1-processing-n:88.99.242.108:8983_ x:collection1 c:collection1 s:shard1) [n:88.99.242.108:8983_ c:collection1 s:shard1  x:collection1] o.a.s.h.c.SpellCheckComponent Loading spell index for spellchecker: direct
   [junit4]   2> 421671 INFO  (searcherExecutor-1952-thread-1-processing-n:88.99.242.108:8983_ x:collection1 c:collection1 s:shard1) [n:88.99.242.108:8983_ c:collection1 s:shard1  x:collection1] o.a.s.h.c.SpellCheckComponent Loading spell index for spellchecker: wordbreak
   [junit4]   2> 421671 INFO  (searcherExecutor-1952-thread-1-processing-n:88.99.242.108:8983_ x:collection1 c:collection1 s:shard1) [n:88.99.242.108:8983_ c:collection1 s:shard1  x:collection1] o.a.s.h.c.SpellCheckComponent Loading spell index for spellchecker: multipleFields
   [junit4]   2> 421672 INFO  (searcherExecutor-1952-thread-1-processing-n:88.99.242.108:8983_ x:collection1 c:collection1 s:shard1) [n:88.99.242.108:8983_ c:collection1 s:shard1  x:collection1] o.a.s.h.c.SpellCheckComponent Loading spell index for spellchecker: jarowinkler
   [junit4]   2> 421672 INFO  (searcherExecutor-1952-thread-1-processing-n:88.99.242.108:8983_ x:collection1 c:collection1 s:shard1) [n:88.99.242.108:8983_ c:collection1 s:shard1  x:collection1] o.a.s.h.c.SpellCheckComponent Loading spell index for spellchecker: external
   [junit4]   2> 421672 INFO  (searcherExecutor-1952-thread-1-processing-n:88.99.242.108:8983_ x:collection1 c:collection1 s:shard1) [n:88.99.242.108:8983_ c:collection1 s:shard1  x:collection1] o.a.s.h.c.SpellCheckComponent Loading spell index for spellchecker: freq
   [junit4]   2> 421672 INFO  (searcherExecutor-1952-thread-1-processing-n:88.99.242.108:8983_ x:collection1 c:collection1 s:shard1) [n:88.99.242.108:8983_ c:collection1 s:shard1  x:collection1] o.a.s.h.c.SpellCheckComponent Loading spell index for spellchecker: fqcn
   [junit4]   2> 421672 INFO  (searcherExecutor-1952-thread-1-processing-n:88.99.242.108:8983_ x:collection1 c:collection1 s:shard1) [n:88.99.242.108:8983_ c:collection1 s:shard1  x:collection1] o.a.s.h.c.SpellCheckComponent Loading spell index for spellchecker: perDict
   [junit4]   2> 421673 INFO  (searcherExecutor-1952-thread-1-processing-n:88.99.242.108:8983_ x:collection1 c:collection1 s:shard1) [n:88.99.242.108:8983_ c:collection1 s:shard1  x:collection1] o.a.s.c.SolrCore [collection1] Registered new searcher Searcher@7017198f[collection1] main{ExitableDirectoryReader(UninvertingDirectoryReader())}
   [junit4]   2> 421675 INFO  (coreZkRegister-1939-thread-1-processing-n:88.99.242.108:8983_ x:collection1 c:collection1 s:shard1) [n:88.99.242.108:8983_ c:collection1 s:shard1 r:88.99.242.108:8983__collection1 x:collection1] o.a.s.c.ZkShardTerms Successful update of terms at /collections/collection1/terms/shard1 to Terms{values={88.99.242.108:8983__collection1=0}, version=0}
   [junit4]   2> 421676 INFO  (coreZkRegister-1939-thread-1-processing-n:88.99.242.108:8983_ x:collection1 c:collection1 s:shard1) [n:88.99.242.108:8983_ c:collection1 s:shard1 r:88.99.242.108:8983__collection1 x:collection1] o.a.s.c.ShardLeaderElectionContext Enough replicas found to continue.
   [junit4]   2> 421676 INFO  (SUITE-BasicZkTest-seed#[45B66A5FF1C81659]-worker) [n:88.99.242.108:8983_    ] o.a.s.SolrTestCaseJ4 ####initCore end
   [junit4]   2> 421676 INFO  (coreZkRegister-1939-thread-1-processing-n:88.99.242.108:8983_ x:collection1 c:collection1 s:shard1) [n:88.99.242.108:8983_ c:collection1 s:shard1 r:88.99.242.108:8983__collection1 x:collection1] o.a.s.c.ShardLeaderElectionContext I may be the new leader - try and sync
   [junit4]   2> 421676 INFO  (coreZkRegister-1939-thread-1-processing-n:88.99.242.108:8983_ x:collection1 c:collection1 s:shard1) [n:88.99.242.108:8983_ c:collection1 s:shard1 r:88.99.242.108:8983__collection1 x:collection1] o.a.s.c.ShardLeaderElectionContext Found all replicas participating in election, clear LIR
   [junit4]   2> 421681 INFO  (coreZkRegister-1939-thread-1-processing-n:88.99.242.108:8983_ x:collection1 c:collection1 s:shard1) [n:88.99.242.108:8983_ c:collection1 s:shard1 r:88.99.242.108:8983__collection1 x:collection1] o.a.s.c.ShardLeaderElectionContext I am the new leader: http://88.99.242.108:8983/collection1/ shard1
   [junit4]   2> 421683 INFO  (TEST-BasicZkTest.testBasic-seed#[45B66A5FF1C81659]) [n:88.99.242.108:8983_    ] o.a.s.SolrTestCaseJ4 ###Starting testBasic
   [junit4]   2> 421784 INFO  (TEST-BasicZkTest.testBasic-seed#[45B66A5FF1C81659]) [n:88.99.242.108:8983_    ] o.a.s.c.S.Request [collection1]  webapp=null path=null params={q=qlkciyopsbgzyvkylsjhchghjrdf&qt=&start=0&rows=20&version=2.2} hits=0 status=0 QTime=0
   [junit4]   2> 421787 INFO  (TEST-BasicZkTest.testBasic-seed#[45B66A5FF1C81659]) [n:88.99.242.108:8983_    ] o.a.s.c.ZkShardTerms Successful update of terms at /collections/collection1/terms/shard1 to Terms{values={88.99.242.108:8983__collection1=1}, version=1}
   [junit4]   2> 421787 INFO  (TEST-BasicZkTest.testBasic-seed#[45B66A5FF1C81659]) [n:88.99.242.108:8983_    ] o.a.s.u.p.LogUpdateProcessorFactory [collection1]  webapp=null path=null params={}{delete=[42 (-1608149394478071808)]} 0 1
   [junit4]   2> 421788 INFO  (TEST-BasicZkTest.testBasic-seed#[45B66A5FF1C81659]) [n:88.99.242.108:8983_    ] o.a.s.u.p.LogUpdateProcessorFactory [collection1]  webapp=null path=null params={}{add=[42 (1608149394480168960)]} 0 0
   [junit4]   2> 421789 INFO  (TEST-BasicZkTest.testBasic-seed#[45B66A5FF1C81659]) [n:88.99.242.108:8983_    ] o.a.s.u.DirectUpdateHandler2 start commit{_version_=1608149394481217536,optimize=false,openSearcher=true,waitSearcher=true,expungeDeletes=false,softCommit=false,prepareCommit=false}
   [junit4]   2> 421789 INFO  (TEST-BasicZkTest.testBasic-seed#[45B66A5FF1C81659]) [n:88.99.242.108:8983_    ] o.a.s.u.SolrIndexWriter Calling setCommitData with IW:org.apache.solr.update.SolrIndexWriter@1a517c99 commitCommandVersion:1608149394481217536
   [junit4]   2> 421793 INFO  (TEST-BasicZkTest.testBasic-seed#[45B66A5FF1C81659]) [n:88.99.242.108:8983_    ] o.a.s.s.SolrIndexSearcher Opening [Searcher@65be611e[collection1] main]
   [junit4]   2> 421793 INFO  (TEST-BasicZkTest.testBasic-seed#[45B66A5FF1C81659]) [n:88.99.242.108:8983_    ] o.a.s.u.DirectUpdateHandler2 end_commit_flush
   [junit4]   2> 421795 INFO  (searcherExecutor-1952-thread-1-processing-n:88.99.242.108:8983_) [n:88.99.242.108:8983_    ] o.a.s.c.SolrCore [collection1] Registered new searcher Searcher@65be611e[collection1] main{ExitableDirectoryReader(UninvertingDirectoryReader(Uninverting(_0(8.0.0):c1)))}
   [junit4]   2> 421795 INFO  (TEST-BasicZkTest.testBasic-seed#[45B66A5FF1C81659]) [n:88.99.242.108:8983_    ] o.a.s.u.p.LogUpdateProcessorFactory [collection1]  webapp=null path=null params={}{commit=} 0 6
   [junit4]   2> 421798 INFO  (TEST-BasicZkTest.testBasic-seed#[45B66A5FF1C81659]) [n:88.99.242.108:8983_    ] o.a.s.c.S.Request [collection1]  webapp=null path=null params={q=id:42+AND+val_s:aa\;bb&qt=&start=0&rows=20&version=2.2} hits=1 status=0 QTime=2
   [junit4]   2> 421799 INFO  (TEST-BasicZkTest.testBasic-seed#[45B66A5FF1C81659]) [n:88.99.242.108:8983_    ] o.a.s.c.S.Request [collection1]  webapp=null path=null params={q=id:42+AND+val_s:"aa;bb"&qt=&start=0&rows=20&version=2.2} hits=1 status=0 QTime=0
   [junit4]   2> 421800 INFO  (TEST-BasicZkTest.testBasic-seed#[45B66A5FF1C81659]) [n:88.99.242.108:8983_    ] o.a.s.c.S.Request [collection1]  webapp=null path=null params={q=id:42+AND+val_s:aa&qt=&start=0&rows=20&version=2.2} hits=0 status=0 QTime=0
   [junit4]   2> 421801 INFO  (TEST-BasicZkTest.testBasic-seed#[45B66A5FF1C81659]) [n:88.99.242.108:8983_    ] o.a.s.u.p.LogUpdateProcessorFactory [collection1]  webapp=null path=null params={}{delete=[42 (-1608149394492751872)]} 0 0
   [junit4]   2> 421801 INFO  (TEST-BasicZkTest.testBasic-seed#[45B66A5FF1C81659]) [n:88.99.242.108:8983_    ] o.a.s.u.DirectUpdateHandler2 start commit{_version_=1608149394493800448,optimize=false,openSearcher=true,waitSearcher=true,expungeDeletes=false,softCommit=false,prepareCommit=false}
   [junit4]   2> 421802 INFO  (TEST-BasicZkTest.testBasic-seed#[45B66A5FF1C81659]) [n:88.99.242.108:8983_    ] o.a.s.u.SolrIndexWriter Calling setCommitData with IW:org.apache.solr.update.SolrIndexWriter@1a517c99 commitCommandVersion:1608149394493800448
   [junit4]   2> 421802 INFO  (TEST-BasicZkTest.testBasic-seed#[45B66A5FF1C81659]) [n:88.99.242.108:8983_    ] o.a.s.s.SolrIndexSearcher Opening [Searcher@394466be[collection1] main]
   [junit4]   2> 421803 INFO  (TEST-BasicZkTest.testBasic-seed#[45B66A5FF1C81659]) [n:88.99.242.108:8983_    ] o.a.s.u.DirectUpdateHandler2 end_commit_flush
   [junit4]   2> 421804 INFO  (searcherExecutor-1952-thread-1-processing-n:88.99.242.108:8983_) [n:88.99.242.108:8983_    ] o.a.s.c.SolrCore [collection1] Registered new searcher Searcher@394466be[collection1] main{ExitableDirectoryReader(UninvertingDirectoryReader())}
   [junit4]   2> 421804 INFO  (TEST-BasicZkTest.testBasic-seed#[45B66A5FF1C81659]) [n:88.99.242.108:8983_    ] o.a.s.u.p.LogUpdateProcessorFactory [collection1]  webapp=null path=null params={}{commit=} 0 2
   [junit4]   2> 421805 INFO  (TEST-BasicZkTest.testBasic-seed#[45B66A5FF1C81659]) [n:88.99.242.108:8983_    ] o.a.s.c.S.Request [collection1]  webapp=null path=null params={q=id:42&qt=&start=0&rows=20&version=2.2} hits=0 status=0 QTime=0
   [junit4]   2> 421806 INFO  (TEST-BasicZkTest.testBasic-seed#[45B66A5FF1C81659]) [n:88.99.242.108:8983_    ] o.a.s.u.p.LogUpdateProcessorFactory [collection1]  webapp=null path=null params={}{add=[42 (1608149394497994752)]} 0 1
   [junit4]   2> 421807 INFO  (TEST-BasicZkTest.testBasic-seed#[45B66A5FF1C81659]) [n:88.99.242.108:8983_    ] o.a.s.u.p.LogUpdateProcessorFactory [collection1]  webapp=null path=null params={}{add=[42 (1608149394500091904)]} 0 0
   [junit4]   2> 421807 INFO  (TEST-BasicZkTest.testBasic-seed#[45B66A5FF1C81659]) [n:88.99.242.108:8983_    ] o.a.s.u.DirectUpdateHandler2 start commit{_version_=1608149394500091905,optimize=false,openSearcher=true,waitSearcher=true,expungeDeletes=false,softCommit=false,prepareCommit=false}
   [junit4]   2> 421807 INFO  (TEST-BasicZkTest.testBasic-seed#[45B66A5FF1C81659]) [n:88.99.242.108:8983_    ] o.a.s.u.SolrIndexWriter Calling setCommitData with IW:org.apache.solr.update.SolrIndexWriter@1a517c99 commitCommandVersion:1608149394500091905
   [junit4]   2> 421811 INFO  (TEST-BasicZkTest.testBasic-seed#[45B66A5FF1C81659]) [n:88.99.242.108:8983_    ] o.a.s.s.SolrIndexSearcher Opening [Searcher@1f9f6921[collection1] main]
   [junit4]   2> 421811 INFO  (TEST-BasicZkTest.testBasic-seed#[45B66A5FF1C81659]) [n:88.99.242.108:8983_    ] o.a.s.u.DirectUpdateHandler2 end_commit_flush
   [junit4]   2> 421813 INFO  (searcherExecutor-1952-thread-1-processing-n:88.99.242.108:8983_) [n:88.99.242.108:8983_    ] o.a.s.c.SolrCore [collection1] Registered new searcher Searcher@1f9f6921[collection1] main{ExitableDirectoryReader(UninvertingDirectoryReader(Uninverting(_1(8.0.0):c2/1:delGen=1)))}
   [junit4]   2> 421813 INFO  (TEST-BasicZkTest.testBasic-seed#[45B66A5FF1C81659]) [n:88.99.242.108:8983_    ] o.a.s.u.p.LogUpdateProcessorFactory [collection1]  webapp=null path=null params={}{commit=} 0 6
   [junit4]   2> 421814 INFO  (TEST-BasicZkTest.testBasic-seed#[45B66A5FF1C81659]) [n:88.99.242.108:8983_    ] o.a.s.c.S.Request [collection1]  webapp=null path=null params={q=id:42&qt=&start=0&rows=20&version=2.2} hits=1 status=0 QTime=0
   [junit4]   2> 421816 INFO  (TEST-BasicZkTest.testBasic-seed#[45B66A5FF1C81659]) [n:88.99.242.108:8983_    ] o.a.s.u.p.LogUpdateProcessorFactory [collection1]  webapp=null path=null params={}{add=[42 (1608149394508480512)]} 0 1
   [junit4]   2> 421816 INFO  (TEST-BasicZkTest.testBasic-seed#[45B66A5FF1C81659]) [n:88.99.242.108:8983_    ] o.a.s.u.p.LogUpdateProcessorFactory [collection1]  webapp=null path=null params={}{add=[42 (1608149394509529088)]} 0 0
   [junit4]   2> 421817 INFO  (TEST-BasicZkTest.testBasic-seed#[45B66A5FF1C81659]) [n:88.99.242.108:8983_    ] o.a.s.u.DirectUpdateHandler2 start commit{_version_=1608149394510577664,optimize=false,openSearcher=true,waitSearcher=true,expungeDeletes=false,softCommit=false,prepareCommit=false}
   [junit4]   2> 421817 INFO  (TEST-BasicZkTest.testBasic-seed#[45B66A5FF1C81659]) [n:88.99.242.108:8983_    ] o.a.s.u.SolrIndexWriter Calling setCommitData with IW:org.apache.solr.update.SolrIndexWriter@1a517c99 commitCommandVersion:1608149394510577664
   [junit4]   2> 421820 INFO  (TEST-BasicZkTest.testBasic-seed#[45B66A5FF1C81659]) [n:88.99.242.108:8983_    ] o.a.s.s.SolrIndexSearcher Opening [Searcher@743c1fbe[collection1] main]
   [junit4]   2> 421821 INFO  (TEST-BasicZkTest.testBasic-seed#[45B66A5FF1C81659]) [n:88.99.242.108:8983_    ] o.a.s.u.DirectUpdateHandler2 end_commit_flush
   [junit4]   2> 421822 INFO  (searcherExecutor-1952-thread-1-processing-n:88.99.242.108:8983_) [n:88.99.242.108:8983_    ] o.a.s.c.SolrCore [collection1] Registered new searcher Searcher@743c1fbe[collection1] main{ExitableDirectoryReader(UninvertingDirectoryReader(Uninverting(_2(8.0.0):c2/1:delGen=1)))}
   [junit4]   2> 421822 INFO  (TEST-BasicZkTest.testBasic-seed#[45B66A5FF1C81659]) [n:88.99.242.108:8983_    ] o.a.s.u.p.LogUpdateProcessorFactory [collection1]  webapp=null path=null params={}{commit=} 0 5
   [junit4]   2> 421823 INFO  (TEST-BasicZkTest.testBasic-seed#[45B66A5FF1C81659]) [n:88.99.242.108:8983_    ] o.a.s.c.S.Request [collection1]  webapp=null path=null params={q=id:42&qt=&start=0&rows=20&version=2.2} hits=1 status=0 QTime=0
   [junit4]   2> 421825 INFO  (TEST-BasicZkTest.testBasic-seed#[45B66A5FF1C81659]) [n:88.99.242.108:8983_    ] o.a.s.u.p.LogUpdateProcessorFactory [collection1]  webapp=null path=null params={}{add=[101 (1608149394517917696)]} 0 1
   [junit4]   2> 421826 INFO  (TEST-BasicZkTest.testBasic-seed#[45B66A5FF1C81659]) [n:88.99.242.108:8983_    ] o.a.s.u.p.LogUpdateProcessorFactory [collection1]  webapp=null path=null params={}{add=[101 (1608149394520014848)]} 0 0
   [junit4]   2> 421826 INFO  (TEST-BasicZkTest.testBasic-seed#[45B66A5FF1C81659]) [n:88.99.242.108:8983_    ] o.a.s.u.p.LogUpdateProcessorFactory [collection1]  webapp=null path=null params={}{add=[105 (1608149394520014849)]} 0 0
   [junit4]   2> 421827 INFO  (TEST-BasicZkTest.testBasic-seed#[45B66A5FF1C81659]) [n:88.99.242.108:8983_    ] o.a.s.u.p.LogUpdateProcessorFactory [collection1]  webapp=null path=null params={}{add=[102 (1608149394520014850)]} 0 0
   [junit4]   2> 421827 INFO  (TEST-BasicZkTest.testBasic-seed#[45B66A5FF1C81659]) [n:88.99.242.108:8983_    ] o.a.s.u.p.LogUpdateProcessorFactory [collection1]  webapp=null path=null params={}{add=[103 (1608149394521063424)]} 0 0
   [junit4]   2> 421827 INFO  (TEST-BasicZkTest.testBasic-seed#[45B66A5FF1C81659]) [n:88.99.242.108:8983_    ] o.a.s.u.p.LogUpdateProcessorFactory [collection1]  webapp=null path=null params={}{add=[101 (1608149394521063425)]} 0 0
   [junit4]   2> 421827 INFO  (TEST-BasicZkTest.testBasic-seed#[45B66A5FF1C81659]) [n:88.99.242.108:8983_    ] o.a.s.u.DirectUpdateHandler2 start commit{_version_=1608149394521063426,optimize=false,openSearcher=true,waitSearcher=true,expungeDeletes=false,softCommit=false,prepareCommit=false}
   [junit4]   2> 421827 INFO  (TEST-BasicZkTest.testBasic-seed#[45B66A5FF1C81659]) [n:88.99.242.108:8983_    ] o.a.s.u.SolrIndexWriter Calling setCommitData with IW:org.apache.solr.update.SolrIndexWriter@1a517c99 commitCommandVersion:1608149394521063426
   [junit4]   2> 421830 INFO  (TEST-BasicZkTest.testBasic-seed#[45B66A5FF1C81659]) [n:88.99.242.108:8983_    ] o.a.s.s.SolrIndexSearcher Opening [Searcher@eecab09[collection1] main]
   [junit4]   2> 421831 INFO  (TEST-BasicZkTest.testBasic-seed#[45B66A5FF1C81659]) [n:88.99.242.108:8983_    ] o.a.s.u.DirectUpdateHandler2 end_commit_flush
   [junit4]   2> 421832 INFO  (searcherExecutor-1952-thread-1-processing-n:88.99.242.108:8983_) [n:88.99.242.108:8983_    ] o.a.s.c.SolrCore [collection1] Registered new searcher Searcher@eecab09[collection1] main{ExitableDirectoryReader(UninvertingDirectoryReader(Uninverting(_2(8.0.0):c2/1:delGen=1) Uninverting(_3(8.0.0):c6/2:delGen=1)))}
   [junit4]   2> 421832 WARN  (coreZkRegister-1939-thread-1-processing-n:88.99.242.108:8983_ x:collection1 c:collection1 s:shard1) [n:88.99.242.108:8983_ c:collection1 s:shard1 r:88.99.242.108:8983__collection1 x:collection1] o.a.s.c.ZkController Skipping recovery according to sys prop solrcloud.skip.autorecovery
   [junit4]   2> 421832 INFO  (TEST-BasicZkTest.testBasic-seed#[45B66A5FF1C81659]) [n:88.99.242.108:8983_    ] o.a.s.u.p.LogUpdateProcessorFactory [collection1]  webapp=null path=null params={}{commit=} 0 5
   [junit4]   2> 421833 ERROR (TEST-BasicZkTest.testBasic-seed#[45B66A5FF1C81659]) [n:88.99.242.108:8983_    ] o.a.z.s.ZooKeeperServer ZKShutdownHandler is not registered, so ZooKeeper server wo

[...truncated too long message...]

ns/workspace/Lucene-Solr-master-Linux/lucene/top-level-ivy-settings.xml

resolve:

init:

-clover.disable:

-clover.load:

-clover.classpath:

-clover.setup:

clover:

compile-core:

init:

-clover.disable:

-clover.load:

-clover.classpath:

-clover.setup:

clover:

common.compile-core:
    [javac] Compiling 3 source files to /home/jenkins/workspace/Lucene-Solr-master-Linux/solr/build/solr-core/classes/java

common-solr.compile-core:

compile-core:

compile-test-framework:

-check-git-state:

-git-cleanroot:

-copy-git-state:

git-autoclean:

ivy-availability-check:
[loadresource] Do not set property disallowed.ivy.jars.list as its length is 0.

-ivy-fail-disallowed-ivy-version:

ivy-fail:

ivy-configure:
[ivy:configure] :: loading settings :: file = /home/jenkins/workspace/Lucene-Solr-master-Linux/lucene/top-level-ivy-settings.xml

resolve:

init:

compile-lucene-core:

compile-codecs:

-check-git-state:

-git-cleanroot:

-copy-git-state:

git-autoclean:

ivy-availability-check:
[loadresource] Do not set property disallowed.ivy.jars.list as its length is 0.

-ivy-fail-disallowed-ivy-version:

ivy-fail:

ivy-configure:
[ivy:configure] :: loading settings :: file = /home/jenkins/workspace/Lucene-Solr-master-Linux/lucene/top-level-ivy-settings.xml

resolve:

common.init:

compile-lucene-core:

init:

-clover.disable:

-clover.load:

-clover.classpath:

-clover.setup:

clover:

compile-core:

-clover.disable:

-clover.load:

-clover.classpath:

-clover.setup:

clover:

common.compile-core:

compile-core:

common.compile-test:
    [mkdir] Created dir: /home/jenkins/workspace/Lucene-Solr-master-Linux/solr/build/solr-core/classes/test
    [javac] Compiling 926 source files to /home/jenkins/workspace/Lucene-Solr-master-Linux/solr/build/solr-core/classes/test
    [javac] Note: Some input files use or override a deprecated API.
    [javac] Note: Recompile with -Xlint:deprecation for details.
    [javac] Note: Some input files use unchecked or unsafe operations.
    [javac] Note: Recompile with -Xlint:unchecked for details.
    [javac] Creating empty /home/jenkins/workspace/Lucene-Solr-master-Linux/solr/build/solr-core/classes/test/org/apache/solr/cloud/autoscaling/sim/package-info.class
     [copy] Copying 1 file to /home/jenkins/workspace/Lucene-Solr-master-Linux/solr/build/solr-core/classes/test

common-solr.compile-test:

compile-test:

BUILD SUCCESSFUL
Total time: 55 seconds
[repro] ant test-nocompile -Dtests.dups=5 -Dtests.maxfailures=5 -Dtests.class="*.BasicZkTest" -Dtests.showOutput=onerror "-Dargs=-XX:+UseCompressedOops -XX:+UseSerialGC" -Dtests.seed=45B66A5FF1C81659 -Dtests.multiplier=3 -Dtests.slow=true -Dtests.locale=es-DO -Dtests.timezone=Australia/Victoria -Dtests.asserts=true -Dtests.file.encoding=UTF-8
Buildfile: /home/jenkins/workspace/Lucene-Solr-master-Linux/solr/core/build.xml

-clover.disable:

ivy-configure:
[ivy:configure] :: Apache Ivy 2.4.0 - 20141213170938 :: http://ant.apache.org/ivy/ ::
[ivy:configure] :: loading settings :: file = /home/jenkins/workspace/Lucene-Solr-master-Linux/lucene/top-level-ivy-settings.xml

install-junit4-taskdef:

ivy-availability-check:
[loadresource] Do not set property disallowed.ivy.jars.list as its length is 0.

-ivy-fail-disallowed-ivy-version:

ivy-fail:

resolve-groovy:
[ivy:cachepath] :: resolving dependencies :: org.codehaus.groovy#groovy-all-caller;working
[ivy:cachepath] 	confs: [default]
[ivy:cachepath] 	found org.codehaus.groovy#groovy-all;2.4.15 in public
[ivy:cachepath] :: resolution report :: resolve 18ms :: artifacts dl 1ms
	---------------------------------------------------------------------
	|                  |            modules            ||   artifacts   |
	|       conf       | number| search|dwnlded|evicted|| number|dwnlded|
	---------------------------------------------------------------------
	|      default     |   1   |   0   |   0   |   0   ||   1   |   0   |
	---------------------------------------------------------------------

-init-totals:

-test:
    [mkdir] Created dir: /home/jenkins/workspace/Lucene-Solr-master-Linux/solr/build/solr-core/test
[junit4:pickseed] Seed property 'tests.seed' already defined: 45B66A5FF1C81659
    [mkdir] Created dir: /home/jenkins/workspace/Lucene-Solr-master-Linux/solr/build/solr-core/test/temp
   [junit4] <JUnit4> says salut! Master seed: 45B66A5FF1C81659
   [junit4] Executing 5 suites with 3 JVMs.
   [junit4] 
   [junit4] Started J0 PID(13523@serv1.sd-datasolutions.de).
   [junit4] Started J2 PID(13524@serv1.sd-datasolutions.de).
   [junit4] Started J1 PID(13525@serv1.sd-datasolutions.de).
   [junit4] Suite: org.apache.solr.cloud.BasicZkTest
   [junit4] OK      3.03s J0 | BasicZkTest.testBasic
   [junit4] Completed [1/5] on J0 in 11.77s, 1 test
   [junit4] 
   [junit4] Suite: org.apache.solr.cloud.BasicZkTest
   [junit4] OK      3.68s J2 | BasicZkTest.testBasic
   [junit4] Completed [2/5] on J2 in 12.80s, 1 test
   [junit4] 
   [junit4] Duplicate suite name used with XML reports: org.apache.solr.cloud.BasicZkTest. This may confuse tools that process XML reports. Set 'ignoreDuplicateSuites' to true to skip this message.
   [junit4] Suite: org.apache.solr.cloud.BasicZkTest
   [junit4] OK      2.54s J1 | BasicZkTest.testBasic
   [junit4] Completed [3/5] on J1 in 13.89s, 1 test
   [junit4] 
   [junit4] Suite: org.apache.solr.cloud.BasicZkTest
   [junit4] OK      1.64s J0 | BasicZkTest.testBasic
   [junit4] Completed [4/5] on J0 in 6.75s, 1 test
   [junit4] 
   [junit4] Suite: org.apache.solr.cloud.BasicZkTest
   [junit4] OK      1.94s J2 | BasicZkTest.testBasic
   [junit4] Completed [5/5] on J2 in 6.91s, 1 test
   [junit4] 
   [junit4] JVM J0:     0.43 ..    20.07 =    19.64s
   [junit4] JVM J1:     0.46 ..    15.25 =    14.79s
   [junit4] JVM J2:     0.44 ..    21.26 =    20.82s
   [junit4] Execution time total: 21 seconds
   [junit4] Tests summary: 5 suites, 5 tests
   [junit4] Could not remove temporary path: /home/jenkins/workspace/Lucene-Solr-master-Linux/solr/build/solr-core/test/J2 (java.nio.file.DirectoryNotEmptyException: Remaining files: [/home/jenkins/workspace/Lucene-Solr-master-Linux/solr/build/solr-core/test/J2/temp])
   [junit4] Could not remove temporary path: /home/jenkins/workspace/Lucene-Solr-master-Linux/solr/build/solr-core/test/J1 (java.nio.file.DirectoryNotEmptyException: Remaining files: [/home/jenkins/workspace/Lucene-Solr-master-Linux/solr/build/solr-core/test/J1/temp])
   [junit4] Could not remove temporary path: /home/jenkins/workspace/Lucene-Solr-master-Linux/solr/build/solr-core/test/J0 (java.nio.file.DirectoryNotEmptyException: Remaining files: [/home/jenkins/workspace/Lucene-Solr-master-Linux/solr/build/solr-core/test/J0/temp])
     [echo] 5 slowest tests:
[junit4:tophints] 108.10s | org.apache.solr.cloud.TestTlogReplica
[junit4:tophints] 104.73s | org.apache.solr.cloud.MetricsHistoryIntegrationTest
[junit4:tophints]  91.84s | org.apache.solr.cloud.TestPullReplicaErrorHandling
[junit4:tophints]  90.69s | org.apache.solr.cloud.TestPullReplica
[junit4:tophints]  74.24s | org.apache.solr.request.TestIntervalFaceting

-check-totals:

test-nocompile:

BUILD SUCCESSFUL
Total time: 23 seconds
[repro] Failures:
[repro]   0/5 failed: org.apache.solr.cloud.BasicZkTest
[repro] Exiting with code 0
+ mv lucene/build lucene/build.repro
+ mv solr/build solr/build.repro
+ mv lucene/build.orig lucene/build
+ mv solr/build.orig solr/build
Archiving artifacts
Setting ANT_1_8_2_HOME=/var/lib/jenkins/tools/hudson.tasks.Ant_AntInstallation/ANT_1.8.2
java.lang.InterruptedException: no matches found within 10000
	at hudson.FilePath$ValidateAntFileMask.hasMatch(FilePath.java:2845)
	at hudson.FilePath$ValidateAntFileMask.invoke(FilePath.java:2724)
	at hudson.FilePath$ValidateAntFileMask.invoke(FilePath.java:2705)
	at hudson.FilePath.act(FilePath.java:1076)
	at hudson.FilePath.act(FilePath.java:1059)
	at hudson.FilePath.validateAntFileMask(FilePath.java:2703)
	at hudson.tasks.ArtifactArchiver.perform(ArtifactArchiver.java:243)
	at hudson.tasks.BuildStepCompatibilityLayer.perform(BuildStepCompatibilityLayer.java:81)
	at hudson.tasks.BuildStepMonitor$1.perform(BuildStepMonitor.java:20)
	at hudson.model.AbstractBuild$AbstractBuildExecution.perform(AbstractBuild.java:744)
	at hudson.model.AbstractBuild$AbstractBuildExecution.performAllBuildSteps(AbstractBuild.java:690)
	at hudson.model.Build$BuildExecution.post2(Build.java:186)
	at hudson.model.AbstractBuild$AbstractBuildExecution.post(AbstractBuild.java:635)
	at hudson.model.Run.execute(Run.java:1840)
	at hudson.model.FreeStyleBuild.run(FreeStyleBuild.java:43)
	at hudson.model.ResourceController.execute(ResourceController.java:97)
	at hudson.model.Executor.run(Executor.java:429)
No artifacts found that match the file pattern "**/*.events,heapdumps/**,**/*_pid*.log". Configuration error?
[WARNINGS] Parsing warnings in console log with parser Java Compiler (javac)
Setting ANT_1_8_2_HOME=/var/lib/jenkins/tools/hudson.tasks.Ant_AntInstallation/ANT_1.8.2
Setting ANT_1_8_2_HOME=/var/lib/jenkins/tools/hudson.tasks.Ant_AntInstallation/ANT_1.8.2
<Git Blamer> Using GitBlamer to create author and commit information for all warnings.
<Git Blamer> GIT_COMMIT=3898653195b24987b8ba53ea9acf8713316b66f3, workspace=/var/lib/jenkins/workspace/Lucene-Solr-master-Linux
[WARNINGS] Computing warning deltas based on reference build #22620
Recording test results
Setting ANT_1_8_2_HOME=/var/lib/jenkins/tools/hudson.tasks.Ant_AntInstallation/ANT_1.8.2
Build step 'Publish JUnit test result report' changed build result to UNSTABLE
Email was triggered for: Unstable (Test Failures)
Sending email for trigger: Unstable (Test Failures)
Setting ANT_1_8_2_HOME=/var/lib/jenkins/tools/hudson.tasks.Ant_AntInstallation/ANT_1.8.2
Setting ANT_1_8_2_HOME=/var/lib/jenkins/tools/hudson.tasks.Ant_AntInstallation/ANT_1.8.2
Setting ANT_1_8_2_HOME=/var/lib/jenkins/tools/hudson.tasks.Ant_AntInstallation/ANT_1.8.2
Setting ANT_1_8_2_HOME=/var/lib/jenkins/tools/hudson.tasks.Ant_AntInstallation/ANT_1.8.2