You are viewing a plain text version of this content. The canonical link for it is here.
Posted to builds@beam.apache.org by Apache Jenkins Server <je...@builds.apache.org> on 2022/02/13 14:36:07 UTC
Build failed in Jenkins: beam_LoadTests_Java_GBK_Dataflow_V2_Batch_Java11 #240
See <https://ci-beam.apache.org/job/beam_LoadTests_Java_GBK_Dataflow_V2_Batch_Java11/240/display/redirect?page=changes>
Changes:
[randomstep] [BEAM-9195] Bump org.testcontainers to 1.16.3
------------------------------------------
[...truncated 323.01 KB...]
> Task :buildSrc:processTestResources NO-SOURCE
> Task :buildSrc:testClasses UP-TO-DATE
> Task :buildSrc:test NO-SOURCE
> Task :buildSrc:validatePlugins UP-TO-DATE
> Task :buildSrc:check UP-TO-DATE
> Task :buildSrc:build UP-TO-DATE
System Go installation: /snap/bin/go is go version go1.16.13 linux/amd64; Preparing to use /home/jenkins/go/bin/go1.16.12
go1.16.12: already downloaded in /home/jenkins/sdk/go1.16.12
GOCMD=/home/jenkins/go/bin/go1.16.12
> Task :model:job-management:createCheckerFrameworkManifest UP-TO-DATE
> Task :model:fn-execution:createCheckerFrameworkManifest UP-TO-DATE
> Task :model:pipeline:createCheckerFrameworkManifest UP-TO-DATE
> Task :sdks:java:core:createCheckerFrameworkManifest UP-TO-DATE
> Task :runners:core-construction-java:createCheckerFrameworkManifest UP-TO-DATE
> Task :sdks:java:fn-execution:createCheckerFrameworkManifest UP-TO-DATE
> Task :runners:core-java:createCheckerFrameworkManifest UP-TO-DATE
> Task :sdks:java:container:downloadCloudProfilerAgent UP-TO-DATE
> Task :runners:java-fn-execution:createCheckerFrameworkManifest UP-TO-DATE
> Task :sdks:java:extensions:google-cloud-platform-core:createCheckerFrameworkManifest UP-TO-DATE
> Task :sdks:java:harness:createCheckerFrameworkManifest UP-TO-DATE
> Task :runners:core-java:processResources NO-SOURCE
> Task :sdks:java:fn-execution:processResources NO-SOURCE
> Task :sdks:java:expansion-service:createCheckerFrameworkManifest UP-TO-DATE
> Task :runners:core-construction-java:processResources NO-SOURCE
> Task :sdks:java:io:kafka:createCheckerFrameworkManifest UP-TO-DATE
> Task :sdks:java:core:generateAvroProtocol NO-SOURCE
> Task :sdks:java:expansion-service:processResources NO-SOURCE
> Task :sdks:java:core:generateAvroJava NO-SOURCE
> Task :model:job-management:extractProto UP-TO-DATE
> Task :model:fn-execution:extractProto UP-TO-DATE
> Task :sdks:java:io:kafka:processResources NO-SOURCE
> Task :release:go-licenses:java:createLicenses UP-TO-DATE
> Task :sdks:java:extensions:google-cloud-platform-core:processResources NO-SOURCE
> Task :sdks:java:harness:processResources NO-SOURCE
> Task :runners:java-fn-execution:processResources NO-SOURCE
> Task :runners:google-cloud-dataflow-java:createCheckerFrameworkManifest UP-TO-DATE
> Task :model:job-management:processResources UP-TO-DATE
> Task :model:fn-execution:processResources UP-TO-DATE
> Task :sdks:java:extensions:arrow:createCheckerFrameworkManifest UP-TO-DATE
> Task :sdks:java:extensions:protobuf:createCheckerFrameworkManifest UP-TO-DATE
> Task :sdks:java:io:google-cloud-platform:createCheckerFrameworkManifest UP-TO-DATE
> Task :sdks:java:io:kinesis:createCheckerFrameworkManifest UP-TO-DATE
> Task :sdks:java:extensions:arrow:processResources NO-SOURCE
> Task :sdks:java:io:synthetic:createCheckerFrameworkManifest UP-TO-DATE
> Task :sdks:java:extensions:protobuf:extractProto UP-TO-DATE
> Task :sdks:java:io:kinesis:processResources NO-SOURCE
> Task :sdks:java:core:generateGrammarSource UP-TO-DATE
> Task :sdks:java:testing:load-tests:createCheckerFrameworkManifest UP-TO-DATE
> Task :sdks:java:testing:test-utils:createCheckerFrameworkManifest UP-TO-DATE
> Task :sdks:java:testing:load-tests:processResources NO-SOURCE
> Task :sdks:java:testing:test-utils:processResources NO-SOURCE
> Task :sdks:java:core:processResources UP-TO-DATE
> Task :sdks:java:io:synthetic:processResources NO-SOURCE
> Task :sdks:java:extensions:protobuf:processResources NO-SOURCE
> Task :sdks:java:io:google-cloud-platform:processResources NO-SOURCE
> Task :runners:google-cloud-dataflow-java:processResources UP-TO-DATE
> Task :sdks:java:container:generateLicenseReport UP-TO-DATE
> Task :sdks:java:container:java11:copyLicenses UP-TO-DATE
> Task :sdks:java:container:java11:copyGolangLicenses UP-TO-DATE
> Task :sdks:java:container:pullLicenses UP-TO-DATE
> Task :sdks:java:container:goPrepare UP-TO-DATE
> Task :model:pipeline:extractIncludeProto UP-TO-DATE
> Task :model:pipeline:extractProto UP-TO-DATE
> Task :model:pipeline:generateProto UP-TO-DATE
> Task :model:pipeline:compileJava UP-TO-DATE
> Task :model:pipeline:processResources UP-TO-DATE
> Task :model:pipeline:classes UP-TO-DATE
> Task :model:pipeline:jar UP-TO-DATE
> Task :model:fn-execution:extractIncludeProto UP-TO-DATE
> Task :model:job-management:extractIncludeProto UP-TO-DATE
> Task :model:fn-execution:generateProto UP-TO-DATE
> Task :model:pipeline:shadowJar UP-TO-DATE
> Task :model:job-management:generateProto UP-TO-DATE
> Task :model:fn-execution:compileJava UP-TO-DATE
> Task :model:fn-execution:classes UP-TO-DATE
> Task :model:job-management:compileJava UP-TO-DATE
> Task :model:job-management:classes UP-TO-DATE
> Task :model:fn-execution:shadowJar UP-TO-DATE
> Task :model:job-management:shadowJar UP-TO-DATE
> Task :sdks:java:container:java11:dockerClean
> Task :sdks:java:container:java11:copyJavaThirdPartyLicenses UP-TO-DATE
> Task :sdks:java:core:compileJava UP-TO-DATE
> Task :sdks:java:core:classes UP-TO-DATE
> Task :sdks:java:core:shadowJar UP-TO-DATE
> Task :sdks:java:extensions:protobuf:extractIncludeProto UP-TO-DATE
> Task :sdks:java:extensions:protobuf:generateProto NO-SOURCE
> Task :sdks:java:fn-execution:compileJava UP-TO-DATE
> Task :sdks:java:extensions:arrow:compileJava UP-TO-DATE
> Task :sdks:java:extensions:arrow:classes UP-TO-DATE
> Task :sdks:java:fn-execution:classes UP-TO-DATE
> Task :sdks:java:io:synthetic:compileJava UP-TO-DATE
> Task :sdks:java:io:synthetic:classes UP-TO-DATE
> Task :sdks:java:extensions:arrow:jar UP-TO-DATE
> Task :sdks:java:fn-execution:jar UP-TO-DATE
> Task :sdks:java:io:synthetic:jar UP-TO-DATE
> Task :sdks:java:io:kinesis:compileJava UP-TO-DATE
> Task :sdks:java:io:kinesis:classes UP-TO-DATE
> Task :sdks:java:extensions:protobuf:compileJava UP-TO-DATE
> Task :sdks:java:extensions:protobuf:classes UP-TO-DATE
> Task :sdks:java:io:kinesis:jar UP-TO-DATE
> Task :sdks:java:extensions:protobuf:jar UP-TO-DATE
> Task :sdks:java:testing:test-utils:compileJava UP-TO-DATE
> Task :sdks:java:testing:test-utils:classes UP-TO-DATE
> Task :sdks:java:testing:test-utils:jar UP-TO-DATE
> Task :runners:core-construction-java:compileJava UP-TO-DATE
> Task :runners:core-construction-java:classes UP-TO-DATE
> Task :runners:core-construction-java:jar UP-TO-DATE
> Task :runners:core-java:compileJava UP-TO-DATE
> Task :runners:core-java:classes UP-TO-DATE
> Task :runners:core-java:jar UP-TO-DATE
> Task :sdks:java:extensions:google-cloud-platform-core:compileJava UP-TO-DATE
> Task :sdks:java:extensions:google-cloud-platform-core:classes UP-TO-DATE
> Task :sdks:java:extensions:google-cloud-platform-core:jar UP-TO-DATE
> Task :sdks:java:harness:compileJava UP-TO-DATE
> Task :sdks:java:harness:classes UP-TO-DATE
> Task :sdks:java:harness:jar UP-TO-DATE
> Task :runners:java-fn-execution:compileJava UP-TO-DATE
> Task :runners:java-fn-execution:classes UP-TO-DATE
> Task :runners:java-fn-execution:jar UP-TO-DATE
> Task :sdks:java:harness:shadowJar UP-TO-DATE
> Task :sdks:java:expansion-service:compileJava UP-TO-DATE
> Task :sdks:java:expansion-service:classes UP-TO-DATE
> Task :sdks:java:expansion-service:jar UP-TO-DATE
> Task :sdks:java:io:kafka:compileJava UP-TO-DATE
> Task :sdks:java:io:kafka:classes UP-TO-DATE
> Task :sdks:java:io:kafka:jar UP-TO-DATE
> Task :sdks:java:container:java11:copyDockerfileDependencies UP-TO-DATE
> Task :sdks:java:io:google-cloud-platform:compileJava UP-TO-DATE
> Task :sdks:java:io:google-cloud-platform:classes UP-TO-DATE
> Task :sdks:java:io:google-cloud-platform:jar UP-TO-DATE
> Task :sdks:java:testing:load-tests:compileJava UP-TO-DATE
> Task :sdks:java:testing:load-tests:classes UP-TO-DATE
> Task :sdks:java:testing:load-tests:jar UP-TO-DATE
> Task :runners:google-cloud-dataflow-java:compileJava UP-TO-DATE
> Task :runners:google-cloud-dataflow-java:classes UP-TO-DATE
> Task :runners:google-cloud-dataflow-java:jar UP-TO-DATE
> Task :sdks:java:container:goBuild
/home/jenkins/go/bin/go1.16.12 build -o ./build/target/linux_amd64/boot boot.go
> Task :sdks:java:container:java11:copySdkHarnessLauncher
Execution optimizations have been disabled for task ':sdks:java:container:java11:copySdkHarnessLauncher' to ensure correctness due to the following reasons:
- Gradle detected a problem with the following location: '<https://ci-beam.apache.org/job/beam_LoadTests_Java_GBK_Dataflow_V2_Batch_Java11/ws/src/sdks/java/container/build/target'.> Reason: Task ':sdks:java:container:java11:copySdkHarnessLauncher' uses this output of task ':sdks:java:container:downloadCloudProfilerAgent' without declaring an explicit or implicit dependency. This can lead to incorrect results being produced, depending on what order the tasks are executed. Please refer to https://docs.gradle.org/7.3.2/userguide/validation_problems.html#implicit_dependency for more details about this problem.
- Gradle detected a problem with the following location: '<https://ci-beam.apache.org/job/beam_LoadTests_Java_GBK_Dataflow_V2_Batch_Java11/ws/src/sdks/java/container/build/target'.> Reason: Task ':sdks:java:container:java11:copySdkHarnessLauncher' uses this output of task ':sdks:java:container:pullLicenses' without declaring an explicit or implicit dependency. This can lead to incorrect results being produced, depending on what order the tasks are executed. Please refer to https://docs.gradle.org/7.3.2/userguide/validation_problems.html#implicit_dependency for more details about this problem.
> Task :sdks:java:container:java11:dockerPrepare
> Task :sdks:java:container:java11:docker
> Task :runners:google-cloud-dataflow-java:buildAndPushDockerJavaContainer
WARNING: `gcloud docker` will not be supported for Docker client versions above 18.03.
As an alternative, use `gcloud auth configure-docker` to configure `docker` to
use `gcloud` as a credential helper, then use `docker` as you would for non-GCR
registries, e.g. `docker pull gcr.io/project-id/my-image`. Add
`--verbosity=error` to silence this warning: `gcloud docker
--verbosity=error -- pull gcr.io/project-id/my-image`.
See: https://cloud.google.com/container-registry/docs/support/deprecation-notices#gcloud-docker
The push refers to repository [us.gcr.io/apache-beam-testing/java-postcommit-it/java]
e3c48379e012: Preparing
4eb0cc401f99: Preparing
671bda84405d: Preparing
127367305d6c: Preparing
fec6bc1485c4: Preparing
989684deea07: Preparing
2a120f845e42: Preparing
0b3e55694008: Preparing
65def485091a: Preparing
7101ce66aabe: Preparing
4de9cbb96816: Preparing
6fc1612f2b01: Preparing
b855d9031361: Preparing
fe4f44af763d: Preparing
7c072cee6a29: Preparing
989684deea07: Waiting
1e5fdc3d671c: Preparing
613ab28cf833: Preparing
2a120f845e42: Waiting
bed676ceab7a: Preparing
6398d5cccd2c: Preparing
0b3e55694008: Waiting
0b0f2f2f5279: Preparing
7101ce66aabe: Waiting
b855d9031361: Waiting
65def485091a: Waiting
7c072cee6a29: Waiting
6fc1612f2b01: Waiting
fe4f44af763d: Waiting
613ab28cf833: Waiting
bed676ceab7a: Waiting
1e5fdc3d671c: Waiting
0b0f2f2f5279: Waiting
fec6bc1485c4: Pushed
671bda84405d: Pushed
4eb0cc401f99: Pushed
e3c48379e012: Pushed
127367305d6c: Pushed
989684deea07: Pushed
0b3e55694008: Pushed
65def485091a: Pushed
7101ce66aabe: Pushed
2a120f845e42: Pushed
fe4f44af763d: Layer already exists
6fc1612f2b01: Pushed
1e5fdc3d671c: Layer already exists
7c072cee6a29: Layer already exists
613ab28cf833: Layer already exists
bed676ceab7a: Layer already exists
6398d5cccd2c: Layer already exists
0b0f2f2f5279: Layer already exists
4de9cbb96816: Pushed
unknown blob
> Task :runners:google-cloud-dataflow-java:buildAndPushDockerJavaContainer FAILED
FAILURE: Build failed with an exception.
* Where:
Build file '<https://ci-beam.apache.org/job/beam_LoadTests_Java_GBK_Dataflow_V2_Batch_Java11/ws/src/runners/google-cloud-dataflow-java/build.gradle'> line: 282
* What went wrong:
Execution failed for task ':runners:google-cloud-dataflow-java:buildAndPushDockerJavaContainer'.
> Process 'command 'gcloud'' finished with non-zero exit value 1
* Try:
> Run with --stacktrace option to get the stack trace.
> Run with --info or --debug option to get more log output.
> Run with --scan to get full insights.
* Get more help at https://help.gradle.org
Deprecated Gradle features were used in this build, making it incompatible with Gradle 8.0.
You can use '--warning-mode all' to show the individual deprecation warnings and determine if they come from your own scripts or plugins.
See https://docs.gradle.org/7.3.2/userguide/command_line_interface.html#sec:command_line_warnings
Execution optimizations have been disabled for 1 invalid unit(s) of work during this build to ensure correctness.
Please consult deprecation warnings for more details.
BUILD FAILED in 26s
102 actionable tasks: 6 executed, 96 up-to-date
Publishing build scan...
https://gradle.com/s/bj5ytsdi7j25i
Build step 'Invoke Gradle script' changed build result to FAILURE
Build step 'Invoke Gradle script' marked build as failure
---------------------------------------------------------------------
To unsubscribe, e-mail: builds-unsubscribe@beam.apache.org
For additional commands, e-mail: builds-help@beam.apache.org
Jenkins build is back to normal : beam_LoadTests_Java_GBK_Dataflow_V2_Batch_Java11 #242
Posted by Apache Jenkins Server <je...@builds.apache.org>.
See <https://ci-beam.apache.org/job/beam_LoadTests_Java_GBK_Dataflow_V2_Batch_Java11/242/display/redirect?page=changes>
---------------------------------------------------------------------
To unsubscribe, e-mail: builds-unsubscribe@beam.apache.org
For additional commands, e-mail: builds-help@beam.apache.org
Build failed in Jenkins: beam_LoadTests_Java_GBK_Dataflow_V2_Batch_Java11 #241
Posted by Apache Jenkins Server <je...@builds.apache.org>.
See <https://ci-beam.apache.org/job/beam_LoadTests_Java_GBK_Dataflow_V2_Batch_Java11/241/display/redirect?page=changes>
Changes:
[akustov] fix name project id from secreton scio deploy action
[alexander.zhuravlev] [BEAM-13775] Fixed bug with run button
[ihr] [BEAM-13836] Fix the answers placeholders locations in the Python katas
[noreply] Merge pull request #16703 from [BEAM-13804][Playground][Bugfix] Add
[noreply] Merge pull request #16611 from [BEAM-13712][Playground] Add graph for
[noreply] Merge pull request #16757 from [BEAM-13655] [Playground] Persist the
------------------------------------------
[...truncated 401.33 KB...]
> Task :sdks:java:extensions:protobuf:extractIncludeProto UP-TO-DATE
> Task :sdks:java:extensions:protobuf:generateProto NO-SOURCE
> Task :sdks:java:fn-execution:compileJava UP-TO-DATE
> Task :sdks:java:io:synthetic:compileJava UP-TO-DATE
> Task :sdks:java:fn-execution:classes UP-TO-DATE
> Task :sdks:java:io:synthetic:classes UP-TO-DATE
> Task :sdks:java:extensions:arrow:compileJava UP-TO-DATE
> Task :sdks:java:extensions:arrow:classes UP-TO-DATE
> Task :sdks:java:io:synthetic:jar UP-TO-DATE
> Task :sdks:java:fn-execution:jar UP-TO-DATE
> Task :sdks:java:extensions:protobuf:compileJava UP-TO-DATE
> Task :sdks:java:extensions:arrow:jar UP-TO-DATE
> Task :sdks:java:extensions:protobuf:classes UP-TO-DATE
> Task :sdks:java:extensions:protobuf:jar UP-TO-DATE
> Task :sdks:java:io:kinesis:compileJava UP-TO-DATE
> Task :sdks:java:io:kinesis:classes UP-TO-DATE
> Task :sdks:java:io:kinesis:jar UP-TO-DATE
> Task :sdks:java:testing:test-utils:compileJava UP-TO-DATE
> Task :sdks:java:testing:test-utils:classes UP-TO-DATE
> Task :sdks:java:testing:test-utils:jar UP-TO-DATE
> Task :runners:core-construction-java:compileJava UP-TO-DATE
> Task :runners:core-construction-java:classes UP-TO-DATE
> Task :runners:core-construction-java:jar UP-TO-DATE
> Task :runners:core-java:compileJava UP-TO-DATE
> Task :runners:core-java:classes UP-TO-DATE
> Task :runners:core-java:jar UP-TO-DATE
> Task :sdks:java:extensions:google-cloud-platform-core:compileJava UP-TO-DATE
> Task :sdks:java:extensions:google-cloud-platform-core:classes UP-TO-DATE
> Task :sdks:java:extensions:google-cloud-platform-core:jar UP-TO-DATE
> Task :sdks:java:harness:compileJava UP-TO-DATE
> Task :sdks:java:harness:classes UP-TO-DATE
> Task :sdks:java:harness:jar UP-TO-DATE
> Task :runners:java-fn-execution:compileJava UP-TO-DATE
> Task :runners:java-fn-execution:classes UP-TO-DATE
> Task :runners:java-fn-execution:jar UP-TO-DATE
> Task :sdks:java:harness:shadowJar UP-TO-DATE
> Task :sdks:java:expansion-service:compileJava UP-TO-DATE
> Task :sdks:java:expansion-service:classes UP-TO-DATE
> Task :sdks:java:expansion-service:jar UP-TO-DATE
> Task :sdks:java:io:kafka:compileJava UP-TO-DATE
> Task :sdks:java:io:kafka:classes UP-TO-DATE
> Task :sdks:java:io:kafka:jar UP-TO-DATE
> Task :sdks:java:container:java11:copyDockerfileDependencies UP-TO-DATE
> Task :sdks:java:io:google-cloud-platform:compileJava UP-TO-DATE
> Task :sdks:java:io:google-cloud-platform:classes UP-TO-DATE
> Task :sdks:java:io:google-cloud-platform:jar UP-TO-DATE
> Task :sdks:java:testing:load-tests:compileJava UP-TO-DATE
> Task :sdks:java:testing:load-tests:classes UP-TO-DATE
> Task :sdks:java:testing:load-tests:jar UP-TO-DATE
> Task :runners:google-cloud-dataflow-java:compileJava UP-TO-DATE
> Task :runners:google-cloud-dataflow-java:classes UP-TO-DATE
> Task :runners:google-cloud-dataflow-java:jar UP-TO-DATE
> Task :sdks:java:container:goBuild
/home/jenkins/go/bin/go1.16.12 build -o ./build/target/linux_amd64/boot boot.go
> Task :sdks:java:container:java11:copySdkHarnessLauncher
Execution optimizations have been disabled for task ':sdks:java:container:java11:copySdkHarnessLauncher' to ensure correctness due to the following reasons:
- Gradle detected a problem with the following location: '/home/jenkins/jenkins-slave/workspace/beam_LoadTests_Java_GBK_Dataflow_V2_Batch_Java11/src/sdks/java/container/build/target'. Reason: Task ':sdks:java:container:java11:copySdkHarnessLauncher' uses this output of task ':sdks:java:container:downloadCloudProfilerAgent' without declaring an explicit or implicit dependency. This can lead to incorrect results being produced, depending on what order the tasks are executed. Please refer to https://docs.gradle.org/7.3.2/userguide/validation_problems.html#implicit_dependency for more details about this problem.
- Gradle detected a problem with the following location: '/home/jenkins/jenkins-slave/workspace/beam_LoadTests_Java_GBK_Dataflow_V2_Batch_Java11/src/sdks/java/container/build/target'. Reason: Task ':sdks:java:container:java11:copySdkHarnessLauncher' uses this output of task ':sdks:java:container:pullLicenses' without declaring an explicit or implicit dependency. This can lead to incorrect results being produced, depending on what order the tasks are executed. Please refer to https://docs.gradle.org/7.3.2/userguide/validation_problems.html#implicit_dependency for more details about this problem.
> Task :sdks:java:container:java11:dockerPrepare
> Task :sdks:java:container:java11:docker
> Task :runners:google-cloud-dataflow-java:buildAndPushDockerJavaContainer
WARNING: `gcloud docker` will not be supported for Docker client versions above 18.03.
As an alternative, use `gcloud auth configure-docker` to configure `docker` to
use `gcloud` as a credential helper, then use `docker` as you would for non-GCR
registries, e.g. `docker pull gcr.io/project-id/my-image`. Add
`--verbosity=error` to silence this warning: `gcloud docker
--verbosity=error -- pull gcr.io/project-id/my-image`.
See: https://cloud.google.com/container-registry/docs/support/deprecation-notices#gcloud-docker
The push refers to repository [us.gcr.io/apache-beam-testing/java-postcommit-it/java]
0475c2bcab62: Preparing
8f88667c5a61: Preparing
63e08dd7d6e2: Preparing
3b38f423fc7b: Preparing
7e31880e0bcb: Preparing
66a1431e6887: Preparing
481835e8ffb9: Preparing
bd316be44b29: Preparing
56030fdab8a9: Preparing
6b0ae66b5b62: Preparing
109f366ae298: Preparing
4f626016a87e: Preparing
49711297932f: Preparing
fe4f44af763d: Preparing
7c072cee6a29: Preparing
1e5fdc3d671c: Preparing
613ab28cf833: Preparing
bed676ceab7a: Preparing
6398d5cccd2c: Preparing
0b0f2f2f5279: Preparing
66a1431e6887: Waiting
49711297932f: Waiting
6b0ae66b5b62: Waiting
481835e8ffb9: Waiting
56030fdab8a9: Waiting
109f366ae298: Waiting
613ab28cf833: Waiting
bd316be44b29: Waiting
fe4f44af763d: Waiting
7c072cee6a29: Waiting
4f626016a87e: Waiting
0b0f2f2f5279: Waiting
8f88667c5a61: Pushed
63e08dd7d6e2: Pushed
7e31880e0bcb: Pushed
0475c2bcab62: Pushed
66a1431e6887: Pushed
3b38f423fc7b: Pushed
bd316be44b29: Pushed
56030fdab8a9: Pushed
481835e8ffb9: Pushed
6b0ae66b5b62: Pushed
fe4f44af763d: Layer already exists
7c072cee6a29: Layer already exists
1e5fdc3d671c: Layer already exists
bed676ceab7a: Layer already exists
613ab28cf833: Layer already exists
0b0f2f2f5279: Layer already exists
6398d5cccd2c: Layer already exists
4f626016a87e: Pushed
49711297932f: Pushed
109f366ae298: Pushed
20220214144154: digest: sha256:0027350501940d280b9b5647e91606ab299064c3fcb25c3b60ca81eb6e4e5a9e size: 4520
> Task :sdks:java:testing:load-tests:run
Feb 14, 2022 2:42:24 PM org.apache.beam.runners.dataflow.options.DataflowPipelineOptions$StagingLocationFactory create
INFO: No stagingLocation provided, falling back to gcpTempLocation
Feb 14, 2022 2:42:24 PM org.apache.beam.runners.dataflow.DataflowRunner fromOptions
INFO: PipelineOptions.filesToStage was not specified. Defaulting to files from the classpath: will stage 204 files. Enable logging at DEBUG level to see which files will be staged.
Feb 14, 2022 2:42:25 PM org.apache.beam.runners.dataflow.DataflowRunner run
INFO: Executing pipeline on the Dataflow Service, which will have billing implications related to Google Compute Engine usage and other Google Cloud Services.
Feb 14, 2022 2:42:27 PM org.apache.beam.runners.dataflow.util.PackageUtil stageClasspathElements
INFO: Uploading 204 files from PipelineOptions.filesToStage to staging location to prepare for execution.
Feb 14, 2022 2:42:27 PM org.apache.beam.runners.dataflow.util.PackageUtil stageClasspathElements
INFO: Staging files complete: 204 files cached, 0 files newly uploaded in 0 seconds
Feb 14, 2022 2:42:27 PM org.apache.beam.runners.dataflow.DataflowRunner run
INFO: Staging portable pipeline proto to gs://temp-storage-for-perf-tests/loadtests/staging/
Feb 14, 2022 2:42:27 PM org.apache.beam.runners.dataflow.util.PackageUtil tryStagePackage
INFO: Uploading <88848 bytes, hash 3efb0d20130195b0dfbfbfce8752d9f11821e6dd754dcb574867413b82ce926a> to gs://temp-storage-for-perf-tests/loadtests/staging/pipeline-PvsNIBMBlbDfv7_Oh1LZ8Rgh5t11TctXSGdBO4LOkmo.pb
Feb 14, 2022 2:42:29 PM org.apache.beam.runners.dataflow.DataflowPipelineTranslator$Translator addStep
INFO: Adding Read input as step s1
Feb 14, 2022 2:42:29 PM org.apache.beam.runners.dataflow.DataflowPipelineTranslator$Translator addStep
INFO: Adding Collect start time metrics as step s2
Feb 14, 2022 2:42:29 PM org.apache.beam.runners.dataflow.DataflowPipelineTranslator$Translator addStep
INFO: Adding Total bytes monitor as step s3
Feb 14, 2022 2:42:29 PM org.apache.beam.runners.dataflow.DataflowPipelineTranslator$Translator addStep
INFO: Adding Window.Into()/Window.Assign as step s4
Feb 14, 2022 2:42:29 PM org.apache.beam.runners.dataflow.DataflowPipelineTranslator$Translator addStep
INFO: Adding Group by key (0) as step s5
Feb 14, 2022 2:42:29 PM org.apache.beam.runners.dataflow.DataflowPipelineTranslator$Translator addStep
INFO: Adding Ungroup and reiterate (0) as step s6
Feb 14, 2022 2:42:29 PM org.apache.beam.runners.dataflow.DataflowPipelineTranslator$Translator addStep
INFO: Adding Collect end time metrics (0) as step s7
Feb 14, 2022 2:42:29 PM org.apache.beam.runners.dataflow.DataflowRunner run
INFO: Dataflow SDK version: 2.38.0-SNAPSHOT
Feb 14, 2022 2:42:30 PM org.apache.beam.runners.dataflow.DataflowRunner run
INFO: To access the Dataflow monitoring console, please navigate to https://console.cloud.google.com/dataflow/jobs/us-central1/2022-02-14_06_42_29-15912238307467880663?project=apache-beam-testing
Feb 14, 2022 2:42:30 PM org.apache.beam.runners.dataflow.DataflowRunner run
INFO: Submitted job: 2022-02-14_06_42_29-15912238307467880663
Feb 14, 2022 2:42:30 PM org.apache.beam.runners.dataflow.DataflowRunner run
INFO: To cancel the job using the 'gcloud' tool, run:
> gcloud dataflow jobs --project=apache-beam-testing cancel --region=us-central1 2022-02-14_06_42_29-15912238307467880663
Feb 14, 2022 2:42:34 PM org.apache.beam.runners.dataflow.util.MonitoringUtil$LoggingHandler process
WARNING: 2022-02-14T14:42:33.179Z: The workflow name is not a valid Cloud Label. Labels applied to Cloud resources (such as GCE Instances) for monitoring will be labeled with this modified job name: load0tests0java110dataflow0v20batch0gbk07-jenkins-02141442-ix9s. For the best monitoring experience, please name your job with a valid Cloud Label. For details, see: https://cloud.google.com/compute/docs/labeling-resources#restrictions
Feb 14, 2022 2:42:39 PM org.apache.beam.runners.dataflow.util.MonitoringUtil$LoggingHandler process
INFO: 2022-02-14T14:42:38.200Z: Worker configuration: e2-standard-2 in us-central1-c.
Feb 14, 2022 2:42:39 PM org.apache.beam.runners.dataflow.util.MonitoringUtil$LoggingHandler process
INFO: 2022-02-14T14:42:39.130Z: Expanding SplittableParDo operations into optimizable parts.
Feb 14, 2022 2:42:39 PM org.apache.beam.runners.dataflow.util.MonitoringUtil$LoggingHandler process
INFO: 2022-02-14T14:42:39.165Z: Expanding CollectionToSingleton operations into optimizable parts.
Feb 14, 2022 2:42:39 PM org.apache.beam.runners.dataflow.util.MonitoringUtil$LoggingHandler process
INFO: 2022-02-14T14:42:39.235Z: Expanding CoGroupByKey operations into optimizable parts.
Feb 14, 2022 2:42:39 PM org.apache.beam.runners.dataflow.util.MonitoringUtil$LoggingHandler process
INFO: 2022-02-14T14:42:39.299Z: Expanding GroupByKey operations into optimizable parts.
Feb 14, 2022 2:42:39 PM org.apache.beam.runners.dataflow.util.MonitoringUtil$LoggingHandler process
INFO: 2022-02-14T14:42:39.370Z: Fusing adjacent ParDo, Read, Write, and Flatten operations
Feb 14, 2022 2:42:39 PM org.apache.beam.runners.dataflow.util.MonitoringUtil$LoggingHandler process
INFO: 2022-02-14T14:42:39.405Z: Fusing consumer Read input/ParDo(OutputSingleSource)/ParMultiDo(OutputSingleSource) into Read input/Impulse
Feb 14, 2022 2:42:39 PM org.apache.beam.runners.dataflow.util.MonitoringUtil$LoggingHandler process
INFO: 2022-02-14T14:42:39.433Z: Fusing consumer Read-input-ParDo-BoundedSourceAsSDFWrapper--ParMultiDo-BoundedSourceAsSDFWrapper-/PairWithRestriction into Read input/ParDo(OutputSingleSource)/ParMultiDo(OutputSingleSource)
Feb 14, 2022 2:42:39 PM org.apache.beam.runners.dataflow.util.MonitoringUtil$LoggingHandler process
INFO: 2022-02-14T14:42:39.465Z: Fusing consumer Read-input-ParDo-BoundedSourceAsSDFWrapper--ParMultiDo-BoundedSourceAsSDFWrapper-/SplitWithSizing into Read-input-ParDo-BoundedSourceAsSDFWrapper--ParMultiDo-BoundedSourceAsSDFWrapper-/PairWithRestriction
Feb 14, 2022 2:42:39 PM org.apache.beam.runners.dataflow.util.MonitoringUtil$LoggingHandler process
INFO: 2022-02-14T14:42:39.501Z: Fusing consumer Collect start time metrics/ParMultiDo(TimeMonitor) into Read-input-ParDo-BoundedSourceAsSDFWrapper--ParMultiDo-BoundedSourceAsSDFWrapper-/ProcessElementAndRestrictionWithSizing
Feb 14, 2022 2:42:39 PM org.apache.beam.runners.dataflow.util.MonitoringUtil$LoggingHandler process
INFO: 2022-02-14T14:42:39.543Z: Fusing consumer Total bytes monitor/ParMultiDo(ByteMonitor) into Collect start time metrics/ParMultiDo(TimeMonitor)
Feb 14, 2022 2:42:39 PM org.apache.beam.runners.dataflow.util.MonitoringUtil$LoggingHandler process
INFO: 2022-02-14T14:42:39.577Z: Fusing consumer Window.Into()/Window.Assign into Total bytes monitor/ParMultiDo(ByteMonitor)
Feb 14, 2022 2:42:39 PM org.apache.beam.runners.dataflow.util.MonitoringUtil$LoggingHandler process
INFO: 2022-02-14T14:42:39.608Z: Fusing consumer Group by key (0)/Write into Window.Into()/Window.Assign
Feb 14, 2022 2:42:39 PM org.apache.beam.runners.dataflow.util.MonitoringUtil$LoggingHandler process
INFO: 2022-02-14T14:42:39.633Z: Fusing consumer Ungroup and reiterate (0)/ParMultiDo(UngroupAndReiterate) into Group by key (0)/Read
Feb 14, 2022 2:42:39 PM org.apache.beam.runners.dataflow.util.MonitoringUtil$LoggingHandler process
INFO: 2022-02-14T14:42:39.666Z: Fusing consumer Collect end time metrics (0)/ParMultiDo(TimeMonitor) into Ungroup and reiterate (0)/ParMultiDo(UngroupAndReiterate)
Feb 14, 2022 2:42:41 PM org.apache.beam.runners.dataflow.util.MonitoringUtil$LoggingHandler process
INFO: 2022-02-14T14:42:40.029Z: Executing operation Read input/Impulse+Read input/ParDo(OutputSingleSource)/ParMultiDo(OutputSingleSource)+Read-input-ParDo-BoundedSourceAsSDFWrapper--ParMultiDo-BoundedSourceAsSDFWrapper-/PairWithRestriction+Read-input-ParDo-BoundedSourceAsSDFWrapper--ParMultiDo-BoundedSourceAsSDFWrapper-/SplitWithSizing
Feb 14, 2022 2:42:41 PM org.apache.beam.runners.dataflow.util.MonitoringUtil$LoggingHandler process
INFO: 2022-02-14T14:42:40.104Z: Starting 5 ****s in us-central1-c...
Feb 14, 2022 2:42:46 PM org.apache.beam.runners.dataflow.util.MonitoringUtil$LoggingHandler process
INFO: 2022-02-14T14:42:45.272Z: Your project already contains 100 Dataflow-created metric descriptors, so new user metrics of the form custom.googleapis.com/* will not be created. However, all user metrics are also available in the metric dataflow.googleapis.com/job/user_counter. If you rely on the custom metrics, you can delete old / unused metric descriptors. See https://developers.google.com/apis-explorer/#p/monitoring/v3/monitoring.projects.metricDescriptors.list and https://developers.google.com/apis-explorer/#p/monitoring/v3/monitoring.projects.metricDescriptors.delete
Feb 14, 2022 2:43:26 PM org.apache.beam.runners.dataflow.util.MonitoringUtil$LoggingHandler process
INFO: 2022-02-14T14:43:25.440Z: Autoscaling: Raised the number of ****s to 5 based on the rate of progress in the currently running stage(s).
Feb 14, 2022 2:44:15 PM org.apache.beam.runners.dataflow.util.MonitoringUtil$LoggingHandler process
INFO: 2022-02-14T14:44:14.947Z: Workers have started successfully.
Feb 14, 2022 2:44:15 PM org.apache.beam.runners.dataflow.util.MonitoringUtil$LoggingHandler process
INFO: 2022-02-14T14:44:14.996Z: Workers have started successfully.
Feb 14, 2022 2:44:28 PM org.apache.beam.runners.dataflow.util.MonitoringUtil$LoggingHandler process
INFO: 2022-02-14T14:44:27.790Z: Finished operation Read input/Impulse+Read input/ParDo(OutputSingleSource)/ParMultiDo(OutputSingleSource)+Read-input-ParDo-BoundedSourceAsSDFWrapper--ParMultiDo-BoundedSourceAsSDFWrapper-/PairWithRestriction+Read-input-ParDo-BoundedSourceAsSDFWrapper--ParMultiDo-BoundedSourceAsSDFWrapper-/SplitWithSizing
Feb 14, 2022 2:44:28 PM org.apache.beam.runners.dataflow.util.MonitoringUtil$LoggingHandler process
INFO: 2022-02-14T14:44:27.938Z: Executing operation Group by key (0)/Create
FATAL: command execution failed
java.io.IOException: Backing channel 'apache-beam-jenkins-8' is disconnected.
at hudson.remoting.RemoteInvocationHandler.channelOrFail(RemoteInvocationHandler.java:216)
at hudson.remoting.RemoteInvocationHandler.invoke(RemoteInvocationHandler.java:286)
at com.sun.proxy.$Proxy135.isAlive(Unknown Source)
at hudson.Launcher$RemoteLauncher$ProcImpl.isAlive(Launcher.java:1211)
at hudson.Launcher$RemoteLauncher$ProcImpl.join(Launcher.java:1203)
at hudson.Launcher$ProcStarter.join(Launcher.java:523)
at hudson.plugins.gradle.Gradle.perform(Gradle.java:317)
at hudson.tasks.BuildStepMonitor$1.perform(BuildStepMonitor.java:20)
at hudson.model.AbstractBuild$AbstractBuildExecution.perform(AbstractBuild.java:803)
at hudson.model.Build$BuildExecution.build(Build.java:197)
at hudson.model.Build$BuildExecution.doRun(Build.java:163)
at hudson.model.AbstractBuild$AbstractBuildExecution.run(AbstractBuild.java:513)
at hudson.model.Run.execute(Run.java:1906)
at hudson.model.FreeStyleBuild.run(FreeStyleBuild.java:43)
at hudson.model.ResourceController.execute(ResourceController.java:97)
at hudson.model.Executor.run(Executor.java:429)
Caused by: java.io.IOException: Unexpected termination of the channel
at hudson.remoting.SynchronousCommandTransport$ReaderThread.run(SynchronousCommandTransport.java:75)
Caused by: java.io.EOFException
at java.io.ObjectInputStream$PeekInputStream.readFully(ObjectInputStream.java:2799)
at java.io.ObjectInputStream$BlockDataInputStream.readShort(ObjectInputStream.java:3274)
at java.io.ObjectInputStream.readStreamHeader(ObjectInputStream.java:934)
at java.io.ObjectInputStream.<init>(ObjectInputStream.java:396)
at hudson.remoting.ObjectInputStreamEx.<init>(ObjectInputStreamEx.java:49)
at hudson.remoting.Command.readFrom(Command.java:142)
at hudson.remoting.Command.readFrom(Command.java:128)
at hudson.remoting.AbstractSynchronousByteArrayCommandTransport.read(AbstractSynchronousByteArrayCommandTransport.java:35)
at hudson.remoting.SynchronousCommandTransport$ReaderThread.run(SynchronousCommandTransport.java:61)
Build step 'Invoke Gradle script' changed build result to FAILURE
Build step 'Invoke Gradle script' marked build as failure
ERROR: apache-beam-jenkins-8 is offline; cannot locate jdk_1.8_latest
---------------------------------------------------------------------
To unsubscribe, e-mail: builds-unsubscribe@beam.apache.org
For additional commands, e-mail: builds-help@beam.apache.org