You are viewing a plain text version of this content. The canonical link for it is here.
Posted to builds@solr.apache.org by Policeman Jenkins Server <je...@thetaphi.de> on 2023/01/21 20:48:40 UTC
[JENKINS] Solr-main-MacOSX (64bit/hotspot/jdk-16.0.2) - Build # 2194 - Still Unstable!
Build: https://jenkins.thetaphi.de/job/Solr-main-MacOSX/2194/
Java: 64bit/hotspot/jdk-16.0.2 -XX:-UseCompressedOops -XX:+UseParallelGC
4 tests failed.
FAILED: org.apache.solr.cloud.HttpPartitionOnCommitTest.test
Error Message:
org.apache.solr.client.solrj.impl.BaseHttpSolrClient$RemoteSolrException: Error from server at http://127.0.0.1:51721: Underlying core creation failed while creating collection: c8n_1x3_commits
Stack Trace:
org.apache.solr.client.solrj.impl.BaseHttpSolrClient$RemoteSolrException: Error from server at http://127.0.0.1:51721: Underlying core creation failed while creating collection: c8n_1x3_commits
at __randomizedtesting.SeedInfo.seed([4112EADB7F6F9B46:C946D501D193F6BE]:0)
at app//org.apache.solr.client.solrj.impl.HttpSolrClient.executeMethod(HttpSolrClient.java:745)
at app//org.apache.solr.client.solrj.impl.HttpSolrClient.request(HttpSolrClient.java:259)
at app//org.apache.solr.client.solrj.impl.HttpSolrClient.request(HttpSolrClient.java:240)
at app//org.apache.solr.client.solrj.SolrClient.request(SolrClient.java:1193)
at app//org.apache.solr.cloud.AbstractBasicDistributedZkTestBase.createCollection(AbstractBasicDistributedZkTestBase.java:1172)
at app//org.apache.solr.cloud.AbstractFullDistribZkTestBase.createCollection(AbstractFullDistribZkTestBase.java:2013)
at app//org.apache.solr.cloud.HttpPartitionOnCommitTest.oneShardTest(HttpPartitionOnCommitTest.java:131)
at app//org.apache.solr.cloud.HttpPartitionOnCommitTest.test(HttpPartitionOnCommitTest.java:66)
at java.base@16.0.2/jdk.internal.reflect.NativeMethodAccessorImpl.invoke0(Native Method)
at java.base@16.0.2/jdk.internal.reflect.NativeMethodAccessorImpl.invoke(NativeMethodAccessorImpl.java:78)
at java.base@16.0.2/jdk.internal.reflect.DelegatingMethodAccessorImpl.invoke(DelegatingMethodAccessorImpl.java:43)
at java.base@16.0.2/java.lang.reflect.Method.invoke(Method.java:567)
at app//com.carrotsearch.randomizedtesting.RandomizedRunner.invoke(RandomizedRunner.java:1758)
at app//com.carrotsearch.randomizedtesting.RandomizedRunner$8.evaluate(RandomizedRunner.java:946)
at app//com.carrotsearch.randomizedtesting.RandomizedRunner$9.evaluate(RandomizedRunner.java:982)
at app//com.carrotsearch.randomizedtesting.RandomizedRunner$10.evaluate(RandomizedRunner.java:996)
at app//org.apache.solr.BaseDistributedSearchTestCase$ShardsRepeatRule$ShardsFixedStatement.callStatement(BaseDistributedSearchTestCase.java:1165)
at app//org.apache.solr.BaseDistributedSearchTestCase$ShardsRepeatRule$ShardsStatement.evaluate(BaseDistributedSearchTestCase.java:1136)
at app//com.carrotsearch.randomizedtesting.rules.SystemPropertiesRestoreRule$1.evaluate(SystemPropertiesRestoreRule.java:80)
at app//org.junit.rules.RunRules.evaluate(RunRules.java:20)
at app//org.apache.lucene.tests.util.TestRuleSetupTeardownChained$1.evaluate(TestRuleSetupTeardownChained.java:44)
at app//org.apache.lucene.tests.util.AbstractBeforeAfterRule$1.evaluate(AbstractBeforeAfterRule.java:43)
at app//org.apache.lucene.tests.util.TestRuleThreadAndTestName$1.evaluate(TestRuleThreadAndTestName.java:45)
at app//org.apache.lucene.tests.util.TestRuleIgnoreAfterMaxFailures$1.evaluate(TestRuleIgnoreAfterMaxFailures.java:60)
at app//org.apache.lucene.tests.util.TestRuleMarkFailure$1.evaluate(TestRuleMarkFailure.java:44)
at app//org.junit.rules.RunRules.evaluate(RunRules.java:20)
at app//com.carrotsearch.randomizedtesting.rules.StatementAdapter.evaluate(StatementAdapter.java:36)
at app//com.carrotsearch.randomizedtesting.ThreadLeakControl$StatementRunner.run(ThreadLeakControl.java:390)
at app//com.carrotsearch.randomizedtesting.ThreadLeakControl.forkTimeoutingTask(ThreadLeakControl.java:843)
at app//com.carrotsearch.randomizedtesting.ThreadLeakControl$3.evaluate(ThreadLeakControl.java:490)
at app//com.carrotsearch.randomizedtesting.RandomizedRunner.runSingleTest(RandomizedRunner.java:955)
at app//com.carrotsearch.randomizedtesting.RandomizedRunner$5.evaluate(RandomizedRunner.java:840)
at app//com.carrotsearch.randomizedtesting.RandomizedRunner$6.evaluate(RandomizedRunner.java:891)
at app//com.carrotsearch.randomizedtesting.RandomizedRunner$7.evaluate(RandomizedRunner.java:902)
at app//com.carrotsearch.randomizedtesting.rules.StatementAdapter.evaluate(StatementAdapter.java:36)
at app//org.apache.lucene.tests.util.AbstractBeforeAfterRule$1.evaluate(AbstractBeforeAfterRule.java:43)
at app//org.apache.lucene.tests.util.AbstractBeforeAfterRule$1.evaluate(AbstractBeforeAfterRule.java:43)
at app//com.carrotsearch.randomizedtesting.rules.SystemPropertiesRestoreRule$1.evaluate(SystemPropertiesRestoreRule.java:80)
at app//org.junit.rules.RunRules.evaluate(RunRules.java:20)
at app//org.apache.lucene.tests.util.AbstractBeforeAfterRule$1.evaluate(AbstractBeforeAfterRule.java:43)
at app//com.carrotsearch.randomizedtesting.rules.StatementAdapter.evaluate(StatementAdapter.java:36)
at app//org.apache.lucene.tests.util.TestRuleStoreClassName$1.evaluate(TestRuleStoreClassName.java:38)
at app//com.carrotsearch.randomizedtesting.rules.NoShadowingOrOverridesOnMethodsRule$1.evaluate(NoShadowingOrOverridesOnMethodsRule.java:40)
at app//com.carrotsearch.randomizedtesting.rules.NoShadowingOrOverridesOnMethodsRule$1.evaluate(NoShadowingOrOverridesOnMethodsRule.java:40)
at app//com.carrotsearch.randomizedtesting.rules.StatementAdapter.evaluate(StatementAdapter.java:36)
at app//com.carrotsearch.randomizedtesting.rules.StatementAdapter.evaluate(StatementAdapter.java:36)
at app//org.apache.lucene.tests.util.TestRuleAssertionsRequired$1.evaluate(TestRuleAssertionsRequired.java:53)
at app//org.apache.lucene.tests.util.AbstractBeforeAfterRule$1.evaluate(AbstractBeforeAfterRule.java:43)
at app//org.apache.lucene.tests.util.TestRuleMarkFailure$1.evaluate(TestRuleMarkFailure.java:44)
at app//org.apache.lucene.tests.util.TestRuleIgnoreAfterMaxFailures$1.evaluate(TestRuleIgnoreAfterMaxFailures.java:60)
at app//org.apache.lucene.tests.util.TestRuleIgnoreTestSuites$1.evaluate(TestRuleIgnoreTestSuites.java:47)
at app//org.junit.rules.RunRules.evaluate(RunRules.java:20)
at app//com.carrotsearch.randomizedtesting.rules.StatementAdapter.evaluate(StatementAdapter.java:36)
at app//com.carrotsearch.randomizedtesting.ThreadLeakControl$StatementRunner.run(ThreadLeakControl.java:390)
at app//com.carrotsearch.randomizedtesting.ThreadLeakControl.lambda$forkTimeoutingTask$0(ThreadLeakControl.java:850)
at java.base@16.0.2/java.lang.Thread.run(Thread.java:831)
FAILED: org.apache.solr.search.join.TestCloudNestedDocsSort.classMethod
Error Message:
java.lang.Exception: Suite timeout exceeded (>= 7200000 msec).
Stack Trace:
java.lang.Exception: Suite timeout exceeded (>= 7200000 msec).
at __randomizedtesting.SeedInfo.seed([4112EADB7F6F9B46]:0)
FAILED: org.apache.solr.security.hadoop.SaslZkACLProviderTest.testSaslZkACLProvider
Error Message:
org.apache.solr.common.SolrException: java.util.concurrent.TimeoutException: Could not connect to ZooKeeper localhost:62511/solr within 30000 ms
Stack Trace:
org.apache.solr.common.SolrException: java.util.concurrent.TimeoutException: Could not connect to ZooKeeper localhost:62511/solr within 30000 ms
at __randomizedtesting.SeedInfo.seed([4112EADB7F6F9B46:45E6BC03E62B3848]:0)
at app//org.apache.solr.common.cloud.SolrZkClient.<init>(SolrZkClient.java:225)
at app//org.apache.solr.common.cloud.SolrZkClient.<init>(SolrZkClient.java:137)
at app//org.apache.solr.common.cloud.SolrZkClient.<init>(SolrZkClient.java:120)
at app//org.apache.solr.common.cloud.SolrZkClient.<init>(SolrZkClient.java:112)
at app//org.apache.solr.common.cloud.SolrZkClient.<init>(SolrZkClient.java:108)
at app//org.apache.solr.security.hadoop.SaslZkACLProviderTest$SolrZkClientNoACLs.<init>(SaslZkACLProviderTest.java:194)
at app//org.apache.solr.security.hadoop.SaslZkACLProviderTest.setupZNodes(SaslZkACLProviderTest.java:128)
at app//org.apache.solr.security.hadoop.SaslZkACLProviderTest.setUp(SaslZkACLProviderTest.java:101)
at java.base@16.0.2/jdk.internal.reflect.NativeMethodAccessorImpl.invoke0(Native Method)
at java.base@16.0.2/jdk.internal.reflect.NativeMethodAccessorImpl.invoke(NativeMethodAccessorImpl.java:78)
at java.base@16.0.2/jdk.internal.reflect.DelegatingMethodAccessorImpl.invoke(DelegatingMethodAccessorImpl.java:43)
at java.base@16.0.2/java.lang.reflect.Method.invoke(Method.java:567)
at app//com.carrotsearch.randomizedtesting.RandomizedRunner.invoke(RandomizedRunner.java:1758)
at app//com.carrotsearch.randomizedtesting.RandomizedRunner$9.evaluate(RandomizedRunner.java:980)
at app//com.carrotsearch.randomizedtesting.RandomizedRunner$10.evaluate(RandomizedRunner.java:996)
at app//com.carrotsearch.randomizedtesting.rules.SystemPropertiesRestoreRule$1.evaluate(SystemPropertiesRestoreRule.java:80)
at app//org.junit.rules.RunRules.evaluate(RunRules.java:20)
at app//org.apache.lucene.tests.util.TestRuleSetupTeardownChained$1.evaluate(TestRuleSetupTeardownChained.java:44)
at app//org.apache.lucene.tests.util.AbstractBeforeAfterRule$1.evaluate(AbstractBeforeAfterRule.java:43)
at app//org.apache.lucene.tests.util.TestRuleThreadAndTestName$1.evaluate(TestRuleThreadAndTestName.java:45)
at app//org.apache.lucene.tests.util.TestRuleIgnoreAfterMaxFailures$1.evaluate(TestRuleIgnoreAfterMaxFailures.java:60)
at app//org.apache.lucene.tests.util.TestRuleMarkFailure$1.evaluate(TestRuleMarkFailure.java:44)
at app//org.junit.rules.RunRules.evaluate(RunRules.java:20)
at app//com.carrotsearch.randomizedtesting.rules.StatementAdapter.evaluate(StatementAdapter.java:36)
at app//com.carrotsearch.randomizedtesting.ThreadLeakControl$StatementRunner.run(ThreadLeakControl.java:390)
at app//com.carrotsearch.randomizedtesting.ThreadLeakControl.forkTimeoutingTask(ThreadLeakControl.java:843)
at app//com.carrotsearch.randomizedtesting.ThreadLeakControl$3.evaluate(ThreadLeakControl.java:490)
at app//com.carrotsearch.randomizedtesting.RandomizedRunner.runSingleTest(RandomizedRunner.java:955)
at app//com.carrotsearch.randomizedtesting.RandomizedRunner$5.evaluate(RandomizedRunner.java:840)
at app//com.carrotsearch.randomizedtesting.RandomizedRunner$6.evaluate(RandomizedRunner.java:891)
at app//com.carrotsearch.randomizedtesting.RandomizedRunner$7.evaluate(RandomizedRunner.java:902)
at app//com.carrotsearch.randomizedtesting.rules.StatementAdapter.evaluate(StatementAdapter.java:36)
at app//org.apache.lucene.tests.util.AbstractBeforeAfterRule$1.evaluate(AbstractBeforeAfterRule.java:43)
at app//org.apache.lucene.tests.util.AbstractBeforeAfterRule$1.evaluate(AbstractBeforeAfterRule.java:43)
at app//com.carrotsearch.randomizedtesting.rules.SystemPropertiesRestoreRule$1.evaluate(SystemPropertiesRestoreRule.java:80)
at app//org.junit.rules.RunRules.evaluate(RunRules.java:20)
at app//org.apache.lucene.tests.util.AbstractBeforeAfterRule$1.evaluate(AbstractBeforeAfterRule.java:43)
at app//com.carrotsearch.randomizedtesting.rules.StatementAdapter.evaluate(StatementAdapter.java:36)
at app//org.apache.lucene.tests.util.TestRuleStoreClassName$1.evaluate(TestRuleStoreClassName.java:38)
at app//com.carrotsearch.randomizedtesting.rules.NoShadowingOrOverridesOnMethodsRule$1.evaluate(NoShadowingOrOverridesOnMethodsRule.java:40)
at app//com.carrotsearch.randomizedtesting.rules.NoShadowingOrOverridesOnMethodsRule$1.evaluate(NoShadowingOrOverridesOnMethodsRule.java:40)
at app//com.carrotsearch.randomizedtesting.rules.StatementAdapter.evaluate(StatementAdapter.java:36)
at app//com.carrotsearch.randomizedtesting.rules.StatementAdapter.evaluate(StatementAdapter.java:36)
at app//org.apache.lucene.tests.util.TestRuleAssertionsRequired$1.evaluate(TestRuleAssertionsRequired.java:53)
at app//org.apache.lucene.tests.util.AbstractBeforeAfterRule$1.evaluate(AbstractBeforeAfterRule.java:43)
at app//org.apache.lucene.tests.util.TestRuleMarkFailure$1.evaluate(TestRuleMarkFailure.java:44)
at app//org.apache.lucene.tests.util.TestRuleIgnoreAfterMaxFailures$1.evaluate(TestRuleIgnoreAfterMaxFailures.java:60)
at app//org.apache.lucene.tests.util.TestRuleIgnoreTestSuites$1.evaluate(TestRuleIgnoreTestSuites.java:47)
at app//org.junit.rules.RunRules.evaluate(RunRules.java:20)
at app//com.carrotsearch.randomizedtesting.rules.StatementAdapter.evaluate(StatementAdapter.java:36)
at app//com.carrotsearch.randomizedtesting.ThreadLeakControl$StatementRunner.run(ThreadLeakControl.java:390)
at app//com.carrotsearch.randomizedtesting.ThreadLeakControl.lambda$forkTimeoutingTask$0(ThreadLeakControl.java:850)
at java.base@16.0.2/java.lang.Thread.run(Thread.java:831)
Caused by: java.util.concurrent.TimeoutException: Could not connect to ZooKeeper localhost:62511/solr within 30000 ms
at org.apache.solr.common.cloud.ConnectionManager.waitForConnected(ConnectionManager.java:297)
at org.apache.solr.common.cloud.SolrZkClient.<init>(SolrZkClient.java:216)
... 52 more
FAILED: org.apache.solr.opentelemetry.OtelTracerConfiguratorTest.classMethod
Error Message:
com.carrotsearch.randomizedtesting.ThreadLeakError: 1 thread leaked from SUITE scope at org.apache.solr.opentelemetry.OtelTracerConfiguratorTest:
1) Thread[id=67, name=BatchSpanProcessor_WorkerThread-1, state=TIMED_WAITING, group=TGRP-OtelTracerConfiguratorTest]
at java.base@16.0.2/jdk.internal.misc.Unsafe.park(Native Method)
at java.base@16.0.2/java.util.concurrent.locks.LockSupport.parkNanos(LockSupport.java:252)
at java.base@16.0.2/java.util.concurrent.locks.AbstractQueuedSynchronizer$ConditionObject.awaitNanos(AbstractQueuedSynchronizer.java:1661)
at java.base@16.0.2/java.util.concurrent.ArrayBlockingQueue.poll(ArrayBlockingQueue.java:435)
at app//io.opentelemetry.sdk.trace.export.BatchSpanProcessor$Worker.run(BatchSpanProcessor.java:252)
at java.base@16.0.2/java.lang.Thread.run(Thread.java:831)
Stack Trace:
com.carrotsearch.randomizedtesting.ThreadLeakError: 1 thread leaked from SUITE scope at org.apache.solr.opentelemetry.OtelTracerConfiguratorTest:
1) Thread[id=67, name=BatchSpanProcessor_WorkerThread-1, state=TIMED_WAITING, group=TGRP-OtelTracerConfiguratorTest]
at java.base@16.0.2/jdk.internal.misc.Unsafe.park(Native Method)
at java.base@16.0.2/java.util.concurrent.locks.LockSupport.parkNanos(LockSupport.java:252)
at java.base@16.0.2/java.util.concurrent.locks.AbstractQueuedSynchronizer$ConditionObject.awaitNanos(AbstractQueuedSynchronizer.java:1661)
at java.base@16.0.2/java.util.concurrent.ArrayBlockingQueue.poll(ArrayBlockingQueue.java:435)
at app//io.opentelemetry.sdk.trace.export.BatchSpanProcessor$Worker.run(BatchSpanProcessor.java:252)
at java.base@16.0.2/java.lang.Thread.run(Thread.java:831)
at __randomizedtesting.SeedInfo.seed([4112EADB7F6F9B46]:0)
[JENKINS] Solr-main-MacOSX (64bit/hotspot/jdk-19) - Build # 2196 - Still Unstable!
Posted by Policeman Jenkins Server <je...@thetaphi.de>.
Build: https://jenkins.thetaphi.de/job/Solr-main-MacOSX/2196/
Java: 64bit/hotspot/jdk-19 -XX:+UseCompressedOops -XX:+UseParallelGC
1 tests failed.
FAILED: org.apache.solr.search.TestCoordinatorRole.testNRTRestart
Error Message:
org.apache.solr.client.solrj.SolrServerException: IOException occurred when talking to server at: http://127.0.0.1:61256/solr
Stack Trace:
org.apache.solr.client.solrj.SolrServerException: IOException occurred when talking to server at: http://127.0.0.1:61256/solr
at __randomizedtesting.SeedInfo.seed([25FF080ACC0B4317:D56BB8C16E1691C1]:0)
at app//org.apache.solr.client.solrj.impl.HttpSolrClient.executeMethod(HttpSolrClient.java:757)
at app//org.apache.solr.client.solrj.impl.HttpSolrClient.request(HttpSolrClient.java:259)
at app//org.apache.solr.client.solrj.impl.HttpSolrClient.request(HttpSolrClient.java:240)
at app//org.apache.solr.client.solrj.SolrRequest.process(SolrRequest.java:234)
at app//org.apache.solr.client.solrj.SolrClient.commit(SolrClient.java:466)
at app//org.apache.solr.client.solrj.SolrClient.commit(SolrClient.java:423)
at app//org.apache.solr.search.TestCoordinatorRole.testNRTRestart(TestCoordinatorRole.java:247)
at java.base@19/jdk.internal.reflect.DirectMethodHandleAccessor.invoke(DirectMethodHandleAccessor.java:104)
at java.base@19/java.lang.reflect.Method.invoke(Method.java:578)
at app//com.carrotsearch.randomizedtesting.RandomizedRunner.invoke(RandomizedRunner.java:1758)
at app//com.carrotsearch.randomizedtesting.RandomizedRunner$8.evaluate(RandomizedRunner.java:946)
at app//com.carrotsearch.randomizedtesting.RandomizedRunner$9.evaluate(RandomizedRunner.java:982)
at app//com.carrotsearch.randomizedtesting.RandomizedRunner$10.evaluate(RandomizedRunner.java:996)
at app//com.carrotsearch.randomizedtesting.rules.SystemPropertiesRestoreRule$1.evaluate(SystemPropertiesRestoreRule.java:80)
at app//org.junit.rules.RunRules.evaluate(RunRules.java:20)
at app//org.apache.lucene.tests.util.TestRuleSetupTeardownChained$1.evaluate(TestRuleSetupTeardownChained.java:44)
at app//org.apache.lucene.tests.util.AbstractBeforeAfterRule$1.evaluate(AbstractBeforeAfterRule.java:43)
at app//org.apache.lucene.tests.util.TestRuleThreadAndTestName$1.evaluate(TestRuleThreadAndTestName.java:45)
at app//org.apache.lucene.tests.util.TestRuleIgnoreAfterMaxFailures$1.evaluate(TestRuleIgnoreAfterMaxFailures.java:60)
at app//org.apache.lucene.tests.util.TestRuleMarkFailure$1.evaluate(TestRuleMarkFailure.java:44)
at app//org.junit.rules.RunRules.evaluate(RunRules.java:20)
at app//com.carrotsearch.randomizedtesting.rules.StatementAdapter.evaluate(StatementAdapter.java:36)
at app//com.carrotsearch.randomizedtesting.ThreadLeakControl$StatementRunner.run(ThreadLeakControl.java:390)
at app//com.carrotsearch.randomizedtesting.ThreadLeakControl.forkTimeoutingTask(ThreadLeakControl.java:843)
at app//com.carrotsearch.randomizedtesting.ThreadLeakControl$3.evaluate(ThreadLeakControl.java:490)
at app//com.carrotsearch.randomizedtesting.RandomizedRunner.runSingleTest(RandomizedRunner.java:955)
at app//com.carrotsearch.randomizedtesting.RandomizedRunner$5.evaluate(RandomizedRunner.java:840)
at app//com.carrotsearch.randomizedtesting.RandomizedRunner$6.evaluate(RandomizedRunner.java:891)
at app//com.carrotsearch.randomizedtesting.RandomizedRunner$7.evaluate(RandomizedRunner.java:902)
at app//com.carrotsearch.randomizedtesting.rules.StatementAdapter.evaluate(StatementAdapter.java:36)
at app//org.apache.lucene.tests.util.AbstractBeforeAfterRule$1.evaluate(AbstractBeforeAfterRule.java:43)
at app//org.apache.lucene.tests.util.AbstractBeforeAfterRule$1.evaluate(AbstractBeforeAfterRule.java:43)
at app//com.carrotsearch.randomizedtesting.rules.SystemPropertiesRestoreRule$1.evaluate(SystemPropertiesRestoreRule.java:80)
at app//org.junit.rules.RunRules.evaluate(RunRules.java:20)
at app//org.apache.lucene.tests.util.AbstractBeforeAfterRule$1.evaluate(AbstractBeforeAfterRule.java:43)
at app//com.carrotsearch.randomizedtesting.rules.StatementAdapter.evaluate(StatementAdapter.java:36)
at app//org.apache.lucene.tests.util.TestRuleStoreClassName$1.evaluate(TestRuleStoreClassName.java:38)
at app//com.carrotsearch.randomizedtesting.rules.NoShadowingOrOverridesOnMethodsRule$1.evaluate(NoShadowingOrOverridesOnMethodsRule.java:40)
at app//com.carrotsearch.randomizedtesting.rules.NoShadowingOrOverridesOnMethodsRule$1.evaluate(NoShadowingOrOverridesOnMethodsRule.java:40)
at app//com.carrotsearch.randomizedtesting.rules.StatementAdapter.evaluate(StatementAdapter.java:36)
at app//com.carrotsearch.randomizedtesting.rules.StatementAdapter.evaluate(StatementAdapter.java:36)
at app//org.apache.lucene.tests.util.TestRuleAssertionsRequired$1.evaluate(TestRuleAssertionsRequired.java:53)
at app//org.apache.lucene.tests.util.AbstractBeforeAfterRule$1.evaluate(AbstractBeforeAfterRule.java:43)
at app//org.apache.lucene.tests.util.TestRuleMarkFailure$1.evaluate(TestRuleMarkFailure.java:44)
at app//org.apache.lucene.tests.util.TestRuleIgnoreAfterMaxFailures$1.evaluate(TestRuleIgnoreAfterMaxFailures.java:60)
at app//org.apache.lucene.tests.util.TestRuleIgnoreTestSuites$1.evaluate(TestRuleIgnoreTestSuites.java:47)
at app//org.junit.rules.RunRules.evaluate(RunRules.java:20)
at app//com.carrotsearch.randomizedtesting.rules.StatementAdapter.evaluate(StatementAdapter.java:36)
at app//com.carrotsearch.randomizedtesting.ThreadLeakControl$StatementRunner.run(ThreadLeakControl.java:390)
at app//com.carrotsearch.randomizedtesting.ThreadLeakControl.lambda$forkTimeoutingTask$0(ThreadLeakControl.java:850)
at java.base@19/java.lang.Thread.run(Thread.java:1589)
Caused by: org.apache.http.NoHttpResponseException: 127.0.0.1:61256 failed to respond
at app//org.apache.http.impl.conn.DefaultHttpResponseParser.parseHead(DefaultHttpResponseParser.java:141)
at app//org.apache.http.impl.conn.DefaultHttpResponseParser.parseHead(DefaultHttpResponseParser.java:56)
at app//org.apache.http.impl.io.AbstractMessageParser.parse(AbstractMessageParser.java:259)
at app//org.apache.http.impl.DefaultBHttpClientConnection.receiveResponseHeader(DefaultBHttpClientConnection.java:163)
at app//org.apache.http.impl.conn.CPoolProxy.receiveResponseHeader(CPoolProxy.java:157)
at app//org.apache.http.protocol.HttpRequestExecutor.doReceiveResponse(HttpRequestExecutor.java:273)
at app//org.apache.http.protocol.HttpRequestExecutor.execute(HttpRequestExecutor.java:125)
at app//org.apache.http.impl.execchain.MainClientExec.execute(MainClientExec.java:272)
at app//org.apache.http.impl.execchain.ProtocolExec.execute(ProtocolExec.java:186)
at app//org.apache.http.impl.execchain.RetryExec.execute(RetryExec.java:89)
at app//org.apache.http.impl.execchain.RedirectExec.execute(RedirectExec.java:110)
at app//org.apache.http.impl.client.InternalHttpClient.doExecute(InternalHttpClient.java:185)
at app//org.apache.http.impl.client.CloseableHttpClient.execute(CloseableHttpClient.java:83)
at app//org.apache.http.impl.client.CloseableHttpClient.execute(CloseableHttpClient.java:56)
at app//org.apache.solr.client.solrj.impl.HttpSolrClient.executeMethod(HttpSolrClient.java:602)
... 50 more
[JENKINS] Solr-main-MacOSX (64bit/hotspot/jdk-18) - Build # 2195 - Still Unstable!
Posted by Policeman Jenkins Server <je...@thetaphi.de>.
Build: https://jenkins.thetaphi.de/job/Solr-main-MacOSX/2195/
Java: 64bit/hotspot/jdk-18 -XX:+UseCompressedOops -XX:+UseG1GC
1 tests failed.
FAILED: org.apache.solr.cloud.HttpPartitionOnCommitTest.test
Error Message:
org.apache.solr.client.solrj.impl.BaseHttpSolrClient$RemoteSolrException: Error from server at http://127.0.0.1:61093/thao/q: Underlying core creation failed while creating collection: c8n_1x3_commits
Stack Trace:
org.apache.solr.client.solrj.impl.BaseHttpSolrClient$RemoteSolrException: Error from server at http://127.0.0.1:61093/thao/q: Underlying core creation failed while creating collection: c8n_1x3_commits
at __randomizedtesting.SeedInfo.seed([201E3A175DA39ED6:A84A05CDF35FF32E]:0)
at app//org.apache.solr.client.solrj.impl.HttpSolrClient.executeMethod(HttpSolrClient.java:745)
at app//org.apache.solr.client.solrj.impl.HttpSolrClient.request(HttpSolrClient.java:259)
at app//org.apache.solr.client.solrj.impl.HttpSolrClient.request(HttpSolrClient.java:240)
at app//org.apache.solr.client.solrj.SolrClient.request(SolrClient.java:1193)
at app//org.apache.solr.cloud.AbstractBasicDistributedZkTestBase.createCollection(AbstractBasicDistributedZkTestBase.java:1172)
at app//org.apache.solr.cloud.AbstractFullDistribZkTestBase.createCollection(AbstractFullDistribZkTestBase.java:2013)
at app//org.apache.solr.cloud.HttpPartitionOnCommitTest.oneShardTest(HttpPartitionOnCommitTest.java:131)
at app//org.apache.solr.cloud.HttpPartitionOnCommitTest.test(HttpPartitionOnCommitTest.java:66)
at java.base@18/jdk.internal.reflect.DirectMethodHandleAccessor.invoke(DirectMethodHandleAccessor.java:104)
at java.base@18/java.lang.reflect.Method.invoke(Method.java:577)
at app//com.carrotsearch.randomizedtesting.RandomizedRunner.invoke(RandomizedRunner.java:1758)
at app//com.carrotsearch.randomizedtesting.RandomizedRunner$8.evaluate(RandomizedRunner.java:946)
at app//com.carrotsearch.randomizedtesting.RandomizedRunner$9.evaluate(RandomizedRunner.java:982)
at app//com.carrotsearch.randomizedtesting.RandomizedRunner$10.evaluate(RandomizedRunner.java:996)
at app//org.apache.solr.BaseDistributedSearchTestCase$ShardsRepeatRule$ShardsFixedStatement.callStatement(BaseDistributedSearchTestCase.java:1165)
at app//org.apache.solr.BaseDistributedSearchTestCase$ShardsRepeatRule$ShardsStatement.evaluate(BaseDistributedSearchTestCase.java:1136)
at app//com.carrotsearch.randomizedtesting.rules.SystemPropertiesRestoreRule$1.evaluate(SystemPropertiesRestoreRule.java:80)
at app//org.junit.rules.RunRules.evaluate(RunRules.java:20)
at app//org.apache.lucene.tests.util.TestRuleSetupTeardownChained$1.evaluate(TestRuleSetupTeardownChained.java:44)
at app//org.apache.lucene.tests.util.AbstractBeforeAfterRule$1.evaluate(AbstractBeforeAfterRule.java:43)
at app//org.apache.lucene.tests.util.TestRuleThreadAndTestName$1.evaluate(TestRuleThreadAndTestName.java:45)
at app//org.apache.lucene.tests.util.TestRuleIgnoreAfterMaxFailures$1.evaluate(TestRuleIgnoreAfterMaxFailures.java:60)
at app//org.apache.lucene.tests.util.TestRuleMarkFailure$1.evaluate(TestRuleMarkFailure.java:44)
at app//org.junit.rules.RunRules.evaluate(RunRules.java:20)
at app//com.carrotsearch.randomizedtesting.rules.StatementAdapter.evaluate(StatementAdapter.java:36)
at app//com.carrotsearch.randomizedtesting.ThreadLeakControl$StatementRunner.run(ThreadLeakControl.java:390)
at app//com.carrotsearch.randomizedtesting.ThreadLeakControl.forkTimeoutingTask(ThreadLeakControl.java:843)
at app//com.carrotsearch.randomizedtesting.ThreadLeakControl$3.evaluate(ThreadLeakControl.java:490)
at app//com.carrotsearch.randomizedtesting.RandomizedRunner.runSingleTest(RandomizedRunner.java:955)
at app//com.carrotsearch.randomizedtesting.RandomizedRunner$5.evaluate(RandomizedRunner.java:840)
at app//com.carrotsearch.randomizedtesting.RandomizedRunner$6.evaluate(RandomizedRunner.java:891)
at app//com.carrotsearch.randomizedtesting.RandomizedRunner$7.evaluate(RandomizedRunner.java:902)
at app//com.carrotsearch.randomizedtesting.rules.StatementAdapter.evaluate(StatementAdapter.java:36)
at app//org.apache.lucene.tests.util.AbstractBeforeAfterRule$1.evaluate(AbstractBeforeAfterRule.java:43)
at app//org.apache.lucene.tests.util.AbstractBeforeAfterRule$1.evaluate(AbstractBeforeAfterRule.java:43)
at app//com.carrotsearch.randomizedtesting.rules.SystemPropertiesRestoreRule$1.evaluate(SystemPropertiesRestoreRule.java:80)
at app//org.junit.rules.RunRules.evaluate(RunRules.java:20)
at app//org.apache.lucene.tests.util.AbstractBeforeAfterRule$1.evaluate(AbstractBeforeAfterRule.java:43)
at app//com.carrotsearch.randomizedtesting.rules.StatementAdapter.evaluate(StatementAdapter.java:36)
at app//org.apache.lucene.tests.util.TestRuleStoreClassName$1.evaluate(TestRuleStoreClassName.java:38)
at app//com.carrotsearch.randomizedtesting.rules.NoShadowingOrOverridesOnMethodsRule$1.evaluate(NoShadowingOrOverridesOnMethodsRule.java:40)
at app//com.carrotsearch.randomizedtesting.rules.NoShadowingOrOverridesOnMethodsRule$1.evaluate(NoShadowingOrOverridesOnMethodsRule.java:40)
at app//com.carrotsearch.randomizedtesting.rules.StatementAdapter.evaluate(StatementAdapter.java:36)
at app//com.carrotsearch.randomizedtesting.rules.StatementAdapter.evaluate(StatementAdapter.java:36)
at app//org.apache.lucene.tests.util.TestRuleAssertionsRequired$1.evaluate(TestRuleAssertionsRequired.java:53)
at app//org.apache.lucene.tests.util.AbstractBeforeAfterRule$1.evaluate(AbstractBeforeAfterRule.java:43)
at app//org.apache.lucene.tests.util.TestRuleMarkFailure$1.evaluate(TestRuleMarkFailure.java:44)
at app//org.apache.lucene.tests.util.TestRuleIgnoreAfterMaxFailures$1.evaluate(TestRuleIgnoreAfterMaxFailures.java:60)
at app//org.apache.lucene.tests.util.TestRuleIgnoreTestSuites$1.evaluate(TestRuleIgnoreTestSuites.java:47)
at app//org.junit.rules.RunRules.evaluate(RunRules.java:20)
at app//com.carrotsearch.randomizedtesting.rules.StatementAdapter.evaluate(StatementAdapter.java:36)
at app//com.carrotsearch.randomizedtesting.ThreadLeakControl$StatementRunner.run(ThreadLeakControl.java:390)
at app//com.carrotsearch.randomizedtesting.ThreadLeakControl.lambda$forkTimeoutingTask$0(ThreadLeakControl.java:850)
at java.base@18/java.lang.Thread.run(Thread.java:833)