You are viewing a plain text version of this content. The canonical link for it is here.
Posted to commits@phoenix.apache.org by Apache Jenkins Server <je...@builds.apache.org> on 2014/07/25 11:46:32 UTC
Build failed in Jenkins: Phoenix | 3.0 | Hadoop1 #151
See <https://builds.apache.org/job/Phoenix-3.0-hadoop1/151/changes>
Changes:
[gabrielr] PHOENIX-908 Remove "Release unknown lockId" warning
------------------------------------------
[...truncated 218 lines...]
Running org.apache.phoenix.iterate.SpoolingResultIteratorTest
Tests run: 3, Failures: 0, Errors: 0, Skipped: 0, Time elapsed: 0.09 sec - in org.apache.phoenix.iterate.SpoolingResultIteratorTest
Running org.apache.phoenix.hbase.index.util.TestIndexManagementUtil
Tests run: 3, Failures: 0, Errors: 0, Skipped: 0, Time elapsed: 0.009 sec - in org.apache.phoenix.hbase.index.util.TestIndexManagementUtil
Running org.apache.phoenix.hbase.index.parallel.TestThreadPoolBuilder
Tests run: 2, Failures: 0, Errors: 0, Skipped: 0, Time elapsed: 0.006 sec - in org.apache.phoenix.hbase.index.parallel.TestThreadPoolBuilder
Running org.apache.phoenix.hbase.index.parallel.TestThreadPoolManager
Tests run: 3, Failures: 0, Errors: 0, Skipped: 0, Time elapsed: 0.007 sec - in org.apache.phoenix.hbase.index.parallel.TestThreadPoolManager
Running org.apache.phoenix.hbase.index.write.recovery.TestPerRegionIndexWriteCache
Tests run: 3, Failures: 0, Errors: 0, Skipped: 0, Time elapsed: 0.032 sec - in org.apache.phoenix.hbase.index.write.recovery.TestPerRegionIndexWriteCache
Running org.apache.phoenix.hbase.index.write.TestCachingHTableFactory
Tests run: 1, Failures: 0, Errors: 0, Skipped: 0, Time elapsed: 0.044 sec - in org.apache.phoenix.hbase.index.write.TestCachingHTableFactory
Running org.apache.phoenix.hbase.index.write.TestParalleIndexWriter
Tests run: 2, Failures: 0, Errors: 0, Skipped: 0, Time elapsed: 0.279 sec - in org.apache.phoenix.hbase.index.write.TestParalleIndexWriter
Running org.apache.phoenix.hbase.index.write.TestWALRecoveryCaching
Tests run: 1, Failures: 0, Errors: 0, Skipped: 1, Time elapsed: 0.011 sec - in org.apache.phoenix.hbase.index.write.TestWALRecoveryCaching
Running org.apache.phoenix.hbase.index.write.TestParalleWriterIndexCommitter
Tests run: 2, Failures: 0, Errors: 0, Skipped: 0, Time elapsed: 0.009 sec - in org.apache.phoenix.hbase.index.write.TestParalleWriterIndexCommitter
Running org.apache.phoenix.hbase.index.write.TestIndexWriter
Tests run: 5, Failures: 0, Errors: 0, Skipped: 0, Time elapsed: 0.051 sec - in org.apache.phoenix.hbase.index.write.TestIndexWriter
Running org.apache.phoenix.hbase.index.covered.TestLocalTableState
Tests run: 3, Failures: 0, Errors: 0, Skipped: 0, Time elapsed: 0.105 sec - in org.apache.phoenix.hbase.index.covered.TestLocalTableState
Running org.apache.phoenix.hbase.index.covered.example.TestCoveredIndexSpecifierBuilder
Tests run: 1, Failures: 0, Errors: 0, Skipped: 0, Time elapsed: 0.003 sec - in org.apache.phoenix.hbase.index.covered.example.TestCoveredIndexSpecifierBuilder
Running org.apache.phoenix.hbase.index.covered.example.TestCoveredColumnIndexCodec
Tests run: 3, Failures: 0, Errors: 0, Skipped: 0, Time elapsed: 0.008 sec - in org.apache.phoenix.hbase.index.covered.example.TestCoveredColumnIndexCodec
Running org.apache.phoenix.hbase.index.covered.example.TestColumnTracker
Tests run: 3, Failures: 0, Errors: 0, Skipped: 0, Time elapsed: 0.001 sec - in org.apache.phoenix.hbase.index.covered.example.TestColumnTracker
Running org.apache.phoenix.hbase.index.covered.update.TestIndexUpdateManager
Tests run: 2, Failures: 0, Errors: 0, Skipped: 0, Time elapsed: 0.021 sec - in org.apache.phoenix.hbase.index.covered.update.TestIndexUpdateManager
Running org.apache.phoenix.hbase.index.covered.TestCoveredColumns
Tests run: 1, Failures: 0, Errors: 0, Skipped: 0, Time elapsed: 0.001 sec - in org.apache.phoenix.hbase.index.covered.TestCoveredColumns
Running org.apache.phoenix.hbase.index.covered.filter.TestNewerTimestampFilter
Tests run: 1, Failures: 0, Errors: 0, Skipped: 0, Time elapsed: 0.001 sec - in org.apache.phoenix.hbase.index.covered.filter.TestNewerTimestampFilter
Running org.apache.phoenix.hbase.index.covered.filter.TestApplyAndFilterDeletesFilter
Tests run: 6, Failures: 0, Errors: 0, Skipped: 0, Time elapsed: 0.002 sec - in org.apache.phoenix.hbase.index.covered.filter.TestApplyAndFilterDeletesFilter
Running org.apache.phoenix.hbase.index.covered.filter.TestFamilyOnlyFilter
Tests run: 3, Failures: 0, Errors: 0, Skipped: 0, Time elapsed: 0.002 sec - in org.apache.phoenix.hbase.index.covered.filter.TestFamilyOnlyFilter
Running org.apache.phoenix.hbase.index.covered.data.TestIndexMemStore
Tests run: 2, Failures: 0, Errors: 0, Skipped: 0, Time elapsed: 0.003 sec - in org.apache.phoenix.hbase.index.covered.data.TestIndexMemStore
Running org.apache.phoenix.filter.SkipScanFilterTest
Tests run: 13, Failures: 0, Errors: 0, Skipped: 0, Time elapsed: 0.041 sec - in org.apache.phoenix.filter.SkipScanFilterTest
Running org.apache.phoenix.filter.SkipScanFilterIntersectTest
Tests run: 17, Failures: 0, Errors: 0, Skipped: 0, Time elapsed: 0.019 sec - in org.apache.phoenix.filter.SkipScanFilterIntersectTest
Running org.apache.phoenix.query.ConnectionlessUpsertTest
Tests run: 3, Failures: 0, Errors: 0, Skipped: 0, Time elapsed: 0.046 sec - in org.apache.phoenix.query.ConnectionlessUpsertTest
Running org.apache.phoenix.query.HBaseFactoryProviderTest
Tests run: 3, Failures: 0, Errors: 0, Skipped: 0, Time elapsed: 0.002 sec - in org.apache.phoenix.query.HBaseFactoryProviderTest
Running org.apache.phoenix.compile.WhereOptimizerTest
Tests run: 91, Failures: 0, Errors: 0, Skipped: 0, Time elapsed: 0.391 sec - in org.apache.phoenix.compile.WhereOptimizerTest
Running org.apache.phoenix.compile.HavingCompilerTest
Tests run: 10, Failures: 0, Errors: 0, Skipped: 0, Time elapsed: 0.071 sec - in org.apache.phoenix.compile.HavingCompilerTest
Running org.apache.phoenix.compile.QueryCompilerTest
Tests run: 83, Failures: 0, Errors: 0, Skipped: 0, Time elapsed: 0.402 sec - in org.apache.phoenix.compile.QueryCompilerTest
Running org.apache.phoenix.compile.SelectStatementRewriterTest
Tests run: 5, Failures: 0, Errors: 0, Skipped: 0, Time elapsed: 0.065 sec - in org.apache.phoenix.compile.SelectStatementRewriterTest
Running org.apache.phoenix.compile.ViewCompilerTest
Tests run: 3, Failures: 0, Errors: 3, Skipped: 0, Time elapsed: 0.061 sec <<< FAILURE! - in org.apache.phoenix.compile.ViewCompilerTest
testViewTypeCalculation(org.apache.phoenix.compile.ViewCompilerTest) Time elapsed: 0.01 sec <<< ERROR!
java.sql.SQLException: ERROR 1030 (42Y89): Cannot create table for tenant-specific connection tableName=T
at org.apache.phoenix.exception.SQLExceptionCode$Factory$1.newException(SQLExceptionCode.java:318)
at org.apache.phoenix.exception.SQLExceptionInfo.buildException(SQLExceptionInfo.java:133)
at org.apache.phoenix.schema.MetaDataClient.createTableInternal(MetaDataClient.java:882)
at org.apache.phoenix.schema.MetaDataClient.createTable(MetaDataClient.java:422)
at org.apache.phoenix.compile.CreateTableCompiler$2.execute(CreateTableCompiler.java:183)
at org.apache.phoenix.jdbc.PhoenixStatement$2.call(PhoenixStatement.java:246)
at org.apache.phoenix.jdbc.PhoenixStatement$2.call(PhoenixStatement.java:237)
at org.apache.phoenix.util.PhoenixContextExecutor.call(PhoenixContextExecutor.java:54)
at org.apache.phoenix.jdbc.PhoenixStatement.executeMutation(PhoenixStatement.java:236)
at org.apache.phoenix.jdbc.PhoenixStatement.execute(PhoenixStatement.java:959)
at org.apache.phoenix.compile.ViewCompilerTest.assertViewType(ViewCompilerTest.java:58)
at org.apache.phoenix.compile.ViewCompilerTest.testViewTypeCalculation(ViewCompilerTest.java:40)
testInvalidUpsertSelect(org.apache.phoenix.compile.ViewCompilerTest) Time elapsed: 0 sec <<< ERROR!
java.sql.SQLException: ERROR 1030 (42Y89): Cannot create table for tenant-specific connection tableName=T1
at org.apache.phoenix.exception.SQLExceptionCode$Factory$1.newException(SQLExceptionCode.java:318)
at org.apache.phoenix.exception.SQLExceptionInfo.buildException(SQLExceptionInfo.java:133)
at org.apache.phoenix.schema.MetaDataClient.createTableInternal(MetaDataClient.java:882)
at org.apache.phoenix.schema.MetaDataClient.createTable(MetaDataClient.java:422)
at org.apache.phoenix.compile.CreateTableCompiler$2.execute(CreateTableCompiler.java:183)
at org.apache.phoenix.jdbc.PhoenixStatement$2.call(PhoenixStatement.java:246)
at org.apache.phoenix.jdbc.PhoenixStatement$2.call(PhoenixStatement.java:237)
at org.apache.phoenix.util.PhoenixContextExecutor.call(PhoenixContextExecutor.java:54)
at org.apache.phoenix.jdbc.PhoenixStatement.executeMutation(PhoenixStatement.java:236)
at org.apache.phoenix.jdbc.PhoenixStatement.execute(PhoenixStatement.java:959)
at org.apache.phoenix.compile.ViewCompilerTest.testInvalidUpsertSelect(ViewCompilerTest.java:105)
testViewInvalidation(org.apache.phoenix.compile.ViewCompilerTest) Time elapsed: 0.001 sec <<< ERROR!
java.sql.SQLException: ERROR 1030 (42Y89): Cannot create table for tenant-specific connection tableName=T
at org.apache.phoenix.exception.SQLExceptionCode$Factory$1.newException(SQLExceptionCode.java:318)
at org.apache.phoenix.exception.SQLExceptionInfo.buildException(SQLExceptionInfo.java:133)
at org.apache.phoenix.schema.MetaDataClient.createTableInternal(MetaDataClient.java:882)
at org.apache.phoenix.schema.MetaDataClient.createTable(MetaDataClient.java:422)
at org.apache.phoenix.compile.CreateTableCompiler$2.execute(CreateTableCompiler.java:183)
at org.apache.phoenix.jdbc.PhoenixStatement$2.call(PhoenixStatement.java:246)
at org.apache.phoenix.jdbc.PhoenixStatement$2.call(PhoenixStatement.java:237)
at org.apache.phoenix.util.PhoenixContextExecutor.call(PhoenixContextExecutor.java:54)
at org.apache.phoenix.jdbc.PhoenixStatement.executeMutation(PhoenixStatement.java:236)
at org.apache.phoenix.jdbc.PhoenixStatement.execute(PhoenixStatement.java:959)
at org.apache.phoenix.compile.ViewCompilerTest.testViewInvalidation(ViewCompilerTest.java:80)
Running org.apache.phoenix.compile.QueryOptimizerTest
Tests run: 25, Failures: 0, Errors: 0, Skipped: 0, Time elapsed: 0.292 sec - in org.apache.phoenix.compile.QueryOptimizerTest
Running org.apache.phoenix.compile.ScanRangesTest
Tests run: 34, Failures: 0, Errors: 0, Skipped: 0, Time elapsed: 0.03 sec - in org.apache.phoenix.compile.ScanRangesTest
Running org.apache.phoenix.compile.StatementHintsCompilationTest
Tests run: 3, Failures: 0, Errors: 0, Skipped: 0, Time elapsed: 0.05 sec - in org.apache.phoenix.compile.StatementHintsCompilationTest
Running org.apache.phoenix.compile.WhereCompilerTest
Tests run: 41, Failures: 0, Errors: 5, Skipped: 1, Time elapsed: 0.142 sec <<< FAILURE! - in org.apache.phoenix.compile.WhereCompilerTest
testSingleVariableFullPkSalted(org.apache.phoenix.compile.WhereCompilerTest) Time elapsed: 0.001 sec <<< ERROR!
java.sql.SQLException: ERROR 1030 (42Y89): Cannot create table for tenant-specific connection tableName=T
at org.apache.phoenix.exception.SQLExceptionCode$Factory$1.newException(SQLExceptionCode.java:318)
at org.apache.phoenix.exception.SQLExceptionInfo.buildException(SQLExceptionInfo.java:133)
at org.apache.phoenix.schema.MetaDataClient.createTableInternal(MetaDataClient.java:882)
at org.apache.phoenix.schema.MetaDataClient.createTable(MetaDataClient.java:422)
at org.apache.phoenix.compile.CreateTableCompiler$2.execute(CreateTableCompiler.java:183)
at org.apache.phoenix.jdbc.PhoenixStatement$2.call(PhoenixStatement.java:246)
at org.apache.phoenix.jdbc.PhoenixStatement$2.call(PhoenixStatement.java:237)
at org.apache.phoenix.util.PhoenixContextExecutor.call(PhoenixContextExecutor.java:54)
at org.apache.phoenix.jdbc.PhoenixStatement.executeMutation(PhoenixStatement.java:236)
at org.apache.phoenix.jdbc.PhoenixStatement.execute(PhoenixStatement.java:959)
at org.apache.phoenix.compile.WhereCompilerTest.testSingleVariableFullPkSalted(WhereCompilerTest.java:119)
testTenantConstraintsAddedToScanWithNullTenantTypeId(org.apache.phoenix.compile.WhereCompilerTest) Time elapsed: 0.006 sec <<< ERROR!
org.apache.phoenix.schema.TableNotFoundException: ERROR 1012 (42M03): Table undefined. tableName=TENANT_FILTER_TEST
at org.apache.phoenix.compile.FromCompiler$BaseColumnResolver.createTableRef(FromCompiler.java:283)
at org.apache.phoenix.compile.FromCompiler$SingleTableColumnResolver.<init>(FromCompiler.java:200)
at org.apache.phoenix.compile.FromCompiler.getResolverForQuery(FromCompiler.java:157)
at org.apache.phoenix.jdbc.PhoenixStatement$ExecutableSelectStatement.compilePlan(PhoenixStatement.java:289)
at org.apache.phoenix.jdbc.PhoenixStatement$ExecutableSelectStatement.compilePlan(PhoenixStatement.java:279)
at org.apache.phoenix.jdbc.PhoenixStatement.optimizeQuery(PhoenixStatement.java:198)
at org.apache.phoenix.jdbc.PhoenixPreparedStatement.optimizeQuery(PhoenixPreparedStatement.java:173)
at org.apache.phoenix.compile.WhereCompilerTest.testTenantConstraintsAddedToScanWithNullTenantTypeId(WhereCompilerTest.java:903)
testTenantConstraintsAddedToScan(org.apache.phoenix.compile.WhereCompilerTest) Time elapsed: 0.009 sec <<< ERROR!
org.apache.phoenix.schema.TableNotFoundException: ERROR 1012 (42M03): Table undefined. tableName=TENANT_FILTER_TEST
at org.apache.phoenix.compile.FromCompiler$BaseColumnResolver.createTableRef(FromCompiler.java:283)
at org.apache.phoenix.compile.FromCompiler$SingleTableColumnResolver.<init>(FromCompiler.java:200)
at org.apache.phoenix.compile.FromCompiler.getResolverForQuery(FromCompiler.java:157)
at org.apache.phoenix.jdbc.PhoenixStatement$ExecutableSelectStatement.compilePlan(PhoenixStatement.java:289)
at org.apache.phoenix.jdbc.PhoenixStatement$ExecutableSelectStatement.compilePlan(PhoenixStatement.java:279)
at org.apache.phoenix.jdbc.PhoenixStatement.optimizeQuery(PhoenixStatement.java:198)
at org.apache.phoenix.jdbc.PhoenixPreparedStatement.optimizeQuery(PhoenixPreparedStatement.java:173)
at org.apache.phoenix.compile.WhereCompilerTest.testTenantConstraintsAddedToScan(WhereCompilerTest.java:871)
testSingleFixedFullPkSalted(org.apache.phoenix.compile.WhereCompilerTest) Time elapsed: 0.001 sec <<< ERROR!
java.sql.SQLException: ERROR 1030 (42Y89): Cannot create table for tenant-specific connection tableName=T
at org.apache.phoenix.exception.SQLExceptionCode$Factory$1.newException(SQLExceptionCode.java:318)
at org.apache.phoenix.exception.SQLExceptionInfo.buildException(SQLExceptionInfo.java:133)
at org.apache.phoenix.schema.MetaDataClient.createTableInternal(MetaDataClient.java:882)
at org.apache.phoenix.schema.MetaDataClient.createTable(MetaDataClient.java:422)
at org.apache.phoenix.compile.CreateTableCompiler$2.execute(CreateTableCompiler.java:183)
at org.apache.phoenix.jdbc.PhoenixStatement$2.call(PhoenixStatement.java:246)
at org.apache.phoenix.jdbc.PhoenixStatement$2.call(PhoenixStatement.java:237)
at org.apache.phoenix.util.PhoenixContextExecutor.call(PhoenixContextExecutor.java:54)
at org.apache.phoenix.jdbc.PhoenixStatement.executeMutation(PhoenixStatement.java:236)
at org.apache.phoenix.jdbc.PhoenixStatement.execute(PhoenixStatement.java:959)
at org.apache.phoenix.compile.WhereCompilerTest.testSingleFixedFullPkSalted(WhereCompilerTest.java:98)
testMultiFixedFullPkSalted(org.apache.phoenix.compile.WhereCompilerTest) Time elapsed: 0.001 sec <<< ERROR!
java.sql.SQLException: ERROR 1030 (42Y89): Cannot create table for tenant-specific connection tableName=T
at org.apache.phoenix.exception.SQLExceptionCode$Factory$1.newException(SQLExceptionCode.java:318)
at org.apache.phoenix.exception.SQLExceptionInfo.buildException(SQLExceptionInfo.java:133)
at org.apache.phoenix.schema.MetaDataClient.createTableInternal(MetaDataClient.java:882)
at org.apache.phoenix.schema.MetaDataClient.createTable(MetaDataClient.java:422)
at org.apache.phoenix.compile.CreateTableCompiler$2.execute(CreateTableCompiler.java:183)
at org.apache.phoenix.jdbc.PhoenixStatement$2.call(PhoenixStatement.java:246)
at org.apache.phoenix.jdbc.PhoenixStatement$2.call(PhoenixStatement.java:237)
at org.apache.phoenix.util.PhoenixContextExecutor.call(PhoenixContextExecutor.java:54)
at org.apache.phoenix.jdbc.PhoenixStatement.executeMutation(PhoenixStatement.java:236)
at org.apache.phoenix.jdbc.PhoenixStatement.execute(PhoenixStatement.java:959)
at org.apache.phoenix.compile.WhereCompilerTest.testMultiFixedFullPkSalted(WhereCompilerTest.java:140)
Running org.apache.phoenix.compile.QueryMetaDataTest
Tests run: 32, Failures: 0, Errors: 0, Skipped: 0, Time elapsed: 0.086 sec - in org.apache.phoenix.compile.QueryMetaDataTest
Running org.apache.phoenix.compile.TenantSpecificViewIndexCompileTest
Tests run: 3, Failures: 0, Errors: 0, Skipped: 0, Time elapsed: 0.075 sec - in org.apache.phoenix.compile.TenantSpecificViewIndexCompileTest
Running org.apache.phoenix.compile.LimitCompilerTest
Tests run: 6, Failures: 0, Errors: 0, Skipped: 0, Time elapsed: 0.036 sec - in org.apache.phoenix.compile.LimitCompilerTest
Running org.apache.phoenix.compile.JoinQueryCompilerTest
Tests run: 2, Failures: 0, Errors: 0, Skipped: 0, Time elapsed: 0.055 sec - in org.apache.phoenix.compile.JoinQueryCompilerTest
Running org.apache.phoenix.expression.CoerceExpressionTest
Tests run: 5, Failures: 0, Errors: 0, Skipped: 0, Time elapsed: 0.003 sec - in org.apache.phoenix.expression.CoerceExpressionTest
Running org.apache.phoenix.expression.SortOrderExpressionTest
Tests run: 24, Failures: 0, Errors: 0, Skipped: 0, Time elapsed: 0.017 sec - in org.apache.phoenix.expression.SortOrderExpressionTest
Running org.apache.phoenix.expression.function.ExternalSqlTypeIdFunctionTest
Tests run: 2, Failures: 0, Errors: 0, Skipped: 0, Time elapsed: 0.002 sec - in org.apache.phoenix.expression.function.ExternalSqlTypeIdFunctionTest
Running org.apache.phoenix.expression.LikeExpressionTest
Tests run: 1, Failures: 0, Errors: 0, Skipped: 0, Time elapsed: 0.002 sec - in org.apache.phoenix.expression.LikeExpressionTest
Running org.apache.phoenix.expression.ColumnExpressionTest
Tests run: 4, Failures: 0, Errors: 0, Skipped: 0, Time elapsed: 0.002 sec - in org.apache.phoenix.expression.ColumnExpressionTest
Running org.apache.phoenix.arithmetic.ArithmeticOperationTest
Tests run: 5, Failures: 0, Errors: 0, Skipped: 0, Time elapsed: 0.007 sec - in org.apache.phoenix.arithmetic.ArithmeticOperationTest
Tests run: 5, Failures: 0, Errors: 0, Skipped: 1, Time elapsed: 6.014 sec - in org.apache.phoenix.memory.MemoryManagerTest
Results :
Tests in error:
ViewCompilerTest.testViewTypeCalculation:40->assertViewType:58 ? SQL ERROR 103...
ViewCompilerTest.testInvalidUpsertSelect:105 ? SQL ERROR 1030 (42Y89): Cannot ...
ViewCompilerTest.testViewInvalidation:80 ? SQL ERROR 1030 (42Y89): Cannot crea...
WhereCompilerTest.testSingleVariableFullPkSalted:119 ? SQL ERROR 1030 (42Y89):...
WhereCompilerTest.testTenantConstraintsAddedToScanWithNullTenantTypeId:903 ? TableNotFound
WhereCompilerTest.testTenantConstraintsAddedToScan:871 ? TableNotFound ERROR 1...
WhereCompilerTest.testSingleFixedFullPkSalted:98 ? SQL ERROR 1030 (42Y89): Can...
WhereCompilerTest.testMultiFixedFullPkSalted:140 ? SQL ERROR 1030 (42Y89): Can...
Tests run: 745, Failures: 0, Errors: 8, Skipped: 3
[INFO] ------------------------------------------------------------------------
[INFO] Reactor Summary:
[INFO]
[INFO] Apache Phoenix .................................... SUCCESS [2.124s]
[INFO] Phoenix Hadoop Compatibility ...................... SUCCESS [0.471s]
[INFO] Phoenix Core ...................................... FAILURE [26.414s]
[INFO] Phoenix - Flume ................................... SKIPPED
[INFO] Phoenix - Pig ..................................... SKIPPED
[INFO] Phoenix Hadoop1 Compatibility ..................... SKIPPED
[INFO] Phoenix Assembly .................................. SKIPPED
[INFO] ------------------------------------------------------------------------
[INFO] BUILD FAILURE
[INFO] ------------------------------------------------------------------------
[INFO] Total time: 29.430s
[INFO] Finished at: Fri Jul 25 09:45:17 UTC 2014
[INFO] Final Memory: 31M/410M
[INFO] ------------------------------------------------------------------------
[ERROR] Failed to execute goal org.apache.maven.plugins:maven-surefire-plugin:2.17:test (default-test) on project phoenix-core: There are test failures.
[ERROR]
[ERROR] Please refer to <https://builds.apache.org/job/Phoenix-3.0-hadoop1/ws/phoenix-core/target/surefire-reports> for the individual test results.
[ERROR] -> [Help 1]
[ERROR]
[ERROR] To see the full stack trace of the errors, re-run Maven with the -e switch.
[ERROR] Re-run Maven using the -X switch to enable full debug logging.
[ERROR]
[ERROR] For more information about the errors and possible solutions, please read the following articles:
[ERROR] [Help 1] http://cwiki.apache.org/confluence/display/MAVEN/MojoFailureException
[ERROR]
[ERROR] After correcting the problems, you can resume the build with the command
[ERROR] mvn <goals> -rf :phoenix-core
Build step 'Invoke top-level Maven targets' marked build as failure
Archiving artifacts
Sending artifact delta relative to Phoenix | 3.0 | Hadoop1 #147
Archived 192 artifacts
Archive block size is 32768
Received 0 blocks and 901104 bytes
Compression is 0.0%
Took 14 sec
Updating PHOENIX-908
Recording test results
Jenkins build is back to normal : Phoenix | 3.0 | Hadoop1 #156
Posted by Apache Jenkins Server <je...@builds.apache.org>.
See <https://builds.apache.org/job/Phoenix-3.0-hadoop1/156/changes>
Build failed in Jenkins: Phoenix | 3.0 | Hadoop1 #155
Posted by Apache Jenkins Server <je...@builds.apache.org>.
See <https://builds.apache.org/job/Phoenix-3.0-hadoop1/155/changes>
Changes:
[jtaylor] PHOENIX-1122 Ensure TEST_PROPERTIES is not updated to prevent test flapping
------------------------------------------
[...truncated 7119 lines...]
3295/3551 KB
3299/3551 KB
3302/3551 KB
3306/3551 KB
3310/3551 KB
3314/3551 KB
3318/3551 KB
3322/3551 KB
3326/3551 KB
3330/3551 KB
3334/3551 KB
3338/3551 KB
3341/3551 KB
3345/3551 KB
3349/3551 KB
3353/3551 KB
3357/3551 KB
3361/3551 KB
3365/3551 KB
3369/3551 KB
3373/3551 KB
3377/3551 KB
3381/3551 KB
3385/3551 KB
3388/3551 KB
3392/3551 KB
3396/3551 KB
3400/3551 KB
3404/3551 KB
3408/3551 KB
3412/3551 KB
3416/3551 KB
3420/3551 KB
3424/3551 KB
3427/3551 KB
3431/3551 KB
3435/3551 KB
3439/3551 KB
3443/3551 KB
3447/3551 KB
3451/3551 KB
3455/3551 KB
3459/3551 KB
3463/3551 KB
3466/3551 KB
3470/3551 KB
3474/3551 KB
3478/3551 KB
3482/3551 KB
3486/3551 KB
3490/3551 KB
3494/3551 KB
3498/3551 KB
3502/3551 KB
3506/3551 KB
3510/3551 KB
3513/3551 KB
3517/3551 KB
3521/3551 KB
3525/3551 KB
3529/3551 KB
3533/3551 KB
3537/3551 KB
3541/3551 KB
3545/3551 KB
3549/3551 KB
3551/3551 KB
Downloaded: https://repository.apache.org/content/repositories/releases/org/apache/pig/pig/0.12.0/pig-0.12.0.jar (3551 KB at 2610.9 KB/sec)
[INFO]
[INFO] --- maven-clean-plugin:2.5:clean (default-clean) @ phoenix-pig ---
[INFO]
[INFO] --- build-helper-maven-plugin:1.7:add-test-source (add-test-source) @ phoenix-pig ---
[INFO] Test Source directory: <https://builds.apache.org/job/Phoenix-3.0-hadoop1/ws/phoenix-pig/src/it/java> added.
[INFO]
[INFO] --- build-helper-maven-plugin:1.7:add-test-resource (add-test-resource) @ phoenix-pig ---
[INFO]
[INFO] --- maven-remote-resources-plugin:1.5:process (default) @ phoenix-pig ---
[INFO]
[INFO] --- maven-resources-plugin:2.6:resources (default-resources) @ phoenix-pig ---
[INFO] Using 'UTF-8' encoding to copy filtered resources.
[INFO] skip non existing resourceDirectory <https://builds.apache.org/job/Phoenix-3.0-hadoop1/ws/phoenix-pig/src/main/resources>
[INFO] Copying 3 resources
[INFO]
[INFO] --- maven-compiler-plugin:3.0:compile (default-compile) @ phoenix-pig ---
[INFO] Changes detected - recompiling the module!
[INFO] Compiling 16 source files to <https://builds.apache.org/job/Phoenix-3.0-hadoop1/ws/phoenix-pig/target/classes>
[INFO]
[INFO] --- maven-resources-plugin:2.6:testResources (default-testResources) @ phoenix-pig ---
[INFO] Using 'UTF-8' encoding to copy filtered resources.
[INFO] skip non existing resourceDirectory <https://builds.apache.org/job/Phoenix-3.0-hadoop1/ws/phoenix-pig/src/test/resources>
[INFO] skip non existing resourceDirectory <https://builds.apache.org/job/Phoenix-3.0-hadoop1/ws/phoenix-pig/src/it/resources>
[INFO] Copying 3 resources
[INFO]
[INFO] --- maven-compiler-plugin:3.0:testCompile (default-testCompile) @ phoenix-pig ---
[INFO] Changes detected - recompiling the module!
[INFO] Compiling 9 source files to <https://builds.apache.org/job/Phoenix-3.0-hadoop1/ws/phoenix-pig/target/test-classes>
[INFO]
[INFO] --- maven-surefire-plugin:2.17:test (default-test) @ phoenix-pig ---
[INFO] Surefire report directory: <https://builds.apache.org/job/Phoenix-3.0-hadoop1/ws/phoenix-pig/target/surefire-reports>
-------------------------------------------------------
T E S T S
-------------------------------------------------------
-------------------------------------------------------
T E S T S
-------------------------------------------------------
Running org.apache.phoenix.pig.PhoenixPigConfigurationTest
Running org.apache.phoenix.pig.util.PhoenixPigSchemaUtilTest
Tests run: 1, Failures: 0, Errors: 0, Skipped: 0, Time elapsed: 0.254 sec - in org.apache.phoenix.pig.PhoenixPigConfigurationTest
Running org.apache.phoenix.pig.util.QuerySchemaParserFunctionTest
Tests run: 2, Failures: 0, Errors: 0, Skipped: 0, Time elapsed: 0.509 sec - in org.apache.phoenix.pig.util.PhoenixPigSchemaUtilTest
Running org.apache.phoenix.pig.util.TableSchemaParserFunctionTest
Tests run: 3, Failures: 0, Errors: 0, Skipped: 0, Time elapsed: 0.023 sec - in org.apache.phoenix.pig.util.TableSchemaParserFunctionTest
Running org.apache.phoenix.pig.util.ColumnInfoToStringEncoderDecoderTest
Tests run: 3, Failures: 0, Errors: 0, Skipped: 0, Time elapsed: 0.009 sec - in org.apache.phoenix.pig.util.ColumnInfoToStringEncoderDecoderTest
Running org.apache.phoenix.pig.util.SqlQueryToColumnInfoFunctionTest
Tests run: 4, Failures: 0, Errors: 0, Skipped: 0, Time elapsed: 1.206 sec - in org.apache.phoenix.pig.util.QuerySchemaParserFunctionTest
Tests run: 1, Failures: 0, Errors: 0, Skipped: 0, Time elapsed: 0.909 sec - in org.apache.phoenix.pig.util.SqlQueryToColumnInfoFunctionTest
Results :
Tests run: 14, Failures: 0, Errors: 0, Skipped: 0
[INFO]
[INFO] --- maven-source-plugin:2.2.1:jar-no-fork (attach-sources) @ phoenix-pig ---
[INFO] Building jar: <https://builds.apache.org/job/Phoenix-3.0-hadoop1/155/artifact/phoenix-pig/target/phoenix-pig-3.1.0-SNAPSHOT-sources.jar>
[INFO]
[INFO] --- maven-jar-plugin:2.4:test-jar (default) @ phoenix-pig ---
[INFO] Building jar: <https://builds.apache.org/job/Phoenix-3.0-hadoop1/155/artifact/phoenix-pig/target/phoenix-pig-3.1.0-SNAPSHOT-tests.jar>
[INFO]
[INFO] --- maven-jar-plugin:2.4:jar (default-jar) @ phoenix-pig ---
[INFO] Building jar: <https://builds.apache.org/job/Phoenix-3.0-hadoop1/155/artifact/phoenix-pig/target/phoenix-pig-3.1.0-SNAPSHOT.jar>
[INFO]
[INFO] --- maven-site-plugin:3.2:attach-descriptor (attach-descriptor) @ phoenix-pig ---
[INFO]
[INFO] --- maven-failsafe-plugin:2.17:integration-test (HBaseManagedTimeTests) @ phoenix-pig ---
[INFO] Failsafe report directory: <https://builds.apache.org/job/Phoenix-3.0-hadoop1/ws/phoenix-pig/target/failsafe-reports>
[INFO] parallel='none', perCoreThreadCount=true, threadCount=0, useUnlimitedThreads=false, threadCountSuites=0, threadCountClasses=0, threadCountMethods=0, parallelOptimized=true
-------------------------------------------------------
T E S T S
-------------------------------------------------------
-------------------------------------------------------
T E S T S
-------------------------------------------------------
Running org.apache.phoenix.pig.PhoenixPigConfigurationIT
Running org.apache.phoenix.pig.PhoenixHBaseStorerIT
Tests run: 3, Failures: 0, Errors: 0, Skipped: 0, Time elapsed: 3.875 sec - in org.apache.phoenix.pig.PhoenixPigConfigurationIT
Tests run: 2, Failures: 0, Errors: 0, Skipped: 0, Time elapsed: 14.835 sec - in org.apache.phoenix.pig.PhoenixHBaseStorerIT
Results :
Tests run: 5, Failures: 0, Errors: 0, Skipped: 0
[INFO]
[INFO] --- maven-failsafe-plugin:2.17:integration-test (ClientManagedTimeTests) @ phoenix-pig ---
[INFO] Failsafe report directory: <https://builds.apache.org/job/Phoenix-3.0-hadoop1/ws/phoenix-pig/target/failsafe-reports>
[INFO] parallel='none', perCoreThreadCount=true, threadCount=0, useUnlimitedThreads=false, threadCountSuites=0, threadCountClasses=0, threadCountMethods=0, parallelOptimized=true
-------------------------------------------------------
T E S T S
-------------------------------------------------------
-------------------------------------------------------
T E S T S
-------------------------------------------------------
Results :
Tests run: 0, Failures: 0, Errors: 0, Skipped: 0
[INFO]
[INFO] --- maven-failsafe-plugin:2.17:integration-test (NeedTheirOwnClusterTests) @ phoenix-pig ---
[INFO] Failsafe report directory: <https://builds.apache.org/job/Phoenix-3.0-hadoop1/ws/phoenix-pig/target/failsafe-reports>
[INFO] parallel='none', perCoreThreadCount=true, threadCount=0, useUnlimitedThreads=false, threadCountSuites=0, threadCountClasses=0, threadCountMethods=0, parallelOptimized=true
-------------------------------------------------------
T E S T S
-------------------------------------------------------
-------------------------------------------------------
T E S T S
-------------------------------------------------------
Tests run: 2, Failures: 0, Errors: 2, Skipped: 0, Time elapsed: 1,905,516.868 sec <<< FAILURE! - in org.apache.phoenix.pig.PhoenixHBaseLoaderIT
org.apache.phoenix.pig.PhoenixHBaseLoaderIT Time elapsed: 1,905,516.868 sec <<< ERROR!
java.lang.UnsupportedOperationException: null
at org.apache.phoenix.util.TestUtil$1.put(TestUtil.java:194)
at org.apache.phoenix.util.TestUtil$1.put(TestUtil.java:191)
at org.apache.phoenix.pig.PhoenixHBaseLoaderIT.setUpBeforeClass(PhoenixHBaseLoaderIT.java:92)
org.apache.phoenix.pig.PhoenixHBaseLoaderIT Time elapsed: 1,905,516.868 sec <<< ERROR!
java.lang.NullPointerException: null
at org.apache.phoenix.pig.PhoenixHBaseLoaderIT.tearDownAfterClass(PhoenixHBaseLoaderIT.java:524)
Results :
Tests in error:
PhoenixHBaseLoaderIT.setUpBeforeClass:92 ? UnsupportedOperation
PhoenixHBaseLoaderIT.tearDownAfterClass:524 NullPointer
Tests run: 2, Failures: 0, Errors: 2, Skipped: 0
[INFO]
[INFO] --- maven-failsafe-plugin:2.17:verify (HBaseManagedTimeTests) @ phoenix-pig ---
[INFO] Failsafe report directory: <https://builds.apache.org/job/Phoenix-3.0-hadoop1/ws/phoenix-pig/target/failsafe-reports>
[INFO] ------------------------------------------------------------------------
[INFO] Reactor Summary:
[INFO]
[INFO] Apache Phoenix .................................... SUCCESS [2.292s]
[INFO] Phoenix Hadoop Compatibility ...................... SUCCESS [2.334s]
[INFO] Phoenix Core ...................................... SUCCESS [13:59.408s]
[INFO] Phoenix - Flume ................................... SUCCESS [1:08.858s]
[INFO] Phoenix - Pig ..................................... FAILURE [1:02.810s]
[INFO] Phoenix Hadoop1 Compatibility ..................... SKIPPED
[INFO] Phoenix Assembly .................................. SKIPPED
[INFO] ------------------------------------------------------------------------
[INFO] BUILD FAILURE
[INFO] ------------------------------------------------------------------------
[INFO] Total time: 16:16.154s
[INFO] Finished at: Sat Jul 26 07:30:30 UTC 2014
[INFO] Final Memory: 45M/585M
[INFO] ------------------------------------------------------------------------
[ERROR] Failed to execute goal org.apache.maven.plugins:maven-failsafe-plugin:2.17:verify (HBaseManagedTimeTests) on project phoenix-pig: There are test failures.
[ERROR]
[ERROR] Please refer to <https://builds.apache.org/job/Phoenix-3.0-hadoop1/ws/phoenix-pig/target/failsafe-reports> for the individual test results.
[ERROR] -> [Help 1]
[ERROR]
[ERROR] To see the full stack trace of the errors, re-run Maven with the -e switch.
[ERROR] Re-run Maven using the -X switch to enable full debug logging.
[ERROR]
[ERROR] For more information about the errors and possible solutions, please read the following articles:
[ERROR] [Help 1] http://cwiki.apache.org/confluence/display/MAVEN/MojoFailureException
[ERROR]
[ERROR] After correcting the problems, you can resume the build with the command
[ERROR] mvn <goals> -rf :phoenix-pig
Build step 'Invoke top-level Maven targets' marked build as failure
Archiving artifacts
Sending artifact delta relative to Phoenix | 3.0 | Hadoop1 #147
Archived 532 artifacts
Archive block size is 32768
Received 1 blocks and 159229598 bytes
Compression is 0.0%
Took 1 min 11 sec
Updating PHOENIX-1122
Recording test results
Build failed in Jenkins: Phoenix | 3.0 | Hadoop1 #154
Posted by Apache Jenkins Server <je...@builds.apache.org>.
See <https://builds.apache.org/job/Phoenix-3.0-hadoop1/154/changes>
Changes:
[jtaylor] PHOENIX-1122 Ensure TEST_PROPERTIES is not updated to prevent test flapping
------------------------------------------
[...truncated 113 lines...]
[INFO]
[INFO] --- maven-remote-resources-plugin:1.5:process (default) @ phoenix-core ---
[INFO]
[INFO] --- maven-resources-plugin:2.6:resources (default-resources) @ phoenix-core ---
[INFO] Using 'UTF-8' encoding to copy filtered resources.
[INFO] Copying 1 resource to META-INF/services
[INFO] Copying 3 resources
[INFO]
[INFO] --- maven-compiler-plugin:3.0:compile (default-compile) @ phoenix-core ---
[INFO] Changes detected - recompiling the module!
[INFO] Compiling 641 source files to <https://builds.apache.org/job/Phoenix-3.0-hadoop1/ws/phoenix-core/target/classes>
[WARNING] <https://builds.apache.org/job/Phoenix-3.0-hadoop1/ws/phoenix-core/src/main/java/org/apache/phoenix/jdbc/PhoenixResultSet.java>: Some input files use or override a deprecated API.
[WARNING] <https://builds.apache.org/job/Phoenix-3.0-hadoop1/ws/phoenix-core/src/main/java/org/apache/phoenix/jdbc/PhoenixResultSet.java>: Recompile with -Xlint:deprecation for details.
[WARNING] <https://builds.apache.org/job/Phoenix-3.0-hadoop1/ws/phoenix-core/src/main/java/org/apache/phoenix/jdbc/PhoenixStatement.java>: <https://builds.apache.org/job/Phoenix-3.0-hadoop1/ws/phoenix-core/src/main/java/org/apache/phoenix/jdbc/PhoenixStatement.java> uses unchecked or unsafe operations.
[WARNING] <https://builds.apache.org/job/Phoenix-3.0-hadoop1/ws/phoenix-core/src/main/java/org/apache/phoenix/jdbc/PhoenixStatement.java>: Recompile with -Xlint:unchecked for details.
[INFO]
[INFO] --- maven-resources-plugin:2.6:testResources (default-testResources) @ phoenix-core ---
[INFO] Using 'UTF-8' encoding to copy filtered resources.
[INFO] Copying 2 resources
[INFO] Copying 2 resources
[INFO] Copying 3 resources
[INFO]
[INFO] --- maven-compiler-plugin:3.0:testCompile (default-testCompile) @ phoenix-core ---
[INFO] Changes detected - recompiling the module!
[INFO] Compiling 214 source files to <https://builds.apache.org/job/Phoenix-3.0-hadoop1/ws/phoenix-core/target/test-classes>
[INFO]
[INFO] --- maven-surefire-plugin:2.17:test (default-test) @ phoenix-core ---
[INFO] Surefire report directory: <https://builds.apache.org/job/Phoenix-3.0-hadoop1/ws/phoenix-core/target/surefire-reports>
-------------------------------------------------------
T E S T S
-------------------------------------------------------
-------------------------------------------------------
T E S T S
-------------------------------------------------------
Running org.apache.phoenix.mapreduce.CsvBulkLoadToolTest
Running org.apache.phoenix.mapreduce.CsvToKeyValueMapperTest
Tests run: 8, Failures: 0, Errors: 0, Skipped: 0, Time elapsed: 0.334 sec - in org.apache.phoenix.mapreduce.CsvBulkLoadToolTest
Running org.apache.phoenix.mapreduce.CsvBulkImportUtilTest
Tests run: 2, Failures: 0, Errors: 0, Skipped: 0, Time elapsed: 0.12 sec - in org.apache.phoenix.mapreduce.CsvBulkImportUtilTest
Running org.apache.phoenix.jdbc.PhoenixEmbeddedDriverTest
Tests run: 3, Failures: 0, Errors: 0, Skipped: 0, Time elapsed: 0.063 sec - in org.apache.phoenix.jdbc.PhoenixEmbeddedDriverTest
Running org.apache.phoenix.jdbc.PhoenixDriverTest
Tests run: 8, Failures: 0, Errors: 0, Skipped: 0, Time elapsed: 0.652 sec - in org.apache.phoenix.mapreduce.CsvToKeyValueMapperTest
Running org.apache.phoenix.util.ScanUtilTest
Tests run: 20, Failures: 0, Errors: 0, Skipped: 0, Time elapsed: 0.071 sec - in org.apache.phoenix.util.ScanUtilTest
Running org.apache.phoenix.util.PropertiesUtilTest
Tests run: 2, Failures: 0, Errors: 0, Skipped: 0, Time elapsed: 0.002 sec - in org.apache.phoenix.util.PropertiesUtilTest
Running org.apache.phoenix.util.MetaDataUtilTest
Tests run: 3, Failures: 0, Errors: 0, Skipped: 0, Time elapsed: 0.064 sec - in org.apache.phoenix.util.MetaDataUtilTest
Running org.apache.phoenix.util.DateUtilTest
Tests run: 1, Failures: 0, Errors: 0, Skipped: 0, Time elapsed: 0.014 sec - in org.apache.phoenix.util.DateUtilTest
Running org.apache.phoenix.util.ColumnInfoTest
Tests run: 3, Failures: 0, Errors: 0, Skipped: 0, Time elapsed: 0.003 sec - in org.apache.phoenix.util.ColumnInfoTest
Running org.apache.phoenix.util.SequenceUtilTest
Tests run: 12, Failures: 0, Errors: 0, Skipped: 0, Time elapsed: 0.028 sec - in org.apache.phoenix.util.SequenceUtilTest
Running org.apache.phoenix.util.PhoenixContextExecutorTest
Tests run: 1, Failures: 0, Errors: 0, Skipped: 0, Time elapsed: 0.002 sec - in org.apache.phoenix.util.PhoenixContextExecutorTest
Running org.apache.phoenix.util.Base62EncoderTest
Tests run: 1, Failures: 0, Errors: 0, Skipped: 0, Time elapsed: 0.015 sec - in org.apache.phoenix.util.Base62EncoderTest
Running org.apache.phoenix.util.PhoenixRuntimeTest
Tests run: 2, Failures: 0, Errors: 0, Skipped: 0, Time elapsed: 0.838 sec - in org.apache.phoenix.jdbc.PhoenixDriverTest
Running org.apache.phoenix.util.ByteUtilTest
Tests run: 3, Failures: 0, Errors: 0, Skipped: 0, Time elapsed: 0.031 sec - in org.apache.phoenix.util.ByteUtilTest
Running org.apache.phoenix.util.QueryUtilTest
Tests run: 5, Failures: 0, Errors: 0, Skipped: 0, Time elapsed: 0.004 sec - in org.apache.phoenix.util.QueryUtilTest
Running org.apache.phoenix.util.csv.StringToArrayConverterTest
Tests run: 4, Failures: 0, Errors: 0, Skipped: 0, Time elapsed: 0.107 sec - in org.apache.phoenix.util.csv.StringToArrayConverterTest
Running org.apache.phoenix.util.csv.CsvUpsertExecutorTest
Tests run: 2, Failures: 0, Errors: 0, Skipped: 0, Time elapsed: 0.644 sec - in org.apache.phoenix.util.PhoenixRuntimeTest
Running org.apache.phoenix.util.LikeExpressionTest
Tests run: 1, Failures: 0, Errors: 0, Skipped: 0, Time elapsed: 0.001 sec - in org.apache.phoenix.util.LikeExpressionTest
Running org.apache.phoenix.util.StringUtilTest
Tests run: 4, Failures: 0, Errors: 0, Skipped: 0, Time elapsed: 0.002 sec - in org.apache.phoenix.util.StringUtilTest
Running org.apache.phoenix.schema.SchemaUtilTest
Tests run: 4, Failures: 0, Errors: 0, Skipped: 0, Time elapsed: 0.002 sec - in org.apache.phoenix.schema.SchemaUtilTest
Running org.apache.phoenix.schema.PDataTypeForArraysTest
Tests run: 60, Failures: 0, Errors: 0, Skipped: 0, Time elapsed: 0.042 sec - in org.apache.phoenix.schema.PDataTypeForArraysTest
Running org.apache.phoenix.schema.PDataTypeTest
Tests run: 23, Failures: 0, Errors: 0, Skipped: 0, Time elapsed: 0.023 sec - in org.apache.phoenix.schema.PDataTypeTest
Running org.apache.phoenix.schema.RowKeyValueAccessorTest
Tests run: 1, Failures: 0, Errors: 0, Skipped: 0, Time elapsed: 0.163 sec - in org.apache.phoenix.schema.RowKeyValueAccessorTest
Running org.apache.phoenix.schema.RowKeySchemaTest
Tests run: 5, Failures: 0, Errors: 0, Skipped: 0, Time elapsed: 0.339 sec - in org.apache.phoenix.util.csv.CsvUpsertExecutorTest
Running org.apache.phoenix.schema.PMetaDataImplTest
Tests run: 1, Failures: 0, Errors: 0, Skipped: 0, Time elapsed: 0.004 sec - in org.apache.phoenix.schema.PMetaDataImplTest
Running org.apache.phoenix.schema.ValueBitSetTest
Tests run: 3, Failures: 0, Errors: 0, Skipped: 0, Time elapsed: 0.006 sec - in org.apache.phoenix.schema.ValueBitSetTest
Running org.apache.phoenix.schema.SortOrderTest
Tests run: 8, Failures: 0, Errors: 0, Skipped: 0, Time elapsed: 0.006 sec - in org.apache.phoenix.schema.SortOrderTest
Running org.apache.phoenix.client.TestClientKeyValueLocal
Tests run: 6, Failures: 0, Errors: 0, Skipped: 0, Time elapsed: 0.017 sec - in org.apache.phoenix.client.TestClientKeyValueLocal
Running org.apache.phoenix.index.IndexMaintainerTest
Tests run: 6, Failures: 0, Errors: 0, Skipped: 0, Time elapsed: 0.139 sec - in org.apache.phoenix.schema.RowKeySchemaTest
Running org.apache.phoenix.parse.QueryParserTest
Tests run: 46, Failures: 0, Errors: 0, Skipped: 0, Time elapsed: 0.14 sec - in org.apache.phoenix.parse.QueryParserTest
Running org.apache.phoenix.memory.MemoryManagerTest
Tests run: 23, Failures: 0, Errors: 0, Skipped: 0, Time elapsed: 0.882 sec - in org.apache.phoenix.index.IndexMaintainerTest
Running org.apache.phoenix.iterate.ConcatResultIteratorTest
Tests run: 2, Failures: 0, Errors: 0, Skipped: 0, Time elapsed: 0.008 sec - in org.apache.phoenix.iterate.ConcatResultIteratorTest
Running org.apache.phoenix.iterate.MergeSortResultIteratorTest
Tests run: 1, Failures: 0, Errors: 0, Skipped: 0, Time elapsed: 0 sec - in org.apache.phoenix.iterate.MergeSortResultIteratorTest
Running org.apache.phoenix.iterate.AggregateResultScannerTest
Tests run: 1, Failures: 0, Errors: 0, Skipped: 0, Time elapsed: 0.055 sec - in org.apache.phoenix.iterate.AggregateResultScannerTest
Running org.apache.phoenix.iterate.SpoolingResultIteratorTest
Tests run: 3, Failures: 0, Errors: 0, Skipped: 0, Time elapsed: 0.083 sec - in org.apache.phoenix.iterate.SpoolingResultIteratorTest
Running org.apache.phoenix.hbase.index.util.TestIndexManagementUtil
Tests run: 3, Failures: 0, Errors: 0, Skipped: 0, Time elapsed: 0.009 sec - in org.apache.phoenix.hbase.index.util.TestIndexManagementUtil
Running org.apache.phoenix.hbase.index.parallel.TestThreadPoolBuilder
Tests run: 2, Failures: 0, Errors: 0, Skipped: 0, Time elapsed: 0.006 sec - in org.apache.phoenix.hbase.index.parallel.TestThreadPoolBuilder
Running org.apache.phoenix.hbase.index.parallel.TestThreadPoolManager
Tests run: 3, Failures: 0, Errors: 0, Skipped: 0, Time elapsed: 0.008 sec - in org.apache.phoenix.hbase.index.parallel.TestThreadPoolManager
Running org.apache.phoenix.hbase.index.write.recovery.TestPerRegionIndexWriteCache
Tests run: 3, Failures: 0, Errors: 0, Skipped: 0, Time elapsed: 0.033 sec - in org.apache.phoenix.hbase.index.write.recovery.TestPerRegionIndexWriteCache
Running org.apache.phoenix.hbase.index.write.TestCachingHTableFactory
Tests run: 1, Failures: 0, Errors: 0, Skipped: 0, Time elapsed: 0.045 sec - in org.apache.phoenix.hbase.index.write.TestCachingHTableFactory
Running org.apache.phoenix.hbase.index.write.TestParalleIndexWriter
Tests run: 2, Failures: 0, Errors: 0, Skipped: 0, Time elapsed: 0.258 sec - in org.apache.phoenix.hbase.index.write.TestParalleIndexWriter
Running org.apache.phoenix.hbase.index.write.TestWALRecoveryCaching
Tests run: 1, Failures: 0, Errors: 0, Skipped: 1, Time elapsed: 0.01 sec - in org.apache.phoenix.hbase.index.write.TestWALRecoveryCaching
Running org.apache.phoenix.hbase.index.write.TestParalleWriterIndexCommitter
Tests run: 2, Failures: 0, Errors: 0, Skipped: 0, Time elapsed: 0.011 sec - in org.apache.phoenix.hbase.index.write.TestParalleWriterIndexCommitter
Running org.apache.phoenix.hbase.index.write.TestIndexWriter
Tests run: 5, Failures: 0, Errors: 0, Skipped: 0, Time elapsed: 0.053 sec - in org.apache.phoenix.hbase.index.write.TestIndexWriter
Running org.apache.phoenix.hbase.index.covered.TestLocalTableState
Tests run: 3, Failures: 0, Errors: 0, Skipped: 0, Time elapsed: 0.122 sec - in org.apache.phoenix.hbase.index.covered.TestLocalTableState
Running org.apache.phoenix.hbase.index.covered.example.TestCoveredIndexSpecifierBuilder
Tests run: 1, Failures: 0, Errors: 0, Skipped: 0, Time elapsed: 0.003 sec - in org.apache.phoenix.hbase.index.covered.example.TestCoveredIndexSpecifierBuilder
Running org.apache.phoenix.hbase.index.covered.example.TestCoveredColumnIndexCodec
Tests run: 3, Failures: 0, Errors: 0, Skipped: 0, Time elapsed: 0.01 sec - in org.apache.phoenix.hbase.index.covered.example.TestCoveredColumnIndexCodec
Running org.apache.phoenix.hbase.index.covered.example.TestColumnTracker
Tests run: 3, Failures: 0, Errors: 0, Skipped: 0, Time elapsed: 0.002 sec - in org.apache.phoenix.hbase.index.covered.example.TestColumnTracker
Running org.apache.phoenix.hbase.index.covered.update.TestIndexUpdateManager
Tests run: 2, Failures: 0, Errors: 0, Skipped: 0, Time elapsed: 0.024 sec - in org.apache.phoenix.hbase.index.covered.update.TestIndexUpdateManager
Running org.apache.phoenix.hbase.index.covered.TestCoveredColumns
Tests run: 1, Failures: 0, Errors: 0, Skipped: 0, Time elapsed: 0.001 sec - in org.apache.phoenix.hbase.index.covered.TestCoveredColumns
Running org.apache.phoenix.hbase.index.covered.filter.TestNewerTimestampFilter
Tests run: 1, Failures: 0, Errors: 0, Skipped: 0, Time elapsed: 0.001 sec - in org.apache.phoenix.hbase.index.covered.filter.TestNewerTimestampFilter
Running org.apache.phoenix.hbase.index.covered.filter.TestApplyAndFilterDeletesFilter
Tests run: 6, Failures: 0, Errors: 0, Skipped: 0, Time elapsed: 0.003 sec - in org.apache.phoenix.hbase.index.covered.filter.TestApplyAndFilterDeletesFilter
Running org.apache.phoenix.hbase.index.covered.filter.TestFamilyOnlyFilter
Tests run: 3, Failures: 0, Errors: 0, Skipped: 0, Time elapsed: 0.002 sec - in org.apache.phoenix.hbase.index.covered.filter.TestFamilyOnlyFilter
Running org.apache.phoenix.hbase.index.covered.data.TestIndexMemStore
Tests run: 2, Failures: 0, Errors: 0, Skipped: 0, Time elapsed: 0.003 sec - in org.apache.phoenix.hbase.index.covered.data.TestIndexMemStore
Running org.apache.phoenix.filter.SkipScanFilterTest
Tests run: 13, Failures: 0, Errors: 0, Skipped: 0, Time elapsed: 0.062 sec - in org.apache.phoenix.filter.SkipScanFilterTest
Running org.apache.phoenix.filter.SkipScanFilterIntersectTest
Tests run: 17, Failures: 0, Errors: 0, Skipped: 0, Time elapsed: 0.022 sec - in org.apache.phoenix.filter.SkipScanFilterIntersectTest
Running org.apache.phoenix.query.ConnectionlessUpsertTest
Tests run: 3, Failures: 0, Errors: 0, Skipped: 0, Time elapsed: 0.047 sec - in org.apache.phoenix.query.ConnectionlessUpsertTest
Running org.apache.phoenix.query.HBaseFactoryProviderTest
Tests run: 3, Failures: 0, Errors: 0, Skipped: 0, Time elapsed: 0.002 sec - in org.apache.phoenix.query.HBaseFactoryProviderTest
Running org.apache.phoenix.compile.WhereOptimizerTest
Tests run: 91, Failures: 0, Errors: 0, Skipped: 0, Time elapsed: 0.384 sec - in org.apache.phoenix.compile.WhereOptimizerTest
Running org.apache.phoenix.compile.HavingCompilerTest
Tests run: 10, Failures: 0, Errors: 0, Skipped: 0, Time elapsed: 0.067 sec - in org.apache.phoenix.compile.HavingCompilerTest
Running org.apache.phoenix.compile.QueryCompilerTest
Tests run: 83, Failures: 0, Errors: 0, Skipped: 0, Time elapsed: 0.337 sec - in org.apache.phoenix.compile.QueryCompilerTest
Running org.apache.phoenix.compile.SelectStatementRewriterTest
Tests run: 5, Failures: 0, Errors: 0, Skipped: 0, Time elapsed: 0.052 sec - in org.apache.phoenix.compile.SelectStatementRewriterTest
Running org.apache.phoenix.compile.ViewCompilerTest
Tests run: 3, Failures: 1, Errors: 0, Skipped: 0, Time elapsed: 0.108 sec <<< FAILURE! - in org.apache.phoenix.compile.ViewCompilerTest
testViewTypeCalculation(org.apache.phoenix.compile.ViewCompilerTest) Time elapsed: 0.023 sec <<< FAILURE!
java.lang.AssertionError: Expected 4, but got 5: V2 V1 V4 V3 VIEWXYZ expected:<4> but was:<5>
at org.junit.Assert.fail(Assert.java:88)
at org.junit.Assert.failNotEquals(Assert.java:743)
at org.junit.Assert.assertEquals(Assert.java:118)
at org.junit.Assert.assertEquals(Assert.java:555)
at org.apache.phoenix.compile.ViewCompilerTest.assertViewType(ViewCompilerTest.java:76)
at org.apache.phoenix.compile.ViewCompilerTest.testViewTypeCalculation(ViewCompilerTest.java:41)
Running org.apache.phoenix.compile.QueryOptimizerTest
Tests run: 25, Failures: 0, Errors: 0, Skipped: 0, Time elapsed: 0.246 sec - in org.apache.phoenix.compile.QueryOptimizerTest
Running org.apache.phoenix.compile.ScanRangesTest
Tests run: 34, Failures: 0, Errors: 0, Skipped: 0, Time elapsed: 0.023 sec - in org.apache.phoenix.compile.ScanRangesTest
Running org.apache.phoenix.compile.StatementHintsCompilationTest
Tests run: 3, Failures: 0, Errors: 0, Skipped: 0, Time elapsed: 0.043 sec - in org.apache.phoenix.compile.StatementHintsCompilationTest
Running org.apache.phoenix.compile.WhereCompilerTest
Tests run: 41, Failures: 0, Errors: 0, Skipped: 1, Time elapsed: 0.122 sec - in org.apache.phoenix.compile.WhereCompilerTest
Running org.apache.phoenix.compile.QueryMetaDataTest
Tests run: 32, Failures: 0, Errors: 0, Skipped: 0, Time elapsed: 0.083 sec - in org.apache.phoenix.compile.QueryMetaDataTest
Running org.apache.phoenix.compile.TenantSpecificViewIndexCompileTest
Tests run: 3, Failures: 0, Errors: 0, Skipped: 0, Time elapsed: 0.078 sec - in org.apache.phoenix.compile.TenantSpecificViewIndexCompileTest
Running org.apache.phoenix.compile.LimitCompilerTest
Tests run: 6, Failures: 0, Errors: 0, Skipped: 0, Time elapsed: 0.036 sec - in org.apache.phoenix.compile.LimitCompilerTest
Running org.apache.phoenix.compile.JoinQueryCompilerTest
Tests run: 2, Failures: 0, Errors: 0, Skipped: 0, Time elapsed: 0.053 sec - in org.apache.phoenix.compile.JoinQueryCompilerTest
Running org.apache.phoenix.expression.CoerceExpressionTest
Tests run: 5, Failures: 0, Errors: 0, Skipped: 0, Time elapsed: 0.003 sec - in org.apache.phoenix.expression.CoerceExpressionTest
Running org.apache.phoenix.expression.SortOrderExpressionTest
Tests run: 24, Failures: 0, Errors: 0, Skipped: 0, Time elapsed: 0.017 sec - in org.apache.phoenix.expression.SortOrderExpressionTest
Running org.apache.phoenix.expression.function.ExternalSqlTypeIdFunctionTest
Tests run: 2, Failures: 0, Errors: 0, Skipped: 0, Time elapsed: 0.001 sec - in org.apache.phoenix.expression.function.ExternalSqlTypeIdFunctionTest
Running org.apache.phoenix.expression.LikeExpressionTest
Tests run: 1, Failures: 0, Errors: 0, Skipped: 0, Time elapsed: 0.002 sec - in org.apache.phoenix.expression.LikeExpressionTest
Running org.apache.phoenix.expression.ColumnExpressionTest
Tests run: 4, Failures: 0, Errors: 0, Skipped: 0, Time elapsed: 0.002 sec - in org.apache.phoenix.expression.ColumnExpressionTest
Running org.apache.phoenix.arithmetic.ArithmeticOperationTest
Tests run: 5, Failures: 0, Errors: 0, Skipped: 0, Time elapsed: 0.008 sec - in org.apache.phoenix.arithmetic.ArithmeticOperationTest
Tests run: 5, Failures: 0, Errors: 0, Skipped: 1, Time elapsed: 6.011 sec - in org.apache.phoenix.memory.MemoryManagerTest
Results :
Failed tests:
ViewCompilerTest.testViewTypeCalculation:41->assertViewType:76 Expected 4, but got 5: V2 V1 V4 V3 VIEWXYZ expected:<4> but was:<5>
Tests run: 745, Failures: 1, Errors: 0, Skipped: 3
[INFO] ------------------------------------------------------------------------
[INFO] Reactor Summary:
[INFO]
[INFO] Apache Phoenix .................................... SUCCESS [1.998s]
[INFO] Phoenix Hadoop Compatibility ...................... SUCCESS [0.531s]
[INFO] Phoenix Core ...................................... FAILURE [24.459s]
[INFO] Phoenix - Flume ................................... SKIPPED
[INFO] Phoenix - Pig ..................................... SKIPPED
[INFO] Phoenix Hadoop1 Compatibility ..................... SKIPPED
[INFO] Phoenix Assembly .................................. SKIPPED
[INFO] ------------------------------------------------------------------------
[INFO] BUILD FAILURE
[INFO] ------------------------------------------------------------------------
[INFO] Total time: 27.391s
[INFO] Finished at: Sat Jul 26 06:00:18 UTC 2014
[INFO] Final Memory: 31M/446M
[INFO] ------------------------------------------------------------------------
[ERROR] Failed to execute goal org.apache.maven.plugins:maven-surefire-plugin:2.17:test (default-test) on project phoenix-core: There are test failures.
[ERROR]
[ERROR] Please refer to <https://builds.apache.org/job/Phoenix-3.0-hadoop1/ws/phoenix-core/target/surefire-reports> for the individual test results.
[ERROR] -> [Help 1]
[ERROR]
[ERROR] To see the full stack trace of the errors, re-run Maven with the -e switch.
[ERROR] Re-run Maven using the -X switch to enable full debug logging.
[ERROR]
[ERROR] For more information about the errors and possible solutions, please read the following articles:
[ERROR] [Help 1] http://cwiki.apache.org/confluence/display/MAVEN/MojoFailureException
[ERROR]
[ERROR] After correcting the problems, you can resume the build with the command
[ERROR] mvn <goals> -rf :phoenix-core
Build step 'Invoke top-level Maven targets' marked build as failure
Archiving artifacts
Sending artifact delta relative to Phoenix | 3.0 | Hadoop1 #147
Archived 193 artifacts
Archive block size is 32768
Received 0 blocks and 887161 bytes
Compression is 0.0%
Took 3.6 sec
Updating PHOENIX-1122
Recording test results
Build failed in Jenkins: Phoenix | 3.0 | Hadoop1 #153
Posted by Apache Jenkins Server <je...@builds.apache.org>.
See <https://builds.apache.org/job/Phoenix-3.0-hadoop1/153/changes>
Changes:
[jtaylor] PHOENIX-1122 Ensure TEST_PROPERTIES is not updated to prevent test flapping
------------------------------------------
[...truncated 114 lines...]
[INFO] --- maven-remote-resources-plugin:1.5:process (default) @ phoenix-core ---
[INFO]
[INFO] --- maven-resources-plugin:2.6:resources (default-resources) @ phoenix-core ---
[INFO] Using 'UTF-8' encoding to copy filtered resources.
[INFO] Copying 1 resource to META-INF/services
[INFO] Copying 3 resources
[INFO]
[INFO] --- maven-compiler-plugin:3.0:compile (default-compile) @ phoenix-core ---
[INFO] Changes detected - recompiling the module!
[INFO] Compiling 641 source files to <https://builds.apache.org/job/Phoenix-3.0-hadoop1/ws/phoenix-core/target/classes>
[WARNING] <https://builds.apache.org/job/Phoenix-3.0-hadoop1/ws/phoenix-core/src/main/java/org/apache/phoenix/jdbc/PhoenixResultSet.java>: Some input files use or override a deprecated API.
[WARNING] <https://builds.apache.org/job/Phoenix-3.0-hadoop1/ws/phoenix-core/src/main/java/org/apache/phoenix/jdbc/PhoenixResultSet.java>: Recompile with -Xlint:deprecation for details.
[WARNING] <https://builds.apache.org/job/Phoenix-3.0-hadoop1/ws/phoenix-core/src/main/java/org/apache/phoenix/jdbc/PhoenixStatement.java>: <https://builds.apache.org/job/Phoenix-3.0-hadoop1/ws/phoenix-core/src/main/java/org/apache/phoenix/jdbc/PhoenixStatement.java> uses unchecked or unsafe operations.
[WARNING] <https://builds.apache.org/job/Phoenix-3.0-hadoop1/ws/phoenix-core/src/main/java/org/apache/phoenix/jdbc/PhoenixStatement.java>: Recompile with -Xlint:unchecked for details.
[INFO]
[INFO] --- maven-resources-plugin:2.6:testResources (default-testResources) @ phoenix-core ---
[INFO] Using 'UTF-8' encoding to copy filtered resources.
[INFO] Copying 2 resources
[INFO] Copying 2 resources
[INFO] Copying 3 resources
[INFO]
[INFO] --- maven-compiler-plugin:3.0:testCompile (default-testCompile) @ phoenix-core ---
[INFO] Changes detected - recompiling the module!
[INFO] Compiling 214 source files to <https://builds.apache.org/job/Phoenix-3.0-hadoop1/ws/phoenix-core/target/test-classes>
[INFO]
[INFO] --- maven-surefire-plugin:2.17:test (default-test) @ phoenix-core ---
[INFO] Surefire report directory: <https://builds.apache.org/job/Phoenix-3.0-hadoop1/ws/phoenix-core/target/surefire-reports>
-------------------------------------------------------
T E S T S
-------------------------------------------------------
-------------------------------------------------------
T E S T S
-------------------------------------------------------
Running org.apache.phoenix.mapreduce.CsvBulkLoadToolTest
Running org.apache.phoenix.mapreduce.CsvToKeyValueMapperTest
Tests run: 8, Failures: 0, Errors: 0, Skipped: 0, Time elapsed: 0.325 sec - in org.apache.phoenix.mapreduce.CsvBulkLoadToolTest
Running org.apache.phoenix.mapreduce.CsvBulkImportUtilTest
Tests run: 2, Failures: 0, Errors: 0, Skipped: 0, Time elapsed: 0.116 sec - in org.apache.phoenix.mapreduce.CsvBulkImportUtilTest
Running org.apache.phoenix.jdbc.PhoenixEmbeddedDriverTest
Tests run: 3, Failures: 0, Errors: 0, Skipped: 0, Time elapsed: 0.058 sec - in org.apache.phoenix.jdbc.PhoenixEmbeddedDriverTest
Running org.apache.phoenix.jdbc.PhoenixDriverTest
Tests run: 8, Failures: 0, Errors: 0, Skipped: 0, Time elapsed: 0.668 sec - in org.apache.phoenix.mapreduce.CsvToKeyValueMapperTest
Running org.apache.phoenix.util.ScanUtilTest
Tests run: 20, Failures: 0, Errors: 0, Skipped: 0, Time elapsed: 0.085 sec - in org.apache.phoenix.util.ScanUtilTest
Running org.apache.phoenix.util.PropertiesUtilTest
Tests run: 2, Failures: 0, Errors: 0, Skipped: 0, Time elapsed: 0.002 sec - in org.apache.phoenix.util.PropertiesUtilTest
Running org.apache.phoenix.util.MetaDataUtilTest
Tests run: 3, Failures: 0, Errors: 0, Skipped: 0, Time elapsed: 0.049 sec - in org.apache.phoenix.util.MetaDataUtilTest
Running org.apache.phoenix.util.DateUtilTest
Tests run: 1, Failures: 0, Errors: 0, Skipped: 0, Time elapsed: 0.014 sec - in org.apache.phoenix.util.DateUtilTest
Running org.apache.phoenix.util.ColumnInfoTest
Tests run: 3, Failures: 0, Errors: 0, Skipped: 0, Time elapsed: 0.003 sec - in org.apache.phoenix.util.ColumnInfoTest
Running org.apache.phoenix.util.SequenceUtilTest
Tests run: 12, Failures: 0, Errors: 0, Skipped: 0, Time elapsed: 0.026 sec - in org.apache.phoenix.util.SequenceUtilTest
Running org.apache.phoenix.util.PhoenixContextExecutorTest
Tests run: 1, Failures: 0, Errors: 0, Skipped: 0, Time elapsed: 0.002 sec - in org.apache.phoenix.util.PhoenixContextExecutorTest
Running org.apache.phoenix.util.Base62EncoderTest
Tests run: 1, Failures: 0, Errors: 0, Skipped: 0, Time elapsed: 0.015 sec - in org.apache.phoenix.util.Base62EncoderTest
Running org.apache.phoenix.util.PhoenixRuntimeTest
Tests run: 2, Failures: 0, Errors: 0, Skipped: 0, Time elapsed: 0.862 sec - in org.apache.phoenix.jdbc.PhoenixDriverTest
Running org.apache.phoenix.util.ByteUtilTest
Tests run: 3, Failures: 0, Errors: 0, Skipped: 0, Time elapsed: 0.032 sec - in org.apache.phoenix.util.ByteUtilTest
Running org.apache.phoenix.util.QueryUtilTest
Tests run: 5, Failures: 0, Errors: 0, Skipped: 0, Time elapsed: 0.004 sec - in org.apache.phoenix.util.QueryUtilTest
Running org.apache.phoenix.util.csv.StringToArrayConverterTest
Tests run: 4, Failures: 0, Errors: 0, Skipped: 0, Time elapsed: 0.116 sec - in org.apache.phoenix.util.csv.StringToArrayConverterTest
Running org.apache.phoenix.util.csv.CsvUpsertExecutorTest
Tests run: 2, Failures: 0, Errors: 0, Skipped: 0, Time elapsed: 0.686 sec - in org.apache.phoenix.util.PhoenixRuntimeTest
Running org.apache.phoenix.util.LikeExpressionTest
Tests run: 1, Failures: 0, Errors: 0, Skipped: 0, Time elapsed: 0.002 sec - in org.apache.phoenix.util.LikeExpressionTest
Running org.apache.phoenix.util.StringUtilTest
Tests run: 4, Failures: 0, Errors: 0, Skipped: 0, Time elapsed: 0.002 sec - in org.apache.phoenix.util.StringUtilTest
Running org.apache.phoenix.schema.SchemaUtilTest
Tests run: 4, Failures: 0, Errors: 0, Skipped: 0, Time elapsed: 0.002 sec - in org.apache.phoenix.schema.SchemaUtilTest
Running org.apache.phoenix.schema.PDataTypeForArraysTest
Tests run: 60, Failures: 0, Errors: 0, Skipped: 0, Time elapsed: 0.034 sec - in org.apache.phoenix.schema.PDataTypeForArraysTest
Running org.apache.phoenix.schema.PDataTypeTest
Tests run: 23, Failures: 0, Errors: 0, Skipped: 0, Time elapsed: 0.024 sec - in org.apache.phoenix.schema.PDataTypeTest
Running org.apache.phoenix.schema.RowKeyValueAccessorTest
Tests run: 1, Failures: 0, Errors: 0, Skipped: 0, Time elapsed: 0.158 sec - in org.apache.phoenix.schema.RowKeyValueAccessorTest
Running org.apache.phoenix.schema.RowKeySchemaTest
Tests run: 5, Failures: 0, Errors: 0, Skipped: 0, Time elapsed: 0.342 sec - in org.apache.phoenix.util.csv.CsvUpsertExecutorTest
Running org.apache.phoenix.schema.PMetaDataImplTest
Tests run: 1, Failures: 0, Errors: 0, Skipped: 0, Time elapsed: 0.004 sec - in org.apache.phoenix.schema.PMetaDataImplTest
Running org.apache.phoenix.schema.ValueBitSetTest
Tests run: 3, Failures: 0, Errors: 0, Skipped: 0, Time elapsed: 0.006 sec - in org.apache.phoenix.schema.ValueBitSetTest
Running org.apache.phoenix.schema.SortOrderTest
Tests run: 8, Failures: 0, Errors: 0, Skipped: 0, Time elapsed: 0.006 sec - in org.apache.phoenix.schema.SortOrderTest
Running org.apache.phoenix.client.TestClientKeyValueLocal
Tests run: 6, Failures: 0, Errors: 0, Skipped: 0, Time elapsed: 0.02 sec - in org.apache.phoenix.client.TestClientKeyValueLocal
Running org.apache.phoenix.index.IndexMaintainerTest
Tests run: 6, Failures: 0, Errors: 0, Skipped: 0, Time elapsed: 0.131 sec - in org.apache.phoenix.schema.RowKeySchemaTest
Running org.apache.phoenix.parse.QueryParserTest
Tests run: 46, Failures: 0, Errors: 0, Skipped: 0, Time elapsed: 0.144 sec - in org.apache.phoenix.parse.QueryParserTest
Running org.apache.phoenix.memory.MemoryManagerTest
Tests run: 23, Failures: 0, Errors: 0, Skipped: 0, Time elapsed: 0.857 sec - in org.apache.phoenix.index.IndexMaintainerTest
Running org.apache.phoenix.iterate.ConcatResultIteratorTest
Tests run: 2, Failures: 0, Errors: 0, Skipped: 0, Time elapsed: 0.007 sec - in org.apache.phoenix.iterate.ConcatResultIteratorTest
Running org.apache.phoenix.iterate.MergeSortResultIteratorTest
Tests run: 1, Failures: 0, Errors: 0, Skipped: 0, Time elapsed: 0.002 sec - in org.apache.phoenix.iterate.MergeSortResultIteratorTest
Running org.apache.phoenix.iterate.AggregateResultScannerTest
Tests run: 1, Failures: 0, Errors: 0, Skipped: 0, Time elapsed: 0.054 sec - in org.apache.phoenix.iterate.AggregateResultScannerTest
Running org.apache.phoenix.iterate.SpoolingResultIteratorTest
Tests run: 3, Failures: 0, Errors: 0, Skipped: 0, Time elapsed: 0.087 sec - in org.apache.phoenix.iterate.SpoolingResultIteratorTest
Running org.apache.phoenix.hbase.index.util.TestIndexManagementUtil
Tests run: 3, Failures: 0, Errors: 0, Skipped: 0, Time elapsed: 0.009 sec - in org.apache.phoenix.hbase.index.util.TestIndexManagementUtil
Running org.apache.phoenix.hbase.index.parallel.TestThreadPoolBuilder
Tests run: 2, Failures: 0, Errors: 0, Skipped: 0, Time elapsed: 0.008 sec - in org.apache.phoenix.hbase.index.parallel.TestThreadPoolBuilder
Running org.apache.phoenix.hbase.index.parallel.TestThreadPoolManager
Tests run: 3, Failures: 0, Errors: 0, Skipped: 0, Time elapsed: 0.009 sec - in org.apache.phoenix.hbase.index.parallel.TestThreadPoolManager
Running org.apache.phoenix.hbase.index.write.recovery.TestPerRegionIndexWriteCache
Tests run: 3, Failures: 0, Errors: 0, Skipped: 0, Time elapsed: 0.042 sec - in org.apache.phoenix.hbase.index.write.recovery.TestPerRegionIndexWriteCache
Running org.apache.phoenix.hbase.index.write.TestCachingHTableFactory
Tests run: 1, Failures: 0, Errors: 0, Skipped: 0, Time elapsed: 0.051 sec - in org.apache.phoenix.hbase.index.write.TestCachingHTableFactory
Running org.apache.phoenix.hbase.index.write.TestParalleIndexWriter
Tests run: 2, Failures: 0, Errors: 0, Skipped: 0, Time elapsed: 0.252 sec - in org.apache.phoenix.hbase.index.write.TestParalleIndexWriter
Running org.apache.phoenix.hbase.index.write.TestWALRecoveryCaching
Tests run: 1, Failures: 0, Errors: 0, Skipped: 1, Time elapsed: 0.01 sec - in org.apache.phoenix.hbase.index.write.TestWALRecoveryCaching
Running org.apache.phoenix.hbase.index.write.TestParalleWriterIndexCommitter
Tests run: 2, Failures: 0, Errors: 0, Skipped: 0, Time elapsed: 0.01 sec - in org.apache.phoenix.hbase.index.write.TestParalleWriterIndexCommitter
Running org.apache.phoenix.hbase.index.write.TestIndexWriter
Tests run: 5, Failures: 0, Errors: 0, Skipped: 0, Time elapsed: 0.051 sec - in org.apache.phoenix.hbase.index.write.TestIndexWriter
Running org.apache.phoenix.hbase.index.covered.TestLocalTableState
Tests run: 3, Failures: 0, Errors: 0, Skipped: 0, Time elapsed: 0.096 sec - in org.apache.phoenix.hbase.index.covered.TestLocalTableState
Running org.apache.phoenix.hbase.index.covered.example.TestCoveredIndexSpecifierBuilder
Tests run: 1, Failures: 0, Errors: 0, Skipped: 0, Time elapsed: 0.003 sec - in org.apache.phoenix.hbase.index.covered.example.TestCoveredIndexSpecifierBuilder
Running org.apache.phoenix.hbase.index.covered.example.TestCoveredColumnIndexCodec
Tests run: 3, Failures: 0, Errors: 0, Skipped: 0, Time elapsed: 0.008 sec - in org.apache.phoenix.hbase.index.covered.example.TestCoveredColumnIndexCodec
Running org.apache.phoenix.hbase.index.covered.example.TestColumnTracker
Tests run: 3, Failures: 0, Errors: 0, Skipped: 0, Time elapsed: 0.002 sec - in org.apache.phoenix.hbase.index.covered.example.TestColumnTracker
Running org.apache.phoenix.hbase.index.covered.update.TestIndexUpdateManager
Tests run: 2, Failures: 0, Errors: 0, Skipped: 0, Time elapsed: 0.022 sec - in org.apache.phoenix.hbase.index.covered.update.TestIndexUpdateManager
Running org.apache.phoenix.hbase.index.covered.TestCoveredColumns
Tests run: 1, Failures: 0, Errors: 0, Skipped: 0, Time elapsed: 0.001 sec - in org.apache.phoenix.hbase.index.covered.TestCoveredColumns
Running org.apache.phoenix.hbase.index.covered.filter.TestNewerTimestampFilter
Tests run: 1, Failures: 0, Errors: 0, Skipped: 0, Time elapsed: 0.002 sec - in org.apache.phoenix.hbase.index.covered.filter.TestNewerTimestampFilter
Running org.apache.phoenix.hbase.index.covered.filter.TestApplyAndFilterDeletesFilter
Tests run: 6, Failures: 0, Errors: 0, Skipped: 0, Time elapsed: 0.003 sec - in org.apache.phoenix.hbase.index.covered.filter.TestApplyAndFilterDeletesFilter
Running org.apache.phoenix.hbase.index.covered.filter.TestFamilyOnlyFilter
Tests run: 3, Failures: 0, Errors: 0, Skipped: 0, Time elapsed: 0.001 sec - in org.apache.phoenix.hbase.index.covered.filter.TestFamilyOnlyFilter
Running org.apache.phoenix.hbase.index.covered.data.TestIndexMemStore
Tests run: 2, Failures: 0, Errors: 0, Skipped: 0, Time elapsed: 0.014 sec - in org.apache.phoenix.hbase.index.covered.data.TestIndexMemStore
Running org.apache.phoenix.filter.SkipScanFilterTest
Tests run: 13, Failures: 0, Errors: 0, Skipped: 0, Time elapsed: 0.051 sec - in org.apache.phoenix.filter.SkipScanFilterTest
Running org.apache.phoenix.filter.SkipScanFilterIntersectTest
Tests run: 17, Failures: 0, Errors: 0, Skipped: 0, Time elapsed: 0.026 sec - in org.apache.phoenix.filter.SkipScanFilterIntersectTest
Running org.apache.phoenix.query.ConnectionlessUpsertTest
Tests run: 3, Failures: 0, Errors: 0, Skipped: 0, Time elapsed: 0.048 sec - in org.apache.phoenix.query.ConnectionlessUpsertTest
Running org.apache.phoenix.query.HBaseFactoryProviderTest
Tests run: 3, Failures: 0, Errors: 0, Skipped: 0, Time elapsed: 0.001 sec - in org.apache.phoenix.query.HBaseFactoryProviderTest
Running org.apache.phoenix.compile.WhereOptimizerTest
Tests run: 91, Failures: 0, Errors: 0, Skipped: 0, Time elapsed: 0.355 sec - in org.apache.phoenix.compile.WhereOptimizerTest
Running org.apache.phoenix.compile.HavingCompilerTest
Tests run: 10, Failures: 0, Errors: 0, Skipped: 0, Time elapsed: 0.094 sec - in org.apache.phoenix.compile.HavingCompilerTest
Running org.apache.phoenix.compile.QueryCompilerTest
Tests run: 83, Failures: 0, Errors: 0, Skipped: 0, Time elapsed: 0.322 sec - in org.apache.phoenix.compile.QueryCompilerTest
Running org.apache.phoenix.compile.SelectStatementRewriterTest
Tests run: 5, Failures: 0, Errors: 0, Skipped: 0, Time elapsed: 0.066 sec - in org.apache.phoenix.compile.SelectStatementRewriterTest
Running org.apache.phoenix.compile.ViewCompilerTest
Tests run: 3, Failures: 1, Errors: 0, Skipped: 0, Time elapsed: 0.077 sec <<< FAILURE! - in org.apache.phoenix.compile.ViewCompilerTest
testViewTypeCalculation(org.apache.phoenix.compile.ViewCompilerTest) Time elapsed: 0.021 sec <<< FAILURE!
java.lang.AssertionError: expected:<4> but was:<5>
at org.junit.Assert.fail(Assert.java:88)
at org.junit.Assert.failNotEquals(Assert.java:743)
at org.junit.Assert.assertEquals(Assert.java:118)
at org.junit.Assert.assertEquals(Assert.java:555)
at org.junit.Assert.assertEquals(Assert.java:542)
at org.apache.phoenix.compile.ViewCompilerTest.assertViewType(ViewCompilerTest.java:73)
at org.apache.phoenix.compile.ViewCompilerTest.testViewTypeCalculation(ViewCompilerTest.java:41)
Running org.apache.phoenix.compile.QueryOptimizerTest
Tests run: 25, Failures: 0, Errors: 0, Skipped: 0, Time elapsed: 0.246 sec - in org.apache.phoenix.compile.QueryOptimizerTest
Running org.apache.phoenix.compile.ScanRangesTest
Tests run: 34, Failures: 0, Errors: 0, Skipped: 0, Time elapsed: 0.025 sec - in org.apache.phoenix.compile.ScanRangesTest
Running org.apache.phoenix.compile.StatementHintsCompilationTest
Tests run: 3, Failures: 0, Errors: 0, Skipped: 0, Time elapsed: 0.045 sec - in org.apache.phoenix.compile.StatementHintsCompilationTest
Running org.apache.phoenix.compile.WhereCompilerTest
Tests run: 41, Failures: 0, Errors: 0, Skipped: 1, Time elapsed: 0.13 sec - in org.apache.phoenix.compile.WhereCompilerTest
Running org.apache.phoenix.compile.QueryMetaDataTest
Tests run: 32, Failures: 0, Errors: 0, Skipped: 0, Time elapsed: 0.083 sec - in org.apache.phoenix.compile.QueryMetaDataTest
Running org.apache.phoenix.compile.TenantSpecificViewIndexCompileTest
Tests run: 3, Failures: 0, Errors: 0, Skipped: 0, Time elapsed: 0.077 sec - in org.apache.phoenix.compile.TenantSpecificViewIndexCompileTest
Running org.apache.phoenix.compile.LimitCompilerTest
Tests run: 6, Failures: 0, Errors: 0, Skipped: 0, Time elapsed: 0.036 sec - in org.apache.phoenix.compile.LimitCompilerTest
Running org.apache.phoenix.compile.JoinQueryCompilerTest
Tests run: 2, Failures: 0, Errors: 0, Skipped: 0, Time elapsed: 0.055 sec - in org.apache.phoenix.compile.JoinQueryCompilerTest
Running org.apache.phoenix.expression.CoerceExpressionTest
Tests run: 5, Failures: 0, Errors: 0, Skipped: 0, Time elapsed: 0.003 sec - in org.apache.phoenix.expression.CoerceExpressionTest
Running org.apache.phoenix.expression.SortOrderExpressionTest
Tests run: 24, Failures: 0, Errors: 0, Skipped: 0, Time elapsed: 0.017 sec - in org.apache.phoenix.expression.SortOrderExpressionTest
Running org.apache.phoenix.expression.function.ExternalSqlTypeIdFunctionTest
Tests run: 2, Failures: 0, Errors: 0, Skipped: 0, Time elapsed: 0.002 sec - in org.apache.phoenix.expression.function.ExternalSqlTypeIdFunctionTest
Running org.apache.phoenix.expression.LikeExpressionTest
Tests run: 1, Failures: 0, Errors: 0, Skipped: 0, Time elapsed: 0.002 sec - in org.apache.phoenix.expression.LikeExpressionTest
Running org.apache.phoenix.expression.ColumnExpressionTest
Tests run: 4, Failures: 0, Errors: 0, Skipped: 0, Time elapsed: 0.002 sec - in org.apache.phoenix.expression.ColumnExpressionTest
Running org.apache.phoenix.arithmetic.ArithmeticOperationTest
Tests run: 5, Failures: 0, Errors: 0, Skipped: 0, Time elapsed: 0.007 sec - in org.apache.phoenix.arithmetic.ArithmeticOperationTest
Tests run: 5, Failures: 0, Errors: 0, Skipped: 1, Time elapsed: 6.015 sec - in org.apache.phoenix.memory.MemoryManagerTest
Results :
Failed tests:
ViewCompilerTest.testViewTypeCalculation:41->assertViewType:73 expected:<4> but was:<5>
Tests run: 745, Failures: 1, Errors: 0, Skipped: 3
[INFO] ------------------------------------------------------------------------
[INFO] Reactor Summary:
[INFO]
[INFO] Apache Phoenix .................................... SUCCESS [2.143s]
[INFO] Phoenix Hadoop Compatibility ...................... SUCCESS [0.506s]
[INFO] Phoenix Core ...................................... FAILURE [27.923s]
[INFO] Phoenix - Flume ................................... SKIPPED
[INFO] Phoenix - Pig ..................................... SKIPPED
[INFO] Phoenix Hadoop1 Compatibility ..................... SKIPPED
[INFO] Phoenix Assembly .................................. SKIPPED
[INFO] ------------------------------------------------------------------------
[INFO] BUILD FAILURE
[INFO] ------------------------------------------------------------------------
[INFO] Total time: 30.975s
[INFO] Finished at: Sat Jul 26 05:30:18 UTC 2014
[INFO] Final Memory: 31M/383M
[INFO] ------------------------------------------------------------------------
[ERROR] Failed to execute goal org.apache.maven.plugins:maven-surefire-plugin:2.17:test (default-test) on project phoenix-core: There are test failures.
[ERROR]
[ERROR] Please refer to <https://builds.apache.org/job/Phoenix-3.0-hadoop1/ws/phoenix-core/target/surefire-reports> for the individual test results.
[ERROR] -> [Help 1]
[ERROR]
[ERROR] To see the full stack trace of the errors, re-run Maven with the -e switch.
[ERROR] Re-run Maven using the -X switch to enable full debug logging.
[ERROR]
[ERROR] For more information about the errors and possible solutions, please read the following articles:
[ERROR] [Help 1] http://cwiki.apache.org/confluence/display/MAVEN/MojoFailureException
[ERROR]
[ERROR] After correcting the problems, you can resume the build with the command
[ERROR] mvn <goals> -rf :phoenix-core
Build step 'Invoke top-level Maven targets' marked build as failure
Archiving artifacts
Sending artifact delta relative to Phoenix | 3.0 | Hadoop1 #147
Archived 193 artifacts
Archive block size is 32768
Received 0 blocks and 887178 bytes
Compression is 0.0%
Took 14 sec
Updating PHOENIX-1122
Recording test results
Build failed in Jenkins: Phoenix | 3.0 | Hadoop1 #152
Posted by Apache Jenkins Server <je...@builds.apache.org>.
See <https://builds.apache.org/job/Phoenix-3.0-hadoop1/152/changes>
Changes:
[jamestaylor] PHOENIX-1111 Fix flapping unit tests by removing inappropriate usage of TestUtil.TEST_PROPERTIES
------------------------------------------
[...truncated 2433 lines...]
[INFO] --- maven-surefire-plugin:2.17:test (default-test) @ phoenix-core ---
[INFO] Surefire report directory: <https://builds.apache.org/job/Phoenix-3.0-hadoop1/ws/phoenix-core/target/surefire-reports>
Downloading: http://repo.maven.apache.org/maven2/org/apache/maven/surefire/surefire-junit4/2.17/surefire-junit4-2.17.pom
3/3 KB
Downloaded: http://repo.maven.apache.org/maven2/org/apache/maven/surefire/surefire-junit4/2.17/surefire-junit4-2.17.pom (3 KB at 21.7 KB/sec)
Downloading: http://repo.maven.apache.org/maven2/org/apache/maven/surefire/surefire-junit4/2.17/surefire-junit4-2.17.jar
4/63 KB
8/63 KB
12/63 KB
14/63 KB
18/63 KB
22/63 KB
26/63 KB
30/63 KB
34/63 KB
38/63 KB
42/63 KB
46/63 KB
50/63 KB
51/63 KB
55/63 KB
59/63 KB
63/63 KB
63/63 KB
Downloaded: http://repo.maven.apache.org/maven2/org/apache/maven/surefire/surefire-junit4/2.17/surefire-junit4-2.17.jar (63 KB at 350.9 KB/sec)
-------------------------------------------------------
T E S T S
-------------------------------------------------------
-------------------------------------------------------
T E S T S
-------------------------------------------------------
Running org.apache.phoenix.query.ConnectionlessUpsertTest
Running org.apache.phoenix.query.HBaseFactoryProviderTest
Tests run: 3, Failures: 0, Errors: 0, Skipped: 0, Time elapsed: 0.071 sec - in org.apache.phoenix.query.HBaseFactoryProviderTest
Running org.apache.phoenix.client.TestClientKeyValueLocal
Tests run: 6, Failures: 0, Errors: 0, Skipped: 0, Time elapsed: 0.221 sec - in org.apache.phoenix.client.TestClientKeyValueLocal
Running org.apache.phoenix.arithmetic.ArithmeticOperationTest
Tests run: 5, Failures: 0, Errors: 0, Skipped: 0, Time elapsed: 0.173 sec - in org.apache.phoenix.arithmetic.ArithmeticOperationTest
Running org.apache.phoenix.expression.SortOrderExpressionTest
Tests run: 24, Failures: 0, Errors: 0, Skipped: 0, Time elapsed: 0.064 sec - in org.apache.phoenix.expression.SortOrderExpressionTest
Running org.apache.phoenix.expression.ColumnExpressionTest
Tests run: 4, Failures: 0, Errors: 0, Skipped: 0, Time elapsed: 0.006 sec - in org.apache.phoenix.expression.ColumnExpressionTest
Running org.apache.phoenix.expression.LikeExpressionTest
Tests run: 1, Failures: 0, Errors: 0, Skipped: 0, Time elapsed: 0.007 sec - in org.apache.phoenix.expression.LikeExpressionTest
Running org.apache.phoenix.expression.function.ExternalSqlTypeIdFunctionTest
Tests run: 2, Failures: 0, Errors: 0, Skipped: 0, Time elapsed: 0.003 sec - in org.apache.phoenix.expression.function.ExternalSqlTypeIdFunctionTest
Running org.apache.phoenix.expression.CoerceExpressionTest
Tests run: 5, Failures: 0, Errors: 0, Skipped: 0, Time elapsed: 0.006 sec - in org.apache.phoenix.expression.CoerceExpressionTest
Running org.apache.phoenix.parse.QueryParserTest
Tests run: 46, Failures: 0, Errors: 0, Skipped: 0, Time elapsed: 0.252 sec - in org.apache.phoenix.parse.QueryParserTest
Running org.apache.phoenix.mapreduce.CsvToKeyValueMapperTest
Tests run: 3, Failures: 0, Errors: 0, Skipped: 0, Time elapsed: 0.948 sec - in org.apache.phoenix.query.ConnectionlessUpsertTest
Running org.apache.phoenix.mapreduce.CsvBulkImportUtilTest
Tests run: 2, Failures: 0, Errors: 0, Skipped: 0, Time elapsed: 0.055 sec - in org.apache.phoenix.mapreduce.CsvBulkImportUtilTest
Running org.apache.phoenix.mapreduce.CsvBulkLoadToolTest
Tests run: 8, Failures: 0, Errors: 0, Skipped: 0, Time elapsed: 0.022 sec - in org.apache.phoenix.mapreduce.CsvBulkLoadToolTest
Running org.apache.phoenix.hbase.index.covered.data.TestIndexMemStore
Tests run: 2, Failures: 0, Errors: 0, Skipped: 0, Time elapsed: 0.01 sec - in org.apache.phoenix.hbase.index.covered.data.TestIndexMemStore
Running org.apache.phoenix.hbase.index.covered.example.TestColumnTracker
Tests run: 3, Failures: 0, Errors: 0, Skipped: 0, Time elapsed: 0.006 sec - in org.apache.phoenix.hbase.index.covered.example.TestColumnTracker
Running org.apache.phoenix.hbase.index.covered.example.TestCoveredIndexSpecifierBuilder
Tests run: 1, Failures: 0, Errors: 0, Skipped: 0, Time elapsed: 0.007 sec - in org.apache.phoenix.hbase.index.covered.example.TestCoveredIndexSpecifierBuilder
Running org.apache.phoenix.hbase.index.covered.example.TestCoveredColumnIndexCodec
Tests run: 8, Failures: 0, Errors: 0, Skipped: 0, Time elapsed: 0.243 sec - in org.apache.phoenix.mapreduce.CsvToKeyValueMapperTest
Running org.apache.phoenix.hbase.index.covered.TestLocalTableState
Tests run: 3, Failures: 0, Errors: 0, Skipped: 0, Time elapsed: 0.177 sec - in org.apache.phoenix.hbase.index.covered.example.TestCoveredColumnIndexCodec
Running org.apache.phoenix.hbase.index.covered.update.TestIndexUpdateManager
Tests run: 3, Failures: 0, Errors: 0, Skipped: 0, Time elapsed: 0.334 sec - in org.apache.phoenix.hbase.index.covered.TestLocalTableState
Running org.apache.phoenix.hbase.index.covered.TestCoveredColumns
Tests run: 1, Failures: 0, Errors: 0, Skipped: 0, Time elapsed: 0.001 sec - in org.apache.phoenix.hbase.index.covered.TestCoveredColumns
Running org.apache.phoenix.hbase.index.covered.filter.TestApplyAndFilterDeletesFilter
Tests run: 6, Failures: 0, Errors: 0, Skipped: 0, Time elapsed: 0.005 sec - in org.apache.phoenix.hbase.index.covered.filter.TestApplyAndFilterDeletesFilter
Running org.apache.phoenix.hbase.index.covered.filter.TestNewerTimestampFilter
Tests run: 1, Failures: 0, Errors: 0, Skipped: 0, Time elapsed: 0.001 sec - in org.apache.phoenix.hbase.index.covered.filter.TestNewerTimestampFilter
Running org.apache.phoenix.hbase.index.covered.filter.TestFamilyOnlyFilter
Tests run: 3, Failures: 0, Errors: 0, Skipped: 0, Time elapsed: 0.003 sec - in org.apache.phoenix.hbase.index.covered.filter.TestFamilyOnlyFilter
Running org.apache.phoenix.hbase.index.util.TestIndexManagementUtil
Tests run: 3, Failures: 0, Errors: 0, Skipped: 0, Time elapsed: 0.01 sec - in org.apache.phoenix.hbase.index.util.TestIndexManagementUtil
Running org.apache.phoenix.hbase.index.parallel.TestThreadPoolBuilder
Tests run: 2, Failures: 0, Errors: 0, Skipped: 0, Time elapsed: 0.007 sec - in org.apache.phoenix.hbase.index.parallel.TestThreadPoolBuilder
Running org.apache.phoenix.hbase.index.parallel.TestThreadPoolManager
Tests run: 3, Failures: 0, Errors: 0, Skipped: 0, Time elapsed: 0.011 sec - in org.apache.phoenix.hbase.index.parallel.TestThreadPoolManager
Running org.apache.phoenix.hbase.index.write.TestWALRecoveryCaching
Tests run: 1, Failures: 0, Errors: 0, Skipped: 1, Time elapsed: 0.01 sec - in org.apache.phoenix.hbase.index.write.TestWALRecoveryCaching
Running org.apache.phoenix.hbase.index.write.TestCachingHTableFactory
Tests run: 2, Failures: 0, Errors: 0, Skipped: 0, Time elapsed: 0.261 sec - in org.apache.phoenix.hbase.index.covered.update.TestIndexUpdateManager
Running org.apache.phoenix.hbase.index.write.TestParalleIndexWriter
Tests run: 1, Failures: 0, Errors: 0, Skipped: 0, Time elapsed: 0.036 sec - in org.apache.phoenix.hbase.index.write.TestCachingHTableFactory
Running org.apache.phoenix.hbase.index.write.recovery.TestPerRegionIndexWriteCache
Tests run: 3, Failures: 0, Errors: 0, Skipped: 0, Time elapsed: 0.021 sec - in org.apache.phoenix.hbase.index.write.recovery.TestPerRegionIndexWriteCache
Running org.apache.phoenix.hbase.index.write.TestIndexWriter
Tests run: 2, Failures: 0, Errors: 0, Skipped: 0, Time elapsed: 0.102 sec - in org.apache.phoenix.hbase.index.write.TestParalleIndexWriter
Running org.apache.phoenix.hbase.index.write.TestParalleWriterIndexCommitter
Tests run: 2, Failures: 0, Errors: 0, Skipped: 0, Time elapsed: 0.009 sec - in org.apache.phoenix.hbase.index.write.TestParalleWriterIndexCommitter
Running org.apache.phoenix.index.IndexMaintainerTest
Tests run: 5, Failures: 0, Errors: 0, Skipped: 0, Time elapsed: 0.281 sec - in org.apache.phoenix.hbase.index.write.TestIndexWriter
Running org.apache.phoenix.schema.ValueBitSetTest
Tests run: 3, Failures: 0, Errors: 0, Skipped: 0, Time elapsed: 0.006 sec - in org.apache.phoenix.schema.ValueBitSetTest
Running org.apache.phoenix.schema.RowKeyValueAccessorTest
Tests run: 1, Failures: 0, Errors: 0, Skipped: 0, Time elapsed: 0.385 sec - in org.apache.phoenix.schema.RowKeyValueAccessorTest
Running org.apache.phoenix.schema.SortOrderTest
Tests run: 8, Failures: 0, Errors: 0, Skipped: 0, Time elapsed: 0.006 sec - in org.apache.phoenix.schema.SortOrderTest
Running org.apache.phoenix.schema.SchemaUtilTest
Tests run: 4, Failures: 0, Errors: 0, Skipped: 0, Time elapsed: 0.002 sec - in org.apache.phoenix.schema.SchemaUtilTest
Running org.apache.phoenix.schema.RowKeySchemaTest
Tests run: 6, Failures: 0, Errors: 0, Skipped: 0, Time elapsed: 0.154 sec - in org.apache.phoenix.schema.RowKeySchemaTest
Running org.apache.phoenix.schema.PMetaDataImplTest
Tests run: 1, Failures: 0, Errors: 0, Skipped: 0, Time elapsed: 0.004 sec - in org.apache.phoenix.schema.PMetaDataImplTest
Running org.apache.phoenix.schema.PDataTypeForArraysTest
Tests run: 60, Failures: 0, Errors: 0, Skipped: 0, Time elapsed: 0.036 sec - in org.apache.phoenix.schema.PDataTypeForArraysTest
Running org.apache.phoenix.schema.PDataTypeTest
Tests run: 23, Failures: 0, Errors: 0, Skipped: 0, Time elapsed: 0.031 sec - in org.apache.phoenix.schema.PDataTypeTest
Running org.apache.phoenix.iterate.MergeSortResultIteratorTest
Tests run: 1, Failures: 0, Errors: 0, Skipped: 0, Time elapsed: 0.007 sec - in org.apache.phoenix.iterate.MergeSortResultIteratorTest
Running org.apache.phoenix.iterate.SpoolingResultIteratorTest
Tests run: 3, Failures: 0, Errors: 0, Skipped: 0, Time elapsed: 0.093 sec - in org.apache.phoenix.iterate.SpoolingResultIteratorTest
Running org.apache.phoenix.iterate.AggregateResultScannerTest
Tests run: 23, Failures: 0, Errors: 0, Skipped: 0, Time elapsed: 1.027 sec - in org.apache.phoenix.index.IndexMaintainerTest
Running org.apache.phoenix.iterate.ConcatResultIteratorTest
Tests run: 2, Failures: 0, Errors: 0, Skipped: 0, Time elapsed: 0.006 sec - in org.apache.phoenix.iterate.ConcatResultIteratorTest
Running org.apache.phoenix.util.StringUtilTest
Tests run: 4, Failures: 0, Errors: 0, Skipped: 0, Time elapsed: 0.001 sec - in org.apache.phoenix.util.StringUtilTest
Running org.apache.phoenix.util.PhoenixContextExecutorTest
Tests run: 1, Failures: 0, Errors: 0, Skipped: 0, Time elapsed: 0.001 sec - in org.apache.phoenix.util.PhoenixContextExecutorTest
Running org.apache.phoenix.util.Base62EncoderTest
Tests run: 1, Failures: 0, Errors: 0, Skipped: 0, Time elapsed: 0.015 sec - in org.apache.phoenix.util.Base62EncoderTest
Running org.apache.phoenix.util.SequenceUtilTest
Tests run: 12, Failures: 0, Errors: 0, Skipped: 0, Time elapsed: 0.005 sec - in org.apache.phoenix.util.SequenceUtilTest
Running org.apache.phoenix.util.ScanUtilTest
Tests run: 1, Failures: 0, Errors: 0, Skipped: 0, Time elapsed: 0.127 sec - in org.apache.phoenix.iterate.AggregateResultScannerTest
Running org.apache.phoenix.util.PropertiesUtilTest
Tests run: 2, Failures: 0, Errors: 0, Skipped: 0, Time elapsed: 0.001 sec - in org.apache.phoenix.util.PropertiesUtilTest
Running org.apache.phoenix.util.LikeExpressionTest
Tests run: 1, Failures: 0, Errors: 0, Skipped: 0, Time elapsed: 0.001 sec - in org.apache.phoenix.util.LikeExpressionTest
Running org.apache.phoenix.util.PhoenixRuntimeTest
Tests run: 20, Failures: 0, Errors: 0, Skipped: 0, Time elapsed: 0.026 sec - in org.apache.phoenix.util.ScanUtilTest
Running org.apache.phoenix.util.DateUtilTest
Tests run: 1, Failures: 0, Errors: 0, Skipped: 0, Time elapsed: 0.001 sec - in org.apache.phoenix.util.DateUtilTest
Running org.apache.phoenix.util.csv.StringToArrayConverterTest
Tests run: 4, Failures: 0, Errors: 0, Skipped: 0, Time elapsed: 0.06 sec - in org.apache.phoenix.util.csv.StringToArrayConverterTest
Running org.apache.phoenix.util.csv.CsvUpsertExecutorTest
Tests run: 2, Failures: 0, Errors: 0, Skipped: 0, Time elapsed: 0.119 sec - in org.apache.phoenix.util.PhoenixRuntimeTest
Running org.apache.phoenix.util.ColumnInfoTest
Tests run: 3, Failures: 0, Errors: 0, Skipped: 0, Time elapsed: 0.002 sec - in org.apache.phoenix.util.ColumnInfoTest
Running org.apache.phoenix.util.MetaDataUtilTest
Tests run: 3, Failures: 0, Errors: 0, Skipped: 0, Time elapsed: 0.002 sec - in org.apache.phoenix.util.MetaDataUtilTest
Running org.apache.phoenix.util.QueryUtilTest
Tests run: 5, Failures: 0, Errors: 0, Skipped: 0, Time elapsed: 0.004 sec - in org.apache.phoenix.util.QueryUtilTest
Running org.apache.phoenix.util.ByteUtilTest
Tests run: 3, Failures: 0, Errors: 0, Skipped: 0, Time elapsed: 0.036 sec - in org.apache.phoenix.util.ByteUtilTest
Running org.apache.phoenix.compile.ScanRangesTest
Tests run: 34, Failures: 0, Errors: 0, Skipped: 0, Time elapsed: 0.04 sec - in org.apache.phoenix.compile.ScanRangesTest
Running org.apache.phoenix.compile.LimitCompilerTest
Tests run: 5, Failures: 0, Errors: 0, Skipped: 0, Time elapsed: 0.166 sec - in org.apache.phoenix.util.csv.CsvUpsertExecutorTest
Running org.apache.phoenix.compile.QueryOptimizerTest
Tests run: 6, Failures: 0, Errors: 0, Skipped: 0, Time elapsed: 0.105 sec - in org.apache.phoenix.compile.LimitCompilerTest
Running org.apache.phoenix.compile.WhereOptimizerTest
Tests run: 91, Failures: 0, Errors: 0, Skipped: 0, Time elapsed: 0.305 sec - in org.apache.phoenix.compile.WhereOptimizerTest
Running org.apache.phoenix.compile.QueryCompilerTest
Tests run: 25, Failures: 0, Errors: 0, Skipped: 0, Time elapsed: 0.391 sec - in org.apache.phoenix.compile.QueryOptimizerTest
Running org.apache.phoenix.compile.JoinQueryCompilerTest
Tests run: 2, Failures: 0, Errors: 0, Skipped: 0, Time elapsed: 0.11 sec - in org.apache.phoenix.compile.JoinQueryCompilerTest
Running org.apache.phoenix.compile.HavingCompilerTest
Tests run: 10, Failures: 0, Errors: 0, Skipped: 0, Time elapsed: 0.06 sec - in org.apache.phoenix.compile.HavingCompilerTest
Running org.apache.phoenix.compile.QueryMetaDataTest
Tests run: 32, Failures: 0, Errors: 0, Skipped: 0, Time elapsed: 0.107 sec - in org.apache.phoenix.compile.QueryMetaDataTest
Running org.apache.phoenix.compile.TenantSpecificViewIndexCompileTest
Tests run: 83, Failures: 0, Errors: 0, Skipped: 0, Time elapsed: 0.361 sec - in org.apache.phoenix.compile.QueryCompilerTest
Running org.apache.phoenix.compile.ViewCompilerTest
Tests run: 3, Failures: 0, Errors: 0, Skipped: 0, Time elapsed: 0.156 sec - in org.apache.phoenix.compile.TenantSpecificViewIndexCompileTest
Running org.apache.phoenix.compile.WhereCompilerTest
Tests run: 3, Failures: 1, Errors: 0, Skipped: 0, Time elapsed: 0.1 sec <<< FAILURE! - in org.apache.phoenix.compile.ViewCompilerTest
testViewTypeCalculation(org.apache.phoenix.compile.ViewCompilerTest) Time elapsed: 0.026 sec <<< FAILURE!
java.lang.AssertionError: expected:<4> but was:<5>
at org.junit.Assert.fail(Assert.java:88)
at org.junit.Assert.failNotEquals(Assert.java:743)
at org.junit.Assert.assertEquals(Assert.java:118)
at org.junit.Assert.assertEquals(Assert.java:555)
at org.junit.Assert.assertEquals(Assert.java:542)
at org.apache.phoenix.compile.ViewCompilerTest.assertViewType(ViewCompilerTest.java:72)
at org.apache.phoenix.compile.ViewCompilerTest.testViewTypeCalculation(ViewCompilerTest.java:40)
Running org.apache.phoenix.compile.StatementHintsCompilationTest
Tests run: 3, Failures: 0, Errors: 0, Skipped: 0, Time elapsed: 0.073 sec - in org.apache.phoenix.compile.StatementHintsCompilationTest
Running org.apache.phoenix.compile.SelectStatementRewriterTest
Tests run: 5, Failures: 0, Errors: 0, Skipped: 0, Time elapsed: 0.07 sec - in org.apache.phoenix.compile.SelectStatementRewriterTest
Running org.apache.phoenix.memory.MemoryManagerTest
Tests run: 41, Failures: 0, Errors: 0, Skipped: 1, Time elapsed: 0.183 sec - in org.apache.phoenix.compile.WhereCompilerTest
Running org.apache.phoenix.jdbc.PhoenixEmbeddedDriverTest
Tests run: 3, Failures: 0, Errors: 0, Skipped: 0, Time elapsed: 0.003 sec - in org.apache.phoenix.jdbc.PhoenixEmbeddedDriverTest
Running org.apache.phoenix.jdbc.PhoenixDriverTest
Tests run: 2, Failures: 0, Errors: 0, Skipped: 0, Time elapsed: 0.069 sec - in org.apache.phoenix.jdbc.PhoenixDriverTest
Running org.apache.phoenix.filter.SkipScanFilterTest
Tests run: 13, Failures: 0, Errors: 0, Skipped: 0, Time elapsed: 0.043 sec - in org.apache.phoenix.filter.SkipScanFilterTest
Running org.apache.phoenix.filter.SkipScanFilterIntersectTest
Tests run: 17, Failures: 0, Errors: 0, Skipped: 0, Time elapsed: 0.015 sec - in org.apache.phoenix.filter.SkipScanFilterIntersectTest
Tests run: 5, Failures: 0, Errors: 0, Skipped: 1, Time elapsed: 6.012 sec - in org.apache.phoenix.memory.MemoryManagerTest
Results :
Failed tests:
ViewCompilerTest.testViewTypeCalculation:40->assertViewType:72 expected:<4> but was:<5>
Tests run: 745, Failures: 1, Errors: 0, Skipped: 3
[INFO] ------------------------------------------------------------------------
[INFO] Reactor Summary:
[INFO]
[INFO] Apache Phoenix .................................... SUCCESS [2.209s]
[INFO] Phoenix Hadoop Compatibility ...................... SUCCESS [1.416s]
[INFO] Phoenix Core ...................................... FAILURE [30.367s]
[INFO] Phoenix - Flume ................................... SKIPPED
[INFO] Phoenix - Pig ..................................... SKIPPED
[INFO] Phoenix Hadoop1 Compatibility ..................... SKIPPED
[INFO] Phoenix Assembly .................................. SKIPPED
[INFO] ------------------------------------------------------------------------
[INFO] BUILD FAILURE
[INFO] ------------------------------------------------------------------------
[INFO] Total time: 34.398s
[INFO] Finished at: Fri Jul 25 20:29:54 UTC 2014
[INFO] Final Memory: 39M/682M
[INFO] ------------------------------------------------------------------------
[ERROR] Failed to execute goal org.apache.maven.plugins:maven-surefire-plugin:2.17:test (default-test) on project phoenix-core: There are test failures.
[ERROR]
[ERROR] Please refer to <https://builds.apache.org/job/Phoenix-3.0-hadoop1/ws/phoenix-core/target/surefire-reports> for the individual test results.
[ERROR] -> [Help 1]
[ERROR]
[ERROR] To see the full stack trace of the errors, re-run Maven with the -e switch.
[ERROR] Re-run Maven using the -X switch to enable full debug logging.
[ERROR]
[ERROR] For more information about the errors and possible solutions, please read the following articles:
[ERROR] [Help 1] http://cwiki.apache.org/confluence/display/MAVEN/MojoFailureException
[ERROR]
[ERROR] After correcting the problems, you can resume the build with the command
[ERROR] mvn <goals> -rf :phoenix-core
Build step 'Invoke top-level Maven targets' marked build as failure
Archiving artifacts
Sending artifact delta relative to Phoenix | 3.0 | Hadoop1 #147
Archived 194 artifacts
Archive block size is 32768
Received 0 blocks and 887318 bytes
Compression is 0.0%
Took 24 sec
Updating PHOENIX-1111
Recording test results