You are viewing a plain text version of this content. The canonical link for it is here.
Posted to builds@lucene.apache.org by Policeman Jenkins Server <je...@thetaphi.de> on 2025/10/27 15:55:13 UTC
[JENKINS-EA] Lucene-nightly-main-Linux (64bit/hotspot/jdk-26-ea+17) - Build # 802 - Unstable!
Build: https://jenkins.thetaphi.de/job/Lucene-nightly-main-Linux/802/
Java: 64bit/hotspot/jdk-26-ea+17 -XX:+UseCompressedOops -XX:+UseSerialGC
1 tests failed.
FAILED: org.apache.lucene.backward_index.TestAncientIndicesCompatibility.testUnsupportedOldIndexes
Error Message:
java.lang.IllegalArgumentException: Could not load codec 'Lucene70'. Did you forget to add lucene-backward-codecs.jar?
Stack Trace:
java.lang.IllegalArgumentException: Could not load codec 'Lucene70'. Did you forget to add lucene-backward-codecs.jar?
at __randomizedtesting.SeedInfo.seed([14FBA2DCF615D67D:EF0090FF468E7121]:0)
at org.apache.lucene.core@11.0.0-SNAPSHOT/org.apache.lucene.index.SegmentInfos.readCodec(SegmentInfos.java:532)
at org.apache.lucene.core@11.0.0-SNAPSHOT/org.apache.lucene.index.SegmentInfos.parseSegmentInfos(SegmentInfos.java:397)
at org.apache.lucene.core@11.0.0-SNAPSHOT/org.apache.lucene.index.SegmentInfos.readCommit(SegmentInfos.java:354)
at org.apache.lucene.core@11.0.0-SNAPSHOT/org.apache.lucene.index.SegmentInfos.readCommit(SegmentInfos.java:303)
at org.apache.lucene.core@11.0.0-SNAPSHOT/org.apache.lucene.index.StandardDirectoryReader$1.doBody(StandardDirectoryReader.java:88)
at org.apache.lucene.core@11.0.0-SNAPSHOT/org.apache.lucene.index.StandardDirectoryReader$1.doBody(StandardDirectoryReader.java:77)
at org.apache.lucene.core@11.0.0-SNAPSHOT/org.apache.lucene.index.SegmentInfos$FindSegmentsFile.run(SegmentInfos.java:827)
at org.apache.lucene.core@11.0.0-SNAPSHOT/org.apache.lucene.index.StandardDirectoryReader.open(StandardDirectoryReader.java:105)
at org.apache.lucene.core@11.0.0-SNAPSHOT/org.apache.lucene.index.StandardDirectoryReader.open(StandardDirectoryReader.java:67)
at org.apache.lucene.core@11.0.0-SNAPSHOT/org.apache.lucene.index.DirectoryReader.open(DirectoryReader.java:60)
at org.apache.lucene.backward_index.TestAncientIndicesCompatibility.testUnsupportedOldIndexes(TestAncientIndicesCompatibility.java:106)
at java.base/jdk.internal.reflect.DirectMethodHandleAccessor.invoke(DirectMethodHandleAccessor.java:104)
at java.base/java.lang.reflect.Method.invoke(Method.java:565)
at randomizedtesting.runner@2.8.3/com.carrotsearch.randomizedtesting.RandomizedRunner.invoke(RandomizedRunner.java:1763)
at randomizedtesting.runner@2.8.3/com.carrotsearch.randomizedtesting.RandomizedRunner$8.evaluate(RandomizedRunner.java:946)
at randomizedtesting.runner@2.8.3/com.carrotsearch.randomizedtesting.RandomizedRunner$9.evaluate(RandomizedRunner.java:982)
at randomizedtesting.runner@2.8.3/com.carrotsearch.randomizedtesting.RandomizedRunner$10.evaluate(RandomizedRunner.java:996)
at org.apache.lucene.test_framework@11.0.0-SNAPSHOT/org.apache.lucene.tests.util.TestRuleSetupTeardownChained$1.evaluate(TestRuleSetupTeardownChained.java:48)
at org.apache.lucene.test_framework@11.0.0-SNAPSHOT/org.apache.lucene.tests.util.AbstractBeforeAfterRule$1.evaluate(AbstractBeforeAfterRule.java:43)
at org.apache.lucene.test_framework@11.0.0-SNAPSHOT/org.apache.lucene.tests.util.TestRuleThreadAndTestName$1.evaluate(TestRuleThreadAndTestName.java:45)
at org.apache.lucene.test_framework@11.0.0-SNAPSHOT/org.apache.lucene.tests.util.TestRuleIgnoreAfterMaxFailures$1.evaluate(TestRuleIgnoreAfterMaxFailures.java:60)
at org.apache.lucene.test_framework@11.0.0-SNAPSHOT/org.apache.lucene.tests.util.TestRuleMarkFailure$1.evaluate(TestRuleMarkFailure.java:44)
at junit@4.13.2/org.junit.rules.RunRules.evaluate(RunRules.java:20)
at randomizedtesting.runner@2.8.3/com.carrotsearch.randomizedtesting.rules.StatementAdapter.evaluate(StatementAdapter.java:36)
at randomizedtesting.runner@2.8.3/com.carrotsearch.randomizedtesting.ThreadLeakControl$StatementRunner.run(ThreadLeakControl.java:390)
at randomizedtesting.runner@2.8.3/com.carrotsearch.randomizedtesting.ThreadLeakControl.forkTimeoutingTask(ThreadLeakControl.java:843)
at randomizedtesting.runner@2.8.3/com.carrotsearch.randomizedtesting.ThreadLeakControl$3.evaluate(ThreadLeakControl.java:490)
at randomizedtesting.runner@2.8.3/com.carrotsearch.randomizedtesting.RandomizedRunner.runSingleTest(RandomizedRunner.java:955)
at randomizedtesting.runner@2.8.3/com.carrotsearch.randomizedtesting.RandomizedRunner$5.evaluate(RandomizedRunner.java:840)
at randomizedtesting.runner@2.8.3/com.carrotsearch.randomizedtesting.RandomizedRunner$6.evaluate(RandomizedRunner.java:891)
at randomizedtesting.runner@2.8.3/com.carrotsearch.randomizedtesting.RandomizedRunner$7.evaluate(RandomizedRunner.java:902)
at org.apache.lucene.test_framework@11.0.0-SNAPSHOT/org.apache.lucene.tests.util.AbstractBeforeAfterRule$1.evaluate(AbstractBeforeAfterRule.java:43)
at randomizedtesting.runner@2.8.3/com.carrotsearch.randomizedtesting.rules.StatementAdapter.evaluate(StatementAdapter.java:36)
at org.apache.lucene.test_framework@11.0.0-SNAPSHOT/org.apache.lucene.tests.util.TestRuleStoreClassName$1.evaluate(TestRuleStoreClassName.java:38)
at randomizedtesting.runner@2.8.3/com.carrotsearch.randomizedtesting.rules.NoShadowingOrOverridesOnMethodsRule$1.evaluate(NoShadowingOrOverridesOnMethodsRule.java:40)
at randomizedtesting.runner@2.8.3/com.carrotsearch.randomizedtesting.rules.NoShadowingOrOverridesOnMethodsRule$1.evaluate(NoShadowingOrOverridesOnMethodsRule.java:40)
at randomizedtesting.runner@2.8.3/com.carrotsearch.randomizedtesting.rules.StatementAdapter.evaluate(StatementAdapter.java:36)
at randomizedtesting.runner@2.8.3/com.carrotsearch.randomizedtesting.rules.StatementAdapter.evaluate(StatementAdapter.java:36)
at org.apache.lucene.test_framework@11.0.0-SNAPSHOT/org.apache.lucene.tests.util.TestRuleAssertionsRequired$1.evaluate(TestRuleAssertionsRequired.java:52)
at org.apache.lucene.test_framework@11.0.0-SNAPSHOT/org.apache.lucene.tests.util.AbstractBeforeAfterRule$1.evaluate(AbstractBeforeAfterRule.java:43)
at org.apache.lucene.test_framework@11.0.0-SNAPSHOT/org.apache.lucene.tests.util.TestRuleMarkFailure$1.evaluate(TestRuleMarkFailure.java:44)
at org.apache.lucene.test_framework@11.0.0-SNAPSHOT/org.apache.lucene.tests.util.TestRuleIgnoreAfterMaxFailures$1.evaluate(TestRuleIgnoreAfterMaxFailures.java:60)
at org.apache.lucene.test_framework@11.0.0-SNAPSHOT/org.apache.lucene.tests.util.TestRuleIgnoreTestSuites$1.evaluate(TestRuleIgnoreTestSuites.java:47)
at junit@4.13.2/org.junit.rules.RunRules.evaluate(RunRules.java:20)
at randomizedtesting.runner@2.8.3/com.carrotsearch.randomizedtesting.rules.StatementAdapter.evaluate(StatementAdapter.java:36)
at randomizedtesting.runner@2.8.3/com.carrotsearch.randomizedtesting.ThreadLeakControl$StatementRunner.run(ThreadLeakControl.java:390)
at randomizedtesting.runner@2.8.3/com.carrotsearch.randomizedtesting.ThreadLeakControl.lambda$forkTimeoutingTask$0(ThreadLeakControl.java:850)
at java.base/java.lang.Thread.run(Thread.java:1474)
Suppressed: org.apache.lucene.index.CorruptIndexException: checksum passed (3069e1d3). possibly transient resource issue, or a Lucene or JVM bug (resource=BufferedChecksumIndexInput(MemorySegmentIndexInput(path="/home/jenkins/workspace/Lucene-nightly-main-Linux/lucene/backward-codecs/build/tests-tmp/lucene.backward_index.TestAncientIndicesCompatibility_14FBA2DCF615D67D-001/7.4.0-cfs-001/segments_3")))
at app/org.apache.lucene.core@11.0.0-SNAPSHOT/org.apache.lucene.codecs.CodecUtil.checkFooter(CodecUtil.java:501)
at app/org.apache.lucene.core@11.0.0-SNAPSHOT/org.apache.lucene.index.SegmentInfos.readCommit(SegmentInfos.java:361)
... 45 more
Caused by: java.lang.IllegalArgumentException: An SPI class of type org.apache.lucene.codecs.Codec with name 'Lucene70' does not exist. You need to add the corresponding JAR file supporting this SPI to your classpath. The current classpath supports the following names: [Lucene104, Asserting, CheapBastard, DeflateWithPresetCompressingStoredFieldsData, FastCompressingStoredFieldsData, FastDecompressionCompressingStoredFieldsData, HighCompressionCompressingStoredFieldsData, LZ4WithPresetCompressingStoredFieldsData, DummyCompressingStoredFieldsData, ConfigurableMCodec, SimpleText, Lucene80, Lucene84, Lucene86, Lucene87, Lucene90, Lucene91, Lucene92, Lucene94, Lucene95, Lucene99, Lucene912, Lucene100, Lucene101, Lucene103]
at org.apache.lucene.core@11.0.0-SNAPSHOT/org.apache.lucene.util.NamedSPILoader.lookup(NamedSPILoader.java:113)
at org.apache.lucene.core@11.0.0-SNAPSHOT/org.apache.lucene.codecs.Codec.forName(Codec.java:119)
at org.apache.lucene.core@11.0.0-SNAPSHOT/org.apache.lucene.index.SegmentInfos.readCodec(SegmentInfos.java:528)
... 47 more