You are viewing a plain text version of this content. The canonical link for it is here.
Posted to issues@flink.apache.org by "Xintong Song (Jira)" <ji...@apache.org> on 2021/08/20 10:52:00 UTC

[jira] [Created] (FLINK-23903) ZooKeeperLeaderRetrievalConnectionHandlingTest.testSuspendedConnectionDoesNotClearLeaderInformationIfClearanceOnLostConnection fails on azure

Xintong Song created FLINK-23903:
------------------------------------

             Summary: ZooKeeperLeaderRetrievalConnectionHandlingTest.testSuspendedConnectionDoesNotClearLeaderInformationIfClearanceOnLostConnection fails on azure
                 Key: FLINK-23903
                 URL: https://issues.apache.org/jira/browse/FLINK-23903
             Project: Flink
          Issue Type: Bug
          Components: Runtime / Coordination
    Affects Versions: 1.14.0
            Reporter: Xintong Song
             Fix For: 1.14.0


https://dev.azure.com/apache-flink/apache-flink/_build/results?buildId=22534&view=logs&j=a57e0635-3fad-5b08-57c7-a4142d7d6fa9&t=2ef0effc-1da1-50e5-c2bd-aab434b1c5b7&l=6647

{code}
Aug 20 07:54:25 [ERROR] Tests run: 5, Failures: 1, Errors: 0, Skipped: 0, Time elapsed: 14.652 s <<< FAILURE! - in org.apache.flink.runtime.leaderelection.ZooKeeperLeaderRetrievalConnectionHandlingTest
Aug 20 07:54:25 [ERROR] testSuspendedConnectionDoesNotClearLeaderInformationIfClearanceOnLostConnection  Time elapsed: 2.244 s  <<< FAILURE!
Aug 20 07:54:25 java.lang.AssertionError: 
Aug 20 07:54:25 
Aug 20 07:54:25 Expected: is null
Aug 20 07:54:25      but: was <java.util.concurrent.CompletableFuture@2d6764b2[Completed normally]>
Aug 20 07:54:25 	at org.hamcrest.MatcherAssert.assertThat(MatcherAssert.java:20)
Aug 20 07:54:25 	at org.hamcrest.MatcherAssert.assertThat(MatcherAssert.java:8)
Aug 20 07:54:25 	at org.apache.flink.runtime.leaderelection.ZooKeeperLeaderRetrievalConnectionHandlingTest.testSuspendedConnectionDoesNotClearLeaderInformationIfClearanceOnLostConnection(ZooKeeperLeaderRetrievalConnectionHandlingTest.java:211)
Aug 20 07:54:25 	at sun.reflect.NativeMethodAccessorImpl.invoke0(Native Method)
Aug 20 07:54:25 	at sun.reflect.NativeMethodAccessorImpl.invoke(NativeMethodAccessorImpl.java:62)
Aug 20 07:54:25 	at sun.reflect.DelegatingMethodAccessorImpl.invoke(DelegatingMethodAccessorImpl.java:43)
Aug 20 07:54:25 	at java.lang.reflect.Method.invoke(Method.java:498)
Aug 20 07:54:25 	at org.junit.runners.model.FrameworkMethod$1.runReflectiveCall(FrameworkMethod.java:59)
Aug 20 07:54:25 	at org.junit.internal.runners.model.ReflectiveCallable.run(ReflectiveCallable.java:12)
Aug 20 07:54:25 	at org.junit.runners.model.FrameworkMethod.invokeExplosively(FrameworkMethod.java:56)
Aug 20 07:54:25 	at org.junit.internal.runners.statements.InvokeMethod.evaluate(InvokeMethod.java:17)
Aug 20 07:54:25 	at org.junit.internal.runners.statements.RunBefores.evaluate(RunBefores.java:26)
Aug 20 07:54:25 	at org.junit.internal.runners.statements.RunAfters.evaluate(RunAfters.java:27)
Aug 20 07:54:25 	at org.apache.flink.runtime.util.TestingFatalErrorHandlerResource$CloseableStatement.evaluate(TestingFatalErrorHandlerResource.java:91)
Aug 20 07:54:25 	at org.apache.flink.runtime.util.TestingFatalErrorHandlerResource$CloseableStatement.access$200(TestingFatalErrorHandlerResource.java:83)
Aug 20 07:54:25 	at org.apache.flink.runtime.util.TestingFatalErrorHandlerResource$1.evaluate(TestingFatalErrorHandlerResource.java:55)
Aug 20 07:54:25 	at org.apache.flink.util.TestNameProvider$1.evaluate(TestNameProvider.java:45)
{code}



--
This message was sent by Atlassian Jira
(v8.3.4#803005)