You are viewing a plain text version of this content. The canonical link for it is here.
Posted to commits@phoenix.apache.org by Apache Jenkins Server <je...@builds.apache.org> on 2020/03/26 08:23:42 UTC

Build failed in Jenkins: Phoenix | 4.x | HBase Profile » 1.3 #24

See <https://builds.apache.org/job/Phoenix-4.x-matrix/HBASE_PROFILE=1.3/24/display/redirect>

Changes:


------------------------------------------
[...truncated 124.43 KB...]
[INFO] 
[INFO] Tests run: 0, Failures: 0, Errors: 0, Skipped: 0
[INFO] 
[INFO] 
[INFO] --- maven-failsafe-plugin:2.22.0:integration-test (NeedTheirOwnClusterTests) @ phoenix-core ---
[INFO] 
[INFO] -------------------------------------------------------
[INFO]  T E S T S
[INFO] -------------------------------------------------------
[INFO] Running org.apache.hadoop.hbase.regionserver.wal.WALReplayWithIndexWritesAndCompressedWALIT
[WARNING] Tests run: 1, Failures: 0, Errors: 0, Skipped: 1, Time elapsed: 0.004 s - in org.apache.hadoop.hbase.regionserver.wal.WALReplayWithIndexWritesAndCompressedWALIT
[INFO] Running org.apache.phoenix.end2end.BackwardCompatibilityIT
[INFO] Running org.apache.phoenix.end2end.ConnectionUtilIT
[INFO] Running org.apache.hadoop.hbase.regionserver.wal.WALRecoveryRegionPostOpenIT
[INFO] Tests run: 1, Failures: 0, Errors: 0, Skipped: 0, Time elapsed: 9.546 s - in org.apache.hadoop.hbase.regionserver.wal.WALRecoveryRegionPostOpenIT
[INFO] Running org.apache.phoenix.end2end.ConcurrentMutationsExtendedIT
[INFO] Running org.apache.phoenix.end2end.CountDistinctCompressionIT
[INFO] Tests run: 1, Failures: 0, Errors: 0, Skipped: 0, Time elapsed: 4.661 s - in org.apache.phoenix.end2end.CountDistinctCompressionIT
[INFO] Running org.apache.phoenix.end2end.ContextClassloaderIT
[INFO] Tests run: 1, Failures: 0, Errors: 0, Skipped: 0, Time elapsed: 53.559 s - in org.apache.phoenix.end2end.ConnectionUtilIT
[INFO] Tests run: 3, Failures: 0, Errors: 0, Skipped: 0, Time elapsed: 4.613 s - in org.apache.phoenix.end2end.ContextClassloaderIT
[INFO] Running org.apache.phoenix.end2end.CostBasedDecisionIT
[INFO] Running org.apache.phoenix.end2end.CsvBulkLoadToolIT
[INFO] Running org.apache.phoenix.end2end.DropSchemaIT
[INFO] Running org.apache.phoenix.end2end.FlappingLocalIndexIT
[INFO] Running org.apache.phoenix.end2end.IndexBuildTimestampIT
[INFO] Tests run: 2, Failures: 0, Errors: 0, Skipped: 0, Time elapsed: 32.378 s - in org.apache.phoenix.end2end.DropSchemaIT
[INFO] Running org.apache.phoenix.end2end.IndexExtendedIT
[INFO] Tests run: 16, Failures: 0, Errors: 0, Skipped: 0, Time elapsed: 146.568 s - in org.apache.phoenix.end2end.CsvBulkLoadToolIT
[INFO] Tests run: 10, Failures: 0, Errors: 0, Skipped: 0, Time elapsed: 272.887 s - in org.apache.phoenix.end2end.ConcurrentMutationsExtendedIT
[INFO] Tests run: 12, Failures: 0, Errors: 0, Skipped: 0, Time elapsed: 191.765 s - in org.apache.phoenix.end2end.FlappingLocalIndexIT
[INFO] Running org.apache.phoenix.end2end.IndexRebuildTaskIT
[INFO] Tests run: 16, Failures: 0, Errors: 0, Skipped: 0, Time elapsed: 193.318 s - in org.apache.phoenix.end2end.IndexBuildTimestampIT
[INFO] Tests run: 1, Failures: 0, Errors: 0, Skipped: 0, Time elapsed: 27.239 s - in org.apache.phoenix.end2end.IndexRebuildTaskIT
[INFO] Running org.apache.phoenix.end2end.IndexScrutinyToolForTenantIT
[INFO] Running org.apache.phoenix.end2end.IndexScrutinyToolIT
[INFO] Running org.apache.phoenix.end2end.IndexToolForPartialBuildIT
[INFO] Running org.apache.phoenix.end2end.IndexToolForPartialBuildWithNamespaceEnabledIT
[INFO] Tests run: 1, Failures: 0, Errors: 0, Skipped: 0, Time elapsed: 26.795 s - in org.apache.phoenix.end2end.IndexToolForPartialBuildIT
[INFO] Tests run: 6, Failures: 0, Errors: 0, Skipped: 0, Time elapsed: 98.662 s - in org.apache.phoenix.end2end.IndexScrutinyToolForTenantIT
[INFO] Tests run: 2, Failures: 0, Errors: 0, Skipped: 0, Time elapsed: 48.337 s - in org.apache.phoenix.end2end.IndexToolForPartialBuildWithNamespaceEnabledIT
[INFO] Tests run: 64, Failures: 0, Errors: 0, Skipped: 0, Time elapsed: 265.287 s - in org.apache.phoenix.end2end.IndexExtendedIT
[INFO] Running org.apache.phoenix.end2end.IndexToolIT
[INFO] Running org.apache.phoenix.end2end.LocalIndexSplitMergeIT
[INFO] Running org.apache.phoenix.end2end.IndexToolTimeRangeIT
[INFO] Running org.apache.phoenix.end2end.MaxLookbackIT
[WARNING] Tests run: 6, Failures: 0, Errors: 0, Skipped: 2, Time elapsed: 51.902 s - in org.apache.phoenix.end2end.IndexToolTimeRangeIT
[INFO] Running org.apache.phoenix.end2end.MigrateSystemTablesToSystemNamespaceIT
[INFO] Tests run: 4, Failures: 0, Errors: 0, Skipped: 0, Time elapsed: 67.965 s - in org.apache.phoenix.end2end.MaxLookbackIT
[INFO] Tests run: 20, Failures: 0, Errors: 0, Skipped: 0, Time elapsed: 631.779 s - in org.apache.phoenix.end2end.CostBasedDecisionIT
[INFO] Running org.apache.phoenix.end2end.OrderByWithServerClientSpoolingDisabledIT
[INFO] Tests run: 3, Failures: 0, Errors: 0, Skipped: 0, Time elapsed: 184.326 s - in org.apache.phoenix.end2end.LocalIndexSplitMergeIT
[INFO] Running org.apache.phoenix.end2end.OrderByWithServerMemoryLimitIT
[INFO] Tests run: 1, Failures: 0, Errors: 0, Skipped: 0, Time elapsed: 2.643 s - in org.apache.phoenix.end2end.OrderByWithServerMemoryLimitIT
[INFO] Running org.apache.phoenix.end2end.ParameterizedIndexUpgradeToolIT
[INFO] Running org.apache.phoenix.end2end.OrderByWithSpillingIT
[WARNING] Tests run: 33, Failures: 0, Errors: 0, Skipped: 3, Time elapsed: 424.253 s - in org.apache.phoenix.end2end.IndexScrutinyToolIT
[INFO] Running org.apache.phoenix.end2end.PartialResultServerConfigurationIT
[INFO] Tests run: 1, Failures: 0, Errors: 0, Skipped: 0, Time elapsed: 133.998 s - in org.apache.phoenix.end2end.PartialResultServerConfigurationIT
[INFO] Running org.apache.phoenix.end2end.PermissionNSDisabledIT
[INFO] Tests run: 16, Failures: 0, Errors: 0, Skipped: 0, Time elapsed: 356.352 s - in org.apache.phoenix.end2end.OrderByWithServerClientSpoolingDisabledIT
[INFO] Running org.apache.phoenix.end2end.PermissionNSEnabledIT
[INFO] Tests run: 4, Failures: 0, Errors: 0, Skipped: 0, Time elapsed: 674.846 s - in org.apache.phoenix.end2end.MigrateSystemTablesToSystemNamespaceIT
[INFO] Running org.apache.phoenix.end2end.PermissionsCacheIT
[INFO] Tests run: 16, Failures: 0, Errors: 0, Skipped: 0, Time elapsed: 552.837 s - in org.apache.phoenix.end2end.OrderByWithSpillingIT
[INFO] Running org.apache.phoenix.end2end.PhoenixDriverIT
[INFO] Tests run: 4, Failures: 0, Errors: 0, Skipped: 0, Time elapsed: 100.187 s - in org.apache.phoenix.end2end.PhoenixDriverIT
[INFO] Tests run: 9, Failures: 0, Errors: 0, Skipped: 0, Time elapsed: 491.118 s - in org.apache.phoenix.end2end.PermissionNSDisabledIT
[INFO] Tests run: 12, Failures: 0, Errors: 0, Skipped: 0, Time elapsed: 1,607.911 s - in org.apache.phoenix.end2end.BackwardCompatibilityIT
[INFO] Running org.apache.phoenix.end2end.QueryLoggerIT
[INFO] Running org.apache.phoenix.end2end.QueryTimeoutIT
[INFO] Tests run: 12, Failures: 0, Errors: 0, Skipped: 0, Time elapsed: 456.451 s - in org.apache.phoenix.end2end.PermissionNSEnabledIT
[INFO] Tests run: 2, Failures: 0, Errors: 0, Skipped: 0, Time elapsed: 10.693 s - in org.apache.phoenix.end2end.QueryTimeoutIT
[INFO] Running org.apache.phoenix.end2end.QueryWithLimitIT
[INFO] Tests run: 2, Failures: 0, Errors: 0, Skipped: 0, Time elapsed: 9.59 s - in org.apache.phoenix.end2end.QueryWithLimitIT
[INFO] Tests run: 7, Failures: 0, Errors: 0, Skipped: 0, Time elapsed: 64 s - in org.apache.phoenix.end2end.QueryLoggerIT
[INFO] Tests run: 10, Failures: 0, Errors: 0, Skipped: 0, Time elapsed: 325.509 s - in org.apache.phoenix.end2end.PermissionsCacheIT
[INFO] Running org.apache.phoenix.end2end.RegexBulkLoadToolIT
[INFO] Running org.apache.phoenix.end2end.RebuildIndexConnectionPropsIT
[INFO] Tests run: 1, Failures: 0, Errors: 0, Skipped: 0, Time elapsed: 0.349 s - in org.apache.phoenix.end2end.RebuildIndexConnectionPropsIT
[INFO] Running org.apache.phoenix.end2end.RenewLeaseIT
[INFO] Running org.apache.phoenix.end2end.SequencePointInTimeIT
[INFO] Tests run: 1, Failures: 0, Errors: 0, Skipped: 0, Time elapsed: 0.127 s - in org.apache.phoenix.end2end.SequencePointInTimeIT
[INFO] Tests run: 1, Failures: 0, Errors: 0, Skipped: 0, Time elapsed: 28.615 s - in org.apache.phoenix.end2end.RenewLeaseIT
[INFO] Running org.apache.phoenix.end2end.SpillableGroupByIT
[INFO] Running org.apache.phoenix.end2end.SystemCatalogCreationOnConnectionIT
[INFO] Tests run: 3, Failures: 0, Errors: 0, Skipped: 0, Time elapsed: 17.93 s - in org.apache.phoenix.end2end.SpillableGroupByIT
[WARNING] Tests run: 10, Failures: 0, Errors: 0, Skipped: 2, Time elapsed: 75.006 s - in org.apache.phoenix.end2end.RegexBulkLoadToolIT
[INFO] Running org.apache.phoenix.end2end.StatsEnabledSplitSystemCatalogIT
[INFO] Tests run: 165, Failures: 0, Errors: 0, Skipped: 0, Time elapsed: 1,287.98 s - in org.apache.phoenix.end2end.IndexToolIT
[INFO] Running org.apache.phoenix.end2end.UpdateCacheAcrossDifferentClientsIT
[INFO] Running org.apache.phoenix.end2end.SystemCatalogIT
[INFO] Running org.apache.phoenix.end2end.TableSnapshotReadsMapReduceIT
[INFO] Running org.apache.phoenix.end2end.UpgradeIT
[INFO] Tests run: 4, Failures: 0, Errors: 0, Skipped: 0, Time elapsed: 45.303 s - in org.apache.phoenix.end2end.TableSnapshotReadsMapReduceIT
[INFO] Tests run: 18, Failures: 0, Errors: 0, Skipped: 0, Time elapsed: 123.044 s - in org.apache.phoenix.end2end.StatsEnabledSplitSystemCatalogIT
[INFO] Tests run: 6, Failures: 0, Errors: 0, Skipped: 0, Time elapsed: 119.474 s - in org.apache.phoenix.end2end.UpdateCacheAcrossDifferentClientsIT
[INFO] Tests run: 2, Failures: 0, Errors: 0, Skipped: 0, Time elapsed: 101.591 s - in org.apache.phoenix.end2end.SystemCatalogIT
[INFO] Running org.apache.phoenix.end2end.UserDefinedFunctionsIT
[INFO] Running org.apache.phoenix.end2end.index.ImmutableIndexIT
[INFO] Running org.apache.phoenix.end2end.index.GlobalIndexCheckerIT
[INFO] Running org.apache.phoenix.end2end.index.IndexRebuildIncrementDisableCountIT
[INFO] Tests run: 2, Failures: 0, Errors: 0, Skipped: 0, Time elapsed: 15.385 s - in org.apache.phoenix.end2end.index.IndexRebuildIncrementDisableCountIT
[INFO] Tests run: 9, Failures: 0, Errors: 0, Skipped: 0, Time elapsed: 155.758 s - in org.apache.phoenix.end2end.UpgradeIT
[INFO] Running org.apache.phoenix.end2end.index.LocalIndexIT
[INFO] Running org.apache.phoenix.end2end.index.MutableIndexExtendedIT
[INFO] Tests run: 16, Failures: 0, Errors: 0, Skipped: 0, Time elapsed: 173.188 s - in org.apache.phoenix.end2end.UserDefinedFunctionsIT
[INFO] Running org.apache.phoenix.end2end.index.MutableIndexFailureIT
[INFO] Tests run: 9, Failures: 0, Errors: 0, Skipped: 0, Time elapsed: 104.017 s - in org.apache.phoenix.end2end.index.MutableIndexExtendedIT
[INFO] Running org.apache.phoenix.end2end.index.MutableIndexFailureWithNamespaceIT
[INFO] Tests run: 44, Failures: 0, Errors: 0, Skipped: 0, Time elapsed: 424.232 s - in org.apache.phoenix.end2end.index.GlobalIndexCheckerIT
[INFO] Running org.apache.phoenix.end2end.index.MutableIndexRebuilderIT
[INFO] Tests run: 14, Failures: 0, Errors: 0, Skipped: 0, Time elapsed: 276.947 s - in org.apache.phoenix.end2end.index.MutableIndexFailureIT
[INFO] Tests run: 8, Failures: 0, Errors: 0, Skipped: 0, Time elapsed: 187.454 s - in org.apache.phoenix.end2end.index.MutableIndexFailureWithNamespaceIT
[INFO] Tests run: 1, Failures: 0, Errors: 0, Skipped: 0, Time elapsed: 86.375 s - in org.apache.phoenix.end2end.index.MutableIndexRebuilderIT
[WARNING] Tests run: 63, Failures: 0, Errors: 0, Skipped: 18, Time elapsed: 552.91 s - in org.apache.phoenix.end2end.index.ImmutableIndexIT
[INFO] Running org.apache.phoenix.end2end.index.MutableIndexReplicationIT
[INFO] Running org.apache.phoenix.end2end.index.PartialIndexRebuilderIT
[INFO] Running org.apache.phoenix.end2end.index.PhoenixMRJobSubmitterIT
[INFO] Tests run: 1, Failures: 0, Errors: 0, Skipped: 0, Time elapsed: 13.773 s - in org.apache.phoenix.end2end.index.PhoenixMRJobSubmitterIT
[INFO] Tests run: 1, Failures: 0, Errors: 0, Skipped: 0, Time elapsed: 41.425 s - in org.apache.phoenix.end2end.index.MutableIndexReplicationIT
[INFO] Running org.apache.phoenix.end2end.index.ShortViewIndexIdIT
[INFO] Tests run: 2, Failures: 0, Errors: 0, Skipped: 0, Time elapsed: 23.533 s - in org.apache.phoenix.end2end.index.ShortViewIndexIdIT
[INFO] Tests run: 11, Failures: 0, Errors: 0, Skipped: 0, Time elapsed: 924.171 s - in org.apache.phoenix.end2end.SystemCatalogCreationOnConnectionIT
[INFO] Running org.apache.phoenix.end2end.index.txn.TxWriteFailureIT
[INFO] Running org.apache.phoenix.end2end.join.HashJoinCacheIT
[INFO] Running org.apache.phoenix.end2end.join.SortMergeJoinNoSpoolingIT
[INFO] Tests run: 3, Failures: 0, Errors: 0, Skipped: 0, Time elapsed: 40.687 s - in org.apache.phoenix.end2end.join.HashJoinCacheIT
[INFO] Running org.apache.phoenix.execute.PartialCommitIT
[INFO] Tests run: 35, Failures: 0, Errors: 0, Skipped: 0, Time elapsed: 33.785 s - in org.apache.phoenix.end2end.join.SortMergeJoinNoSpoolingIT
[INFO] Running org.apache.phoenix.hbase.index.FailForUnsupportedHBaseVersionsIT
[INFO] Tests run: 50, Failures: 0, Errors: 0, Skipped: 0, Time elapsed: 694.804 s - in org.apache.phoenix.end2end.index.LocalIndexIT
[INFO] Tests run: 12, Failures: 0, Errors: 0, Skipped: 0, Time elapsed: 99.516 s - in org.apache.phoenix.end2end.index.txn.TxWriteFailureIT
[INFO] Tests run: 2, Failures: 0, Errors: 0, Skipped: 0, Time elapsed: 33.96 s - in org.apache.phoenix.hbase.index.FailForUnsupportedHBaseVersionsIT
[INFO] Running org.apache.phoenix.execute.UpsertSelectOverlappingBatchesIT
[INFO] Running org.apache.phoenix.jdbc.SecureUserConnectionsIT
[INFO] Tests run: 20, Failures: 0, Errors: 0, Skipped: 0, Time elapsed: 268.809 s - in org.apache.phoenix.end2end.index.PartialIndexRebuilderIT
[INFO] Tests run: 8, Failures: 0, Errors: 0, Skipped: 0, Time elapsed: 8.043 s - in org.apache.phoenix.jdbc.SecureUserConnectionsIT
[INFO] Running org.apache.phoenix.iterate.RoundRobinResultIteratorWithStatsIT
[INFO] Running org.apache.phoenix.iterate.ScannerLeaseRenewalIT
[INFO] Tests run: 1, Failures: 0, Errors: 0, Skipped: 0, Time elapsed: 7.394 s - in org.apache.phoenix.iterate.RoundRobinResultIteratorWithStatsIT
[INFO] Tests run: 3, Failures: 0, Errors: 0, Skipped: 0, Time elapsed: 80.049 s - in org.apache.phoenix.execute.UpsertSelectOverlappingBatchesIT
[INFO] Tests run: 12, Failures: 0, Errors: 0, Skipped: 0, Time elapsed: 165.969 s - in org.apache.phoenix.execute.PartialCommitIT
[INFO] Running org.apache.phoenix.monitoring.PhoenixLoggingMetricsIT
[INFO] Running org.apache.phoenix.monitoring.PhoenixMetricsDisabledIT
[INFO] Tests run: 1, Failures: 0, Errors: 0, Skipped: 0, Time elapsed: 0.011 s - in org.apache.phoenix.monitoring.PhoenixMetricsDisabledIT
[INFO] Running org.apache.phoenix.rpc.PhoenixClientRpcIT
[INFO] Running org.apache.phoenix.monitoring.PhoenixMetricsIT
[INFO] Tests run: 2, Failures: 0, Errors: 0, Skipped: 0, Time elapsed: 9.491 s - in org.apache.phoenix.rpc.PhoenixClientRpcIT
[INFO] Tests run: 4, Failures: 0, Errors: 0, Skipped: 0, Time elapsed: 45.691 s - in org.apache.phoenix.monitoring.PhoenixLoggingMetricsIT
[INFO] Running org.apache.phoenix.rpc.PhoenixServerRpcIT
[INFO] Tests run: 2, Failures: 0, Errors: 0, Skipped: 0, Time elapsed: 11.473 s - in org.apache.phoenix.rpc.PhoenixServerRpcIT
[INFO] Running org.apache.phoenix.schema.stats.NamespaceDisabledStatsCollectorIT
[INFO] Running org.apache.phoenix.schema.stats.NoOpStatsCollectorIT
[INFO] Running org.apache.phoenix.schema.stats.NamespaceEnabledStatsCollectorIT
[INFO] Tests run: 2, Failures: 0, Errors: 0, Skipped: 0, Time elapsed: 169.514 s - in org.apache.phoenix.iterate.ScannerLeaseRenewalIT
[INFO] Tests run: 2, Failures: 0, Errors: 0, Skipped: 0, Time elapsed: 16.222 s - in org.apache.phoenix.schema.stats.NoOpStatsCollectorIT
[INFO] Running org.apache.phoenix.tool.ParameterizedPhoenixCanaryToolIT
[INFO] Running org.apache.phoenix.schema.stats.NonTxStatsCollectorIT
[INFO] Tests run: 22, Failures: 0, Errors: 0, Skipped: 0, Time elapsed: 118.1 s - in org.apache.phoenix.monitoring.PhoenixMetricsIT
[INFO] Running org.apache.phoenix.schema.stats.TxStatsCollectorIT
[INFO] Running org.apache.phoenix.util.CoprocessorHConnectionTableFactoryIT
[INFO] Tests run: 1, Failures: 0, Errors: 0, Skipped: 0, Time elapsed: 16.296 s - in org.apache.phoenix.util.CoprocessorHConnectionTableFactoryIT
[INFO] Tests run: 8, Failures: 0, Errors: 0, Skipped: 0, Time elapsed: 142.659 s - in org.apache.phoenix.tool.ParameterizedPhoenixCanaryToolIT
[INFO] Tests run: 8, Failures: 0, Errors: 0, Skipped: 0, Time elapsed: 2,455.404 s - in org.apache.phoenix.end2end.ParameterizedIndexUpgradeToolIT
[WARNING] Tests run: 26, Failures: 0, Errors: 0, Skipped: 4, Time elapsed: 254.021 s - in org.apache.phoenix.schema.stats.NamespaceDisabledStatsCollectorIT
[WARNING] Tests run: 39, Failures: 0, Errors: 0, Skipped: 6, Time elapsed: 220.962 s - in org.apache.phoenix.schema.stats.NonTxStatsCollectorIT
[WARNING] Tests run: 26, Failures: 0, Errors: 0, Skipped: 4, Time elapsed: 281.075 s - in org.apache.phoenix.schema.stats.NamespaceEnabledStatsCollectorIT
[WARNING] Tests run: 78, Failures: 0, Errors: 0, Skipped: 12, Time elapsed: 383.193 s - in org.apache.phoenix.schema.stats.TxStatsCollectorIT
[INFO] 
[INFO] Results:
[INFO] 
[WARNING] Tests run: 1058, Failures: 0, Errors: 0, Skipped: 52
[INFO] 
[INFO] 
[INFO] --- maven-failsafe-plugin:2.22.0:integration-test (SplitSystemCatalogTests) @ phoenix-core ---
[INFO] 
[INFO] -------------------------------------------------------
[INFO]  T E S T S
[INFO] -------------------------------------------------------
[INFO] Running org.apache.phoenix.end2end.AlterMultiTenantTableWithViewsIT
[INFO] Running org.apache.phoenix.end2end.DropIndexedColsIT
[INFO] Running org.apache.phoenix.end2end.DropTableWithViewsIT
[INFO] Running org.apache.phoenix.end2end.AlterTableWithViewsIT
[INFO] Running org.apache.phoenix.end2end.TenantSpecificViewIndexSaltedIT
[INFO] Running org.apache.phoenix.end2end.TenantSpecificViewIndexIT
[INFO] Tests run: 4, Failures: 0, Errors: 0, Skipped: 0, Time elapsed: 50.971 s - in org.apache.phoenix.end2end.DropTableWithViewsIT
[INFO] Tests run: 4, Failures: 0, Errors: 0, Skipped: 0, Time elapsed: 51.902 s - in org.apache.phoenix.end2end.DropIndexedColsIT
[INFO] Running org.apache.phoenix.end2end.ViewIT
[INFO] Tests run: 4, Failures: 0, Errors: 0, Skipped: 0, Time elapsed: 64.346 s - in org.apache.phoenix.end2end.TenantSpecificViewIndexSaltedIT
[INFO] Tests run: 9, Failures: 0, Errors: 0, Skipped: 0, Time elapsed: 137.147 s - in org.apache.phoenix.end2end.AlterMultiTenantTableWithViewsIT
[INFO] Tests run: 10, Failures: 0, Errors: 0, Skipped: 0, Time elapsed: 155.727 s - in org.apache.phoenix.end2end.TenantSpecificViewIndexIT
[INFO] Running org.apache.phoenix.end2end.ViewMetadataIT
[INFO] Running org.apache.phoenix.end2end.index.ViewIndexIT
[INFO] Tests run: 56, Failures: 0, Errors: 0, Skipped: 0, Time elapsed: 466.548 s - in org.apache.phoenix.end2end.AlterTableWithViewsIT
[ERROR] Tests run: 24, Failures: 0, Errors: 1, Skipped: 2, Time elapsed: 215.042 s <<< FAILURE! - in org.apache.phoenix.end2end.index.ViewIndexIT
[ERROR] testMultiTenantViewGlobalIndex[ViewIndexIT_isNamespaceMapped=false](org.apache.phoenix.end2end.index.ViewIndexIT)  Time elapsed: 5.63 s  <<< ERROR!
java.lang.NullPointerException
	at org.apache.phoenix.end2end.index.ViewIndexIT.testMultiTenantViewGlobalIndex(ViewIndexIT.java:344)

[INFO] Tests run: 85, Failures: 0, Errors: 0, Skipped: 0, Time elapsed: 510.351 s - in org.apache.phoenix.end2end.ViewIT
[INFO] Tests run: 22, Failures: 0, Errors: 0, Skipped: 0, Time elapsed: 329.714 s - in org.apache.phoenix.end2end.ViewMetadataIT
[INFO] 
[INFO] Results:
[INFO] 
[ERROR] Errors: 
[ERROR]   ViewIndexIT.testMultiTenantViewGlobalIndex:344 » NullPointer
[INFO] 
[ERROR] Tests run: 218, Failures: 0, Errors: 1, Skipped: 2
[INFO] 
[INFO] 
[INFO] --- maven-failsafe-plugin:2.22.0:verify (ParallelStatsEnabledTest) @ phoenix-core ---
[INFO] ------------------------------------------------------------------------
[INFO] Reactor Summary for Apache Phoenix 4.16.0-SNAPSHOT:
[INFO] 
[INFO] Phoenix Hbase 1.5.0 compatibility .................. SUCCESS [ 16.038 s]
[INFO] Phoenix Hbase 1.4.0 compatibility .................. SUCCESS [  5.223 s]
[INFO] Phoenix Hbase 1.3.0 compatibility .................. SUCCESS [  4.891 s]
[INFO] Apache Phoenix ..................................... SUCCESS [  1.456 s]
[INFO] Phoenix Core ....................................... FAILURE [  03:04 h]
[INFO] Phoenix - Pherf .................................... SKIPPED
[INFO] Phoenix Client ..................................... SKIPPED
[INFO] Phoenix Server ..................................... SKIPPED
[INFO] Phoenix Assembly ................................... SKIPPED
[INFO] Phoenix - Tracing Web Application .................. SKIPPED
[INFO] ------------------------------------------------------------------------
[INFO] BUILD FAILURE
[INFO] ------------------------------------------------------------------------
[INFO] Total time:  03:05 h
[INFO] Finished at: 2020-03-26T08:23:35Z
[INFO] ------------------------------------------------------------------------
[ERROR] Failed to execute goal org.apache.maven.plugins:maven-failsafe-plugin:2.22.0:verify (ParallelStatsEnabledTest) on project phoenix-core: There are test failures.
[ERROR] 
[ERROR] Please refer to <https://builds.apache.org/job/Phoenix-4.x-matrix/HBASE_PROFILE=1.3/ws/phoenix-core/target/failsafe-reports> for the individual test results.
[ERROR] Please refer to dump files (if any exist) [date]-jvmRun[N].dump, [date].dumpstream and [date]-jvmRun[N].dumpstream.
[ERROR] -> [Help 1]
[ERROR] 
[ERROR] To see the full stack trace of the errors, re-run Maven with the -e switch.
[ERROR] Re-run Maven using the -X switch to enable full debug logging.
[ERROR] 
[ERROR] For more information about the errors and possible solutions, please read the following articles:
[ERROR] [Help 1] http://cwiki.apache.org/confluence/display/MAVEN/MojoFailureException
[ERROR] 
[ERROR] After correcting the problems, you can resume the build with the command
[ERROR]   mvn <args> -rf :phoenix-core
Build step 'Invoke top-level Maven targets' marked build as failure
Archiving artifacts
Recording test results
Not sending mail to unregistered user s.kadam@salesforce.com

Build failed in Jenkins: Phoenix | 4.x | HBase Profile » 1.3 #26

Posted by Apache Jenkins Server <je...@builds.apache.org>.
See <https://builds.apache.org/job/Phoenix-4.x-matrix/HBASE_PROFILE=1.3/26/display/redirect?page=changes>

Changes:

[chinmayskulkarni] PHOENIX-5776 Phoenix pherf unit tests failing


------------------------------------------
[...truncated 58.31 KB...]
[INFO] Running org.apache.phoenix.util.LogUtilTest
[INFO] Tests run: 3, Failures: 0, Errors: 0, Skipped: 0, Time elapsed: 0.112 s - in org.apache.phoenix.util.LogUtilTest
[INFO] Running org.apache.phoenix.util.QueryUtilTest
[INFO] Tests run: 11, Failures: 0, Errors: 0, Skipped: 0, Time elapsed: 0.039 s - in org.apache.phoenix.util.QueryUtilTest
[INFO] Running org.apache.phoenix.util.PrefixByteEncoderDecoderTest
[INFO] Tests run: 3, Failures: 0, Errors: 0, Skipped: 0, Time elapsed: 0.01 s - in org.apache.phoenix.util.PrefixByteEncoderDecoderTest
[INFO] Running org.apache.phoenix.util.PhoenixEncodeDecodeTest
[INFO] Tests run: 8, Failures: 0, Errors: 0, Skipped: 0, Time elapsed: 0.615 s - in org.apache.phoenix.util.EquiDepthStreamHistogramTest
[INFO] Running org.apache.phoenix.filter.SkipScanFilterIntersectTest
[INFO] Tests run: 11, Failures: 0, Errors: 0, Skipped: 0, Time elapsed: 2.489 s - in org.apache.phoenix.mapreduce.util.PhoenixConfigurationUtilTest
[INFO] Running org.apache.phoenix.filter.EncodedQualifiersColumnProjectionFilterTest
[INFO] Tests run: 8, Failures: 0, Errors: 0, Skipped: 0, Time elapsed: 1.508 s - in org.apache.phoenix.util.csv.CsvUpsertExecutorTest
[INFO] Tests run: 1, Failures: 0, Errors: 0, Skipped: 0, Time elapsed: 0.008 s - in org.apache.phoenix.filter.EncodedQualifiersColumnProjectionFilterTest
[INFO] Running org.apache.phoenix.filter.DistinctPrefixFilterTest
[INFO] Running org.apache.phoenix.filter.SkipScanBigFilterTest
[INFO] Tests run: 19, Failures: 0, Errors: 0, Skipped: 0, Time elapsed: 0.094 s - in org.apache.phoenix.filter.SkipScanFilterIntersectTest
[INFO] Running org.apache.phoenix.filter.SkipScanFilterTest
[INFO] Tests run: 8, Failures: 0, Errors: 0, Skipped: 0, Time elapsed: 0.101 s - in org.apache.phoenix.filter.DistinctPrefixFilterTest
[INFO] Running org.apache.phoenix.cache.JodaTimezoneCacheTest
[INFO] Tests run: 4, Failures: 0, Errors: 0, Skipped: 0, Time elapsed: 0.036 s - in org.apache.phoenix.cache.JodaTimezoneCacheTest
[INFO] Running org.apache.phoenix.cache.TenantCacheTest
[INFO] Tests run: 7, Failures: 0, Errors: 0, Skipped: 0, Time elapsed: 0.042 s - in org.apache.phoenix.cache.TenantCacheTest
[INFO] Running org.apache.phoenix.jdbc.PhoenixDriverTest
[INFO] Tests run: 20, Failures: 0, Errors: 0, Skipped: 0, Time elapsed: 0.181 s - in org.apache.phoenix.filter.SkipScanFilterTest
[INFO] Running org.apache.phoenix.jdbc.PhoenixPreparedStatementTest
[INFO] Tests run: 8, Failures: 0, Errors: 0, Skipped: 0, Time elapsed: 0.949 s - in org.apache.phoenix.util.json.JsonUpsertExecutorTest
[INFO] Running org.apache.phoenix.jdbc.PhoenixResultSetMetadataTest
[INFO] Tests run: 4, Failures: 0, Errors: 0, Skipped: 0, Time elapsed: 1.021 s - in org.apache.phoenix.util.PhoenixEncodeDecodeTest
[INFO] Running org.apache.phoenix.jdbc.PhoenixEmbeddedDriverTest
[INFO] Tests run: 8, Failures: 0, Errors: 0, Skipped: 0, Time elapsed: 0.612 s - in org.apache.phoenix.jdbc.PhoenixPreparedStatementTest
[INFO] Running org.apache.phoenix.jdbc.ReadOnlyPropertiesTest
[INFO] Tests run: 4, Failures: 0, Errors: 0, Skipped: 0, Time elapsed: 0.008 s - in org.apache.phoenix.jdbc.ReadOnlyPropertiesTest
[INFO] Running org.apache.phoenix.expression.GetSetByteBitFunctionTest
[INFO] Tests run: 4, Failures: 0, Errors: 0, Skipped: 0, Time elapsed: 0.393 s - in org.apache.phoenix.jdbc.PhoenixEmbeddedDriverTest
[INFO] Tests run: 1, Failures: 0, Errors: 0, Skipped: 0, Time elapsed: 0.713 s - in org.apache.phoenix.jdbc.PhoenixResultSetMetadataTest
[INFO] Running org.apache.phoenix.expression.ArrayToStringFunctionTest
[INFO] Running org.apache.phoenix.expression.SignFunctionTest
[INFO] Tests run: 1, Failures: 0, Errors: 0, Skipped: 0, Time elapsed: 0.032 s - in org.apache.phoenix.expression.SignFunctionTest
[INFO] Running org.apache.phoenix.expression.ArrayAppendFunctionTest
[INFO] Tests run: 24, Failures: 0, Errors: 0, Skipped: 0, Time elapsed: 0.103 s - in org.apache.phoenix.expression.ArrayToStringFunctionTest
[INFO] Running org.apache.phoenix.expression.DeterminismTest
[INFO] Tests run: 1, Failures: 0, Errors: 0, Skipped: 0, Time elapsed: 0.002 s - in org.apache.phoenix.expression.DeterminismTest
[INFO] Running org.apache.phoenix.expression.InListExpressionTest
[INFO] Tests run: 25, Failures: 0, Errors: 0, Skipped: 0, Time elapsed: 0.438 s - in org.apache.phoenix.expression.ArrayAppendFunctionTest
[INFO] Running org.apache.phoenix.expression.function.LowerFunctionTest
[INFO] Tests run: 12, Failures: 0, Errors: 0, Skipped: 0, Time elapsed: 2.868 s - in org.apache.phoenix.util.PhoenixRuntimeTest
[INFO] Running org.apache.phoenix.expression.function.CollationKeyFunctionTest
[INFO] Tests run: 3, Failures: 0, Errors: 0, Skipped: 0, Time elapsed: 0.033 s - in org.apache.phoenix.expression.function.LowerFunctionTest
[INFO] Running org.apache.phoenix.expression.function.BuiltinFunctionConstructorTest
[INFO] Tests run: 2, Failures: 0, Errors: 0, Skipped: 0, Time elapsed: 0.134 s - in org.apache.phoenix.expression.function.BuiltinFunctionConstructorTest
[INFO] Running org.apache.phoenix.expression.function.InstrFunctionTest
[INFO] Tests run: 1, Failures: 0, Errors: 0, Skipped: 0, Time elapsed: 0.009 s - in org.apache.phoenix.expression.function.InstrFunctionTest
[INFO] Running org.apache.phoenix.expression.function.ExternalSqlTypeIdFunctionTest
[INFO] Tests run: 3, Failures: 0, Errors: 0, Skipped: 0, Time elapsed: 0 s - in org.apache.phoenix.expression.function.ExternalSqlTypeIdFunctionTest
[INFO] Running org.apache.phoenix.expression.function.UpperFunctionTest
[INFO] Tests run: 3, Failures: 0, Errors: 0, Skipped: 0, Time elapsed: 0.001 s - in org.apache.phoenix.expression.function.UpperFunctionTest
[INFO] Running org.apache.phoenix.expression.ArrayFillFunctionTest
[INFO] Tests run: 14, Failures: 0, Errors: 0, Skipped: 0, Time elapsed: 0.032 s - in org.apache.phoenix.expression.ArrayFillFunctionTest
[INFO] Running org.apache.phoenix.expression.StringToArrayFunctionTest
[INFO] Tests run: 20, Failures: 0, Errors: 0, Skipped: 0, Time elapsed: 0.062 s - in org.apache.phoenix.expression.StringToArrayFunctionTest
[INFO] Running org.apache.phoenix.expression.ArrayConcatFunctionTest
[INFO] Tests run: 2, Failures: 0, Errors: 0, Skipped: 0, Time elapsed: 2.113 s - in org.apache.phoenix.filter.SkipScanBigFilterTest
[INFO] Running org.apache.phoenix.expression.ArrayPrependFunctionTest
[WARNING] Tests run: 7, Failures: 0, Errors: 0, Skipped: 1, Time elapsed: 2.178 s - in org.apache.phoenix.jdbc.PhoenixDriverTest
[INFO] Running org.apache.phoenix.expression.OrExpressionTest
[INFO] Tests run: 7, Failures: 0, Errors: 0, Skipped: 0, Time elapsed: 0.025 s - in org.apache.phoenix.expression.OrExpressionTest
[INFO] Running org.apache.phoenix.expression.NullValueTest
[INFO] Tests run: 2, Failures: 0, Errors: 0, Skipped: 0, Time elapsed: 1.551 s - in org.apache.phoenix.expression.GetSetByteBitFunctionTest
[INFO] Running org.apache.phoenix.expression.AndExpressionTest
[INFO] Tests run: 7, Failures: 0, Errors: 0, Skipped: 0, Time elapsed: 0.017 s - in org.apache.phoenix.expression.AndExpressionTest
[INFO] Running org.apache.phoenix.expression.util.regex.PatternPerformanceTest
[INFO] Tests run: 1, Failures: 0, Errors: 0, Skipped: 0, Time elapsed: 0.002 s - in org.apache.phoenix.expression.util.regex.PatternPerformanceTest
[INFO] Running org.apache.phoenix.expression.AbsFunctionTest
[INFO] Tests run: 1, Failures: 0, Errors: 0, Skipped: 0, Time elapsed: 0.034 s - in org.apache.phoenix.expression.AbsFunctionTest
[INFO] Running org.apache.phoenix.expression.OctetLengthFunctionTest
[INFO] Tests run: 1, Failures: 0, Errors: 0, Skipped: 0, Time elapsed: 0.031 s - in org.apache.phoenix.expression.OctetLengthFunctionTest
[INFO] Running org.apache.phoenix.expression.ColumnExpressionTest
[INFO] Tests run: 4, Failures: 0, Errors: 0, Skipped: 0, Time elapsed: 0.001 s - in org.apache.phoenix.expression.ColumnExpressionTest
[INFO] Running org.apache.phoenix.expression.CoerceExpressionTest
[INFO] Tests run: 5, Failures: 0, Errors: 0, Skipped: 0, Time elapsed: 0.013 s - in org.apache.phoenix.expression.CoerceExpressionTest
[INFO] Running org.apache.phoenix.expression.ArrayRemoveFunctionTest
[INFO] Tests run: 15, Failures: 0, Errors: 0, Skipped: 0, Time elapsed: 0.029 s - in org.apache.phoenix.expression.ArrayRemoveFunctionTest
[INFO] Running org.apache.phoenix.expression.ILikeExpressionTest
[INFO] Tests run: 37, Failures: 0, Errors: 0, Skipped: 0, Time elapsed: 0.558 s - in org.apache.phoenix.expression.ArrayPrependFunctionTest
[INFO] Running org.apache.phoenix.expression.LikeExpressionTest
[INFO] Tests run: 3, Failures: 0, Errors: 0, Skipped: 0, Time elapsed: 0.543 s - in org.apache.phoenix.expression.NullValueTest
[INFO] Running org.apache.phoenix.expression.RoundFloorCeilExpressionsTest
[INFO] Tests run: 3, Failures: 0, Errors: 0, Skipped: 0, Time elapsed: 0.406 s - in org.apache.phoenix.expression.ILikeExpressionTest
[INFO] Running org.apache.phoenix.expression.RegexpReplaceFunctionTest
[INFO] Tests run: 1, Failures: 0, Errors: 0, Skipped: 0, Time elapsed: 0.023 s - in org.apache.phoenix.expression.RegexpReplaceFunctionTest
[INFO] Running org.apache.phoenix.expression.SortOrderExpressionTest
[INFO] Tests run: 24, Failures: 0, Errors: 0, Skipped: 0, Time elapsed: 0.119 s - in org.apache.phoenix.expression.SortOrderExpressionTest
[INFO] Running org.apache.phoenix.expression.ExpFunctionTest
[INFO] Tests run: 6, Failures: 0, Errors: 0, Skipped: 0, Time elapsed: 0.514 s - in org.apache.phoenix.expression.LikeExpressionTest
[INFO] Running org.apache.phoenix.expression.SqrtFunctionTest
[INFO] Tests run: 1, Failures: 0, Errors: 0, Skipped: 0, Time elapsed: 0.03 s - in org.apache.phoenix.expression.ExpFunctionTest
[INFO] Running org.apache.phoenix.expression.LnLogFunctionTest
[INFO] Tests run: 1, Failures: 0, Errors: 0, Skipped: 0, Time elapsed: 0.064 s - in org.apache.phoenix.expression.SqrtFunctionTest
[INFO] Tests run: 1, Failures: 0, Errors: 0, Skipped: 0, Time elapsed: 0.034 s - in org.apache.phoenix.expression.LnLogFunctionTest
[INFO] Running org.apache.phoenix.expression.RegexpSubstrFunctionTest
[INFO] Running org.apache.phoenix.expression.ArrayConstructorExpressionTest
[INFO] Tests run: 1, Failures: 0, Errors: 0, Skipped: 0, Time elapsed: 0.029 s - in org.apache.phoenix.expression.ArrayConstructorExpressionTest
[INFO] Running org.apache.phoenix.expression.PowerFunctionTest
[INFO] Tests run: 1, Failures: 0, Errors: 0, Skipped: 0, Time elapsed: 0.042 s - in org.apache.phoenix.expression.RegexpSubstrFunctionTest
[INFO] Running org.apache.phoenix.expression.RegexpSplitFunctionTest
[INFO] Tests run: 1, Failures: 0, Errors: 0, Skipped: 0, Time elapsed: 0.085 s - in org.apache.phoenix.expression.PowerFunctionTest
[INFO] Running org.apache.phoenix.expression.MathPIFunctionTest
[INFO] Tests run: 1, Failures: 0, Errors: 0, Skipped: 0, Time elapsed: 0.002 s - in org.apache.phoenix.expression.MathPIFunctionTest
[INFO] Tests run: 35, Failures: 0, Errors: 0, Skipped: 0, Time elapsed: 1.403 s - in org.apache.phoenix.expression.ArrayConcatFunctionTest
[INFO] Running org.apache.phoenix.expression.rewrite.RowValueConstructorExpressionRewriterTest
[INFO] Running org.apache.phoenix.expression.MathTrigFunctionTest
[INFO] Tests run: 1, Failures: 0, Errors: 0, Skipped: 0, Time elapsed: 0.108 s - in org.apache.phoenix.expression.rewrite.RowValueConstructorExpressionRewriterTest
[INFO] Running org.apache.phoenix.expression.ArithmeticOperationTest
[INFO] Tests run: 13, Failures: 0, Errors: 0, Skipped: 0, Time elapsed: 0.104 s - in org.apache.phoenix.expression.MathTrigFunctionTest
[INFO] Running org.apache.phoenix.expression.CbrtFunctionTest
[INFO] Tests run: 1, Failures: 0, Errors: 0, Skipped: 0, Time elapsed: 0.02 s - in org.apache.phoenix.expression.CbrtFunctionTest
[INFO] Running org.apache.phoenix.iterate.SpoolingResultIteratorTest
[INFO] Tests run: 6, Failures: 0, Errors: 0, Skipped: 0, Time elapsed: 0.047 s - in org.apache.phoenix.expression.ArithmeticOperationTest
[INFO] Running org.apache.phoenix.iterate.AggregateResultScannerTest
[INFO] Tests run: 1, Failures: 0, Errors: 0, Skipped: 0, Time elapsed: 0.341 s - in org.apache.phoenix.expression.RegexpSplitFunctionTest
[INFO] Running org.apache.phoenix.iterate.RowKeyOrderedAggregateResultIteratorTest
[INFO] Tests run: 3, Failures: 0, Errors: 0, Skipped: 0, Time elapsed: 0.062 s - in org.apache.phoenix.iterate.SpoolingResultIteratorTest
[INFO] Running org.apache.phoenix.iterate.OrderedResultIteratorTest
[INFO] Tests run: 2, Failures: 0, Errors: 0, Skipped: 0, Time elapsed: 0.06 s - in org.apache.phoenix.iterate.OrderedResultIteratorTest
[INFO] Running org.apache.phoenix.iterate.MergeSortResultIteratorTest
[INFO] Tests run: 2, Failures: 0, Errors: 0, Skipped: 0, Time elapsed: 0.005 s - in org.apache.phoenix.iterate.MergeSortResultIteratorTest
[INFO] Running org.apache.phoenix.iterate.ConcatResultIteratorTest
[INFO] Tests run: 2, Failures: 0, Errors: 0, Skipped: 0, Time elapsed: 0.012 s - in org.apache.phoenix.iterate.ConcatResultIteratorTest
[INFO] Running org.apache.phoenix.memory.MemoryManagerTest
[INFO] Tests run: 4, Failures: 0, Errors: 0, Skipped: 0, Time elapsed: 0.473 s - in org.apache.phoenix.iterate.RowKeyOrderedAggregateResultIteratorTest
[INFO] Running org.apache.phoenix.monitoring.MetricUtilTest
[INFO] Tests run: 2, Failures: 0, Errors: 0, Skipped: 0, Time elapsed: 0.034 s - in org.apache.phoenix.monitoring.MetricUtilTest
[INFO] Running org.apache.phoenix.execute.MutationStateTest
[INFO] Tests run: 23, Failures: 0, Errors: 0, Skipped: 0, Time elapsed: 1.483 s - in org.apache.phoenix.expression.RoundFloorCeilExpressionsTest
[INFO] Running org.apache.phoenix.execute.CorrelatePlanTest
[INFO] Tests run: 1, Failures: 0, Errors: 0, Skipped: 0, Time elapsed: 0.799 s - in org.apache.phoenix.iterate.AggregateResultScannerTest
[INFO] Running org.apache.phoenix.execute.LiteralResultIteratorPlanTest
[INFO] Tests run: 4, Failures: 0, Errors: 0, Skipped: 0, Time elapsed: 0.484 s - in org.apache.phoenix.execute.MutationStateTest
[INFO] Running org.apache.phoenix.execute.DescVarLengthFastByteComparisonsTest
[INFO] Tests run: 2, Failures: 0, Errors: 0, Skipped: 0, Time elapsed: 0.017 s - in org.apache.phoenix.execute.DescVarLengthFastByteComparisonsTest
[INFO] Running org.apache.phoenix.execute.UnnestArrayPlanTest
[INFO] Tests run: 3, Failures: 0, Errors: 0, Skipped: 0, Time elapsed: 0.26 s - in org.apache.phoenix.execute.LiteralResultIteratorPlanTest
[INFO] Running org.apache.phoenix.trace.TraceSpanReceiverTest
[INFO] Tests run: 6, Failures: 0, Errors: 0, Skipped: 0, Time elapsed: 0.03 s - in org.apache.phoenix.execute.UnnestArrayPlanTest
[INFO] Running org.apache.phoenix.hbase.index.write.TestParalleWriterIndexCommitter
[INFO] Tests run: 6, Failures: 0, Errors: 0, Skipped: 0, Time elapsed: 0.401 s - in org.apache.phoenix.execute.CorrelatePlanTest
[INFO] Running org.apache.phoenix.hbase.index.write.TestWALRecoveryCaching
[WARNING] Tests run: 1, Failures: 0, Errors: 0, Skipped: 1, Time elapsed: 0.001 s - in org.apache.phoenix.hbase.index.write.TestWALRecoveryCaching
[INFO] Running org.apache.phoenix.hbase.index.write.TestParalleIndexWriter
[INFO] Tests run: 11, Failures: 0, Errors: 0, Skipped: 0, Time elapsed: 3.187 s - in org.apache.phoenix.expression.function.CollationKeyFunctionTest
[INFO] Running org.apache.phoenix.hbase.index.write.TestIndexWriter
[INFO] Tests run: 2, Failures: 0, Errors: 0, Skipped: 0, Time elapsed: 0.255 s - in org.apache.phoenix.hbase.index.write.TestParalleWriterIndexCommitter
[INFO] Running org.apache.phoenix.hbase.index.write.recovery.TestPerRegionIndexWriteCache
[INFO] Tests run: 2, Failures: 0, Errors: 0, Skipped: 0, Time elapsed: 0.329 s - in org.apache.phoenix.hbase.index.write.TestParalleIndexWriter
[INFO] Running org.apache.phoenix.hbase.index.util.TestIndexManagementUtil
[INFO] Tests run: 3, Failures: 0, Errors: 0, Skipped: 0, Time elapsed: 0.022 s - in org.apache.phoenix.hbase.index.util.TestIndexManagementUtil
[INFO] Running org.apache.phoenix.hbase.index.parallel.TestThreadPoolManager
[INFO] Tests run: 5, Failures: 0, Errors: 0, Skipped: 0, Time elapsed: 1.401 s - in org.apache.phoenix.memory.MemoryManagerTest
[INFO] Running org.apache.phoenix.hbase.index.parallel.TestThreadPoolBuilder
[INFO] Tests run: 2, Failures: 0, Errors: 0, Skipped: 0, Time elapsed: 0.013 s - in org.apache.phoenix.hbase.index.parallel.TestThreadPoolBuilder
[INFO] Tests run: 3, Failures: 0, Errors: 0, Skipped: 0, Time elapsed: 0.02 s - in org.apache.phoenix.hbase.index.parallel.TestThreadPoolManager
[INFO] Running org.apache.phoenix.hbase.index.covered.LocalTableStateTest
[INFO] Running org.apache.phoenix.hbase.index.covered.TestCoveredColumnIndexCodec
[INFO] Tests run: 2, Failures: 0, Errors: 0, Skipped: 0, Time elapsed: 0.529 s - in org.apache.phoenix.trace.TraceSpanReceiverTest
[INFO] Running org.apache.phoenix.hbase.index.covered.NonTxIndexBuilderTest
[INFO] Tests run: 3, Failures: 0, Errors: 0, Skipped: 0, Time elapsed: 0.057 s - in org.apache.phoenix.hbase.index.covered.TestCoveredColumnIndexCodec
[INFO] Running org.apache.phoenix.hbase.index.covered.data.TestIndexMemStore
[INFO] Tests run: 2, Failures: 0, Errors: 0, Skipped: 0, Time elapsed: 0.007 s - in org.apache.phoenix.hbase.index.covered.data.TestIndexMemStore
[INFO] Running org.apache.phoenix.hbase.index.covered.filter.TestApplyAndFilterDeletesFilter
[INFO] Tests run: 6, Failures: 0, Errors: 0, Skipped: 0, Time elapsed: 0.006 s - in org.apache.phoenix.hbase.index.covered.filter.TestApplyAndFilterDeletesFilter
[INFO] Running org.apache.phoenix.hbase.index.covered.filter.TestNewerTimestampFilter
[INFO] Tests run: 1, Failures: 0, Errors: 0, Skipped: 0, Time elapsed: 0 s - in org.apache.phoenix.hbase.index.covered.filter.TestNewerTimestampFilter
[INFO] Running org.apache.phoenix.hbase.index.covered.update.TestIndexUpdateManager
[INFO] Tests run: 4, Failures: 0, Errors: 0, Skipped: 0, Time elapsed: 0.163 s - in org.apache.phoenix.hbase.index.covered.LocalTableStateTest
[INFO] Tests run: 2, Failures: 0, Errors: 0, Skipped: 0, Time elapsed: 0.024 s - in org.apache.phoenix.hbase.index.covered.update.TestIndexUpdateManager
[INFO] Running org.apache.phoenix.hbase.index.covered.TestColumnTracker
[INFO] Tests run: 3, Failures: 0, Errors: 0, Skipped: 0, Time elapsed: 0 s - in org.apache.phoenix.hbase.index.covered.TestColumnTracker
[INFO] Running org.apache.phoenix.hbase.index.covered.CoveredColumnsTest
[INFO] Running org.apache.phoenix.hbase.index.covered.TestCoveredIndexSpecifierBuilder
[INFO] Tests run: 1, Failures: 0, Errors: 0, Skipped: 0, Time elapsed: 0.003 s - in org.apache.phoenix.hbase.index.covered.TestCoveredIndexSpecifierBuilder
[INFO] Running org.apache.phoenix.metrics.MetricTypeTest
[INFO] Tests run: 1, Failures: 0, Errors: 0, Skipped: 0, Time elapsed: 0.001 s - in org.apache.phoenix.metrics.MetricTypeTest
[INFO] Tests run: 1, Failures: 0, Errors: 0, Skipped: 0, Time elapsed: 0.002 s - in org.apache.phoenix.hbase.index.covered.CoveredColumnsTest
[INFO] Running org.apache.phoenix.tool.PhoenixCanaryToolTest
[INFO] Running org.apache.hadoop.hbase.ipc.PhoenixIndexRpcSchedulerTest
[INFO] Tests run: 4, Failures: 0, Errors: 0, Skipped: 0, Time elapsed: 0.641 s - in org.apache.phoenix.hbase.index.write.TestIndexWriter
[INFO] Running org.apache.hadoop.hbase.regionserver.PhoenixRpcSchedulerFactoryTest
[INFO] Tests run: 2, Failures: 0, Errors: 0, Skipped: 0, Time elapsed: 0.034 s - in org.apache.hadoop.hbase.regionserver.PhoenixRpcSchedulerFactoryTest
[INFO] Running org.apache.hadoop.hbase.regionserver.wal.IndexedWALEditCodecTest
[INFO] Tests run: 1, Failures: 0, Errors: 0, Skipped: 0, Time elapsed: 0.008 s - in org.apache.hadoop.hbase.regionserver.wal.IndexedWALEditCodecTest
[INFO] Running org.apache.hadoop.hbase.regionserver.wal.ReadWriteKeyValuesWithCodecTest
[INFO] Tests run: 49, Failures: 0, Errors: 0, Skipped: 0, Time elapsed: 9.791 s - in org.apache.phoenix.compile.QueryOptimizerTest
[INFO] Running org.apache.hadoop.hbase.regionserver.wal.IndexedKeyValueTest
[INFO] Tests run: 3, Failures: 0, Errors: 0, Skipped: 0, Time elapsed: 0.287 s - in org.apache.phoenix.tool.PhoenixCanaryToolTest
[INFO] Tests run: 7, Failures: 0, Errors: 0, Skipped: 0, Time elapsed: 4.593 s - in org.apache.phoenix.expression.InListExpressionTest
[INFO] Tests run: 2, Failures: 0, Errors: 0, Skipped: 0, Time elapsed: 0.526 s - in org.apache.hadoop.hbase.regionserver.wal.IndexedKeyValueTest
[INFO] Tests run: 2, Failures: 0, Errors: 0, Skipped: 0, Time elapsed: 0.801 s - in org.apache.hadoop.hbase.regionserver.wal.ReadWriteKeyValuesWithCodecTest
[INFO] Tests run: 3, Failures: 0, Errors: 0, Skipped: 0, Time elapsed: 1.48 s - in org.apache.phoenix.hbase.index.write.recovery.TestPerRegionIndexWriteCache
[INFO] Tests run: 2, Failures: 0, Errors: 0, Skipped: 0, Time elapsed: 1.051 s - in org.apache.hadoop.hbase.ipc.PhoenixIndexRpcSchedulerTest
[INFO] Tests run: 3, Failures: 0, Errors: 0, Skipped: 0, Time elapsed: 1.683 s - in org.apache.phoenix.hbase.index.covered.NonTxIndexBuilderTest
[WARNING] Tests run: 200, Failures: 0, Errors: 0, Skipped: 2, Time elapsed: 16.208 s - in org.apache.phoenix.compile.QueryCompilerTest
[INFO] 
[INFO] Results:
[INFO] 
[ERROR] Failures: 
[ERROR]   IndexScrutinyTableOutputTest.testGetOutputTableUpsert:83 expected:<... "HAS_TARGET_ROW", "[ID" INTEGER, "PK_PART2" TINYINT, "NAME" VARCHAR, "ZIP" BIGINT, ":ID" INTEGER, ":PK_PART2" TINYINT, "0:NAME" VARCHAR, "0:ZIP" BIGINT) VALUES (]?, ?, ?, ?, ?, ?, ?,...> but was:<... "HAS_TARGET_ROW", "[BEYOND_MAX_LOOKBACK", "ID" INTEGER, "PK_PART2" TINYINT, "NAME" VARCHAR, "ZIP" BIGINT, ":ID" INTEGER, ":PK_PART2" TINYINT, "0:NAME" VARCHAR, "0:ZIP" BIGINT) VALUES (?, ]?, ?, ?, ?, ?, ?, ?,...>
[ERROR]   IndexScrutinyTableOutputTest.testGetSqlQueryAllInvalidRows:50 expected:<..."HAS_TARGET_ROW" , "[]ID" , "PK_PART2" , "...> but was:<..."HAS_TARGET_ROW" , "[BEYOND_MAX_LOOKBACK" , "]ID" , "PK_PART2" , "...>
[ERROR]   IndexScrutinyTableOutputTest.testGetSqlQueryBadCoveredColVal:72 expected:<..."HAS_TARGET_ROW" , "[]ID" , "PK_PART2" , "...> but was:<..."HAS_TARGET_ROW" , "[BEYOND_MAX_LOOKBACK" , "]ID" , "PK_PART2" , "...>
[ERROR]   IndexScrutinyTableOutputTest.testGetSqlQueryMissingTargetRows:61 expected:<..."HAS_TARGET_ROW" , "[]ID" , "PK_PART2" , "...> but was:<..."HAS_TARGET_ROW" , "[BEYOND_MAX_LOOKBACK" , "]ID" , "PK_PART2" , "...>
[INFO] 
[ERROR] Tests run: 1789, Failures: 4, Errors: 0, Skipped: 5
[INFO] 
[INFO] ------------------------------------------------------------------------
[INFO] Reactor Summary for Apache Phoenix 4.16.0-SNAPSHOT:
[INFO] 
[INFO] Phoenix Hbase 1.5.0 compatibility .................. SUCCESS [ 11.060 s]
[INFO] Phoenix Hbase 1.4.0 compatibility .................. SUCCESS [  2.665 s]
[INFO] Phoenix Hbase 1.3.0 compatibility .................. SUCCESS [  3.539 s]
[INFO] Apache Phoenix ..................................... SUCCESS [  4.444 s]
[INFO] Phoenix Core ....................................... FAILURE [01:57 min]
[INFO] Phoenix - Pherf .................................... SKIPPED
[INFO] Phoenix Client ..................................... SKIPPED
[INFO] Phoenix Server ..................................... SKIPPED
[INFO] Phoenix Assembly ................................... SKIPPED
[INFO] Phoenix - Tracing Web Application .................. SKIPPED
[INFO] ------------------------------------------------------------------------
[INFO] BUILD FAILURE
[INFO] ------------------------------------------------------------------------
[INFO] Total time:  02:19 min
[INFO] Finished at: 2020-03-27T00:20:25Z
[INFO] ------------------------------------------------------------------------
[ERROR] Failed to execute goal org.apache.maven.plugins:maven-surefire-plugin:2.22.0:test (default-test) on project phoenix-core: There are test failures.
[ERROR] 
[ERROR] Please refer to <https://builds.apache.org/job/Phoenix-4.x-matrix/HBASE_PROFILE=1.3/ws/phoenix-core/target/surefire-reports> for the individual test results.
[ERROR] Please refer to dump files (if any exist) [date]-jvmRun[N].dump, [date].dumpstream and [date]-jvmRun[N].dumpstream.
[ERROR] -> [Help 1]
[ERROR] 
[ERROR] To see the full stack trace of the errors, re-run Maven with the -e switch.
[ERROR] Re-run Maven using the -X switch to enable full debug logging.
[ERROR] 
[ERROR] For more information about the errors and possible solutions, please read the following articles:
[ERROR] [Help 1] http://cwiki.apache.org/confluence/display/MAVEN/MojoFailureException
[ERROR] 
[ERROR] After correcting the problems, you can resume the build with the command
[ERROR]   mvn <args> -rf :phoenix-core
Build step 'Invoke top-level Maven targets' marked build as failure
Archiving artifacts
Recording test results
Not sending mail to unregistered user s.kadam@salesforce.com

Build failed in Jenkins: Phoenix | 4.x | HBase Profile » 1.3 #25

Posted by Apache Jenkins Server <je...@builds.apache.org>.
See <https://builds.apache.org/job/Phoenix-4.x-matrix/HBASE_PROFILE=1.3/25/display/redirect?page=changes>

Changes:

[gjacoby] PHOENIX-5734 - IndexScrutinyTool should not report rows beyond


------------------------------------------
[...truncated 58.78 KB...]
[INFO] Running org.apache.phoenix.expression.GetSetByteBitFunctionTest
[INFO] Tests run: 3, Failures: 0, Errors: 0, Skipped: 0, Time elapsed: 0.506 s - in org.apache.phoenix.expression.NullValueTest
[INFO] Running org.apache.phoenix.tool.PhoenixCanaryToolTest
[INFO] Tests run: 35, Failures: 0, Errors: 0, Skipped: 0, Time elapsed: 1.017 s - in org.apache.phoenix.expression.ArrayConcatFunctionTest
[INFO] Tests run: 3, Failures: 0, Errors: 0, Skipped: 0, Time elapsed: 2.212 s - in org.apache.phoenix.hbase.index.write.recovery.TestPerRegionIndexWriteCache
[INFO] Running org.apache.phoenix.compile.RVCOffsetCompilerTest
[INFO] Running org.apache.phoenix.compile.HavingCompilerTest
[INFO] Tests run: 3, Failures: 0, Errors: 0, Skipped: 0, Time elapsed: 2.363 s - in org.apache.phoenix.hbase.index.covered.NonTxIndexBuilderTest
[INFO] Running org.apache.phoenix.compile.ScanRangesTest
[INFO] Tests run: 23, Failures: 0, Errors: 0, Skipped: 0, Time elapsed: 1.436 s - in org.apache.phoenix.expression.RoundFloorCeilExpressionsTest
[INFO] Tests run: 4, Failures: 0, Errors: 0, Skipped: 0, Time elapsed: 0.38 s - in org.apache.phoenix.compile.RVCOffsetCompilerTest
[INFO] Running org.apache.phoenix.compile.SelectStatementRewriterTest
[INFO] Running org.apache.phoenix.compile.SaltedScanRangesTest
[INFO] Tests run: 9, Failures: 0, Errors: 0, Skipped: 0, Time elapsed: 0.068 s - in org.apache.phoenix.compile.SaltedScanRangesTest
[INFO] Running org.apache.phoenix.compile.QueryOptimizerTest
[INFO] Tests run: 34, Failures: 0, Errors: 0, Skipped: 0, Time elapsed: 0.16 s - in org.apache.phoenix.compile.ScanRangesTest
[INFO] Running org.apache.phoenix.compile.CursorCompilerTest
[INFO] Tests run: 3, Failures: 0, Errors: 0, Skipped: 0, Time elapsed: 0.891 s - in org.apache.phoenix.tool.PhoenixCanaryToolTest
[INFO] Running org.apache.phoenix.compile.WhereOptimizerTest
[INFO] Tests run: 5, Failures: 0, Errors: 0, Skipped: 0, Time elapsed: 0.74 s - in org.apache.phoenix.compile.SelectStatementRewriterTest
[INFO] Running org.apache.phoenix.compile.PostIndexDDLCompilerTest
[INFO] Tests run: 2, Failures: 0, Errors: 0, Skipped: 0, Time elapsed: 1.315 s - in org.apache.phoenix.expression.GetSetByteBitFunctionTest
[INFO] Running org.apache.phoenix.compile.LimitCompilerTest
[INFO] Tests run: 11, Failures: 0, Errors: 0, Skipped: 0, Time elapsed: 1.3 s - in org.apache.phoenix.compile.HavingCompilerTest
[INFO] Running org.apache.phoenix.compile.QueryMetaDataTest
[INFO] Tests run: 2, Failures: 0, Errors: 0, Skipped: 0, Time elapsed: 0.904 s - in org.apache.phoenix.compile.PostIndexDDLCompilerTest
[INFO] Running org.apache.phoenix.compile.ViewCompilerTest
[INFO] Tests run: 1, Failures: 0, Errors: 0, Skipped: 0, Time elapsed: 1.806 s - in org.apache.phoenix.compile.CursorCompilerTest
[INFO] Running org.apache.phoenix.compile.JoinQueryCompilerTest
[INFO] Tests run: 7, Failures: 0, Errors: 0, Skipped: 0, Time elapsed: 3.259 s - in org.apache.phoenix.expression.InListExpressionTest
[INFO] Tests run: 32, Failures: 0, Errors: 0, Skipped: 0, Time elapsed: 1.405 s - in org.apache.phoenix.compile.QueryMetaDataTest
[INFO] Running org.apache.phoenix.compile.WhereCompilerTest
[INFO] Running org.apache.phoenix.compile.StatementHintsCompilationTest
[INFO] Tests run: 6, Failures: 0, Errors: 0, Skipped: 0, Time elapsed: 1.515 s - in org.apache.phoenix.compile.LimitCompilerTest
[INFO] Running org.apache.phoenix.compile.TenantSpecificViewIndexCompileTest
[INFO] Tests run: 11, Failures: 0, Errors: 0, Skipped: 0, Time elapsed: 4.242 s - in org.apache.phoenix.expression.function.CollationKeyFunctionTest
[INFO] Running org.apache.phoenix.compile.ScanRangesIntersectTest
[INFO] Tests run: 1, Failures: 0, Errors: 0, Skipped: 0, Time elapsed: 0.032 s - in org.apache.phoenix.compile.ScanRangesIntersectTest
[INFO] Running org.apache.phoenix.compile.CreateTableCompilerTest
[INFO] Tests run: 1, Failures: 0, Errors: 0, Skipped: 0, Time elapsed: 1.394 s - in org.apache.phoenix.compile.CreateTableCompilerTest
[INFO] Tests run: 4, Failures: 0, Errors: 0, Skipped: 0, Time elapsed: 1.786 s - in org.apache.phoenix.compile.StatementHintsCompilationTest
[INFO] Tests run: 2, Failures: 0, Errors: 0, Skipped: 0, Time elapsed: 2.168 s - in org.apache.phoenix.compile.JoinQueryCompilerTest
[INFO] Running org.apache.phoenix.compile.QueryCompilerTest
[INFO] Running org.apache.phoenix.iterate.AggregateResultScannerTest
[INFO] Running org.apache.phoenix.iterate.SpoolingResultIteratorTest
[INFO] Tests run: 3, Failures: 0, Errors: 0, Skipped: 0, Time elapsed: 2.455 s - in org.apache.phoenix.compile.ViewCompilerTest
[INFO] Running org.apache.phoenix.iterate.MergeSortResultIteratorTest
[INFO] Tests run: 3, Failures: 0, Errors: 0, Skipped: 0, Time elapsed: 0.044 s - in org.apache.phoenix.iterate.SpoolingResultIteratorTest
[INFO] Tests run: 2, Failures: 0, Errors: 0, Skipped: 0, Time elapsed: 0.026 s - in org.apache.phoenix.iterate.MergeSortResultIteratorTest
[INFO] Running org.apache.phoenix.iterate.ConcatResultIteratorTest
[INFO] Running org.apache.phoenix.iterate.OrderedResultIteratorTest
[INFO] Tests run: 2, Failures: 0, Errors: 0, Skipped: 0, Time elapsed: 0.001 s - in org.apache.phoenix.iterate.ConcatResultIteratorTest
[INFO] Running org.apache.phoenix.iterate.RowKeyOrderedAggregateResultIteratorTest
[INFO] Tests run: 2, Failures: 0, Errors: 0, Skipped: 0, Time elapsed: 0.025 s - in org.apache.phoenix.iterate.OrderedResultIteratorTest
[INFO] Running org.apache.phoenix.schema.stats.StatisticsScannerTest
[INFO] Tests run: 4, Failures: 0, Errors: 0, Skipped: 0, Time elapsed: 0.509 s - in org.apache.phoenix.schema.stats.StatisticsScannerTest
[INFO] Running org.apache.phoenix.schema.stats.UpdateStatisticsToolTest
[INFO] Tests run: 4, Failures: 0, Errors: 0, Skipped: 0, Time elapsed: 0.64 s - in org.apache.phoenix.iterate.RowKeyOrderedAggregateResultIteratorTest
[INFO] Running org.apache.phoenix.schema.SaltingUtilTest
[INFO] Tests run: 1, Failures: 0, Errors: 0, Skipped: 0, Time elapsed: 0.79 s - in org.apache.phoenix.iterate.AggregateResultScannerTest
[INFO] Running org.apache.phoenix.schema.SystemSplitPolicyTest
[INFO] Tests run: 2, Failures: 0, Errors: 0, Skipped: 0, Time elapsed: 0.001 s - in org.apache.phoenix.schema.SaltingUtilTest
[INFO] Tests run: 2, Failures: 0, Errors: 0, Skipped: 0, Time elapsed: 0.004 s - in org.apache.phoenix.schema.SystemSplitPolicyTest
[INFO] Running org.apache.phoenix.schema.PCharPadTest
[INFO] Running org.apache.phoenix.schema.SequenceAllocationTest
[INFO] Tests run: 9, Failures: 0, Errors: 0, Skipped: 0, Time elapsed: 0.02 s - in org.apache.phoenix.schema.PCharPadTest
[INFO] Tests run: 2, Failures: 0, Errors: 0, Skipped: 0, Time elapsed: 0 s - in org.apache.phoenix.schema.SequenceAllocationTest
[INFO] Running org.apache.phoenix.schema.RowKeyValueAccessorTest
[INFO] Running org.apache.phoenix.schema.SortOrderTest
[WARNING] Tests run: 45, Failures: 0, Errors: 0, Skipped: 1, Time elapsed: 2.712 s - in org.apache.phoenix.compile.WhereCompilerTest
[INFO] Running org.apache.phoenix.schema.ValueBitSetTest
[INFO] Tests run: 4, Failures: 0, Errors: 0, Skipped: 0, Time elapsed: 0.013 s - in org.apache.phoenix.schema.ValueBitSetTest
[INFO] Running org.apache.phoenix.schema.SchemaUtilTest
[INFO] Tests run: 8, Failures: 0, Errors: 0, Skipped: 0, Time elapsed: 0 s - in org.apache.phoenix.schema.SortOrderTest
[INFO] Tests run: 6, Failures: 0, Errors: 0, Skipped: 0, Time elapsed: 0.017 s - in org.apache.phoenix.schema.SchemaUtilTest
[INFO] Running org.apache.phoenix.schema.RowKeySchemaTest
[INFO] Running org.apache.phoenix.schema.MutationTest
[INFO] Tests run: 9, Failures: 0, Errors: 0, Skipped: 0, Time elapsed: 0.423 s - in org.apache.phoenix.schema.stats.UpdateStatisticsToolTest
[INFO] Running org.apache.phoenix.schema.types.PrimitiveLongPhoenixArrayToStringTest
[INFO] Tests run: 121, Failures: 0, Errors: 0, Skipped: 0, Time elapsed: 4.833 s - in org.apache.phoenix.compile.WhereOptimizerTest
[INFO] Running org.apache.phoenix.schema.types.PDataTypeTest
[INFO] Tests run: 6, Failures: 0, Errors: 0, Skipped: 0, Time elapsed: 2.943 s - in org.apache.phoenix.compile.TenantSpecificViewIndexCompileTest
[INFO] Running org.apache.phoenix.schema.types.PrimitiveBytePhoenixArrayToStringTest
[INFO] Tests run: 6, Failures: 0, Errors: 0, Skipped: 0, Time elapsed: 0.03 s - in org.apache.phoenix.schema.types.PrimitiveLongPhoenixArrayToStringTest
[INFO] Running org.apache.phoenix.schema.types.PVarcharArrayToStringTest
[INFO] Tests run: 6, Failures: 0, Errors: 0, Skipped: 0, Time elapsed: 0.008 s - in org.apache.phoenix.schema.types.PrimitiveBytePhoenixArrayToStringTest
[INFO] Running org.apache.phoenix.schema.types.PrimitiveIntPhoenixArrayToStringTest
[INFO] Tests run: 8, Failures: 0, Errors: 0, Skipped: 0, Time elapsed: 0.001 s - in org.apache.phoenix.schema.types.PVarcharArrayToStringTest
[INFO] Tests run: 6, Failures: 0, Errors: 0, Skipped: 0, Time elapsed: 0.016 s - in org.apache.phoenix.schema.types.PrimitiveIntPhoenixArrayToStringTest
[INFO] Running org.apache.phoenix.schema.types.PDataTypeForArraysTest
[INFO] Running org.apache.phoenix.schema.types.PrimitiveFloatPhoenixArrayToStringTest
[INFO] Tests run: 6, Failures: 0, Errors: 0, Skipped: 0, Time elapsed: 0.006 s - in org.apache.phoenix.schema.types.PrimitiveFloatPhoenixArrayToStringTest
[INFO] Running org.apache.phoenix.schema.types.PrimitiveBooleanPhoenixArrayToStringTest
[INFO] Tests run: 6, Failures: 0, Errors: 0, Skipped: 0, Time elapsed: 0.004 s - in org.apache.phoenix.schema.types.PrimitiveBooleanPhoenixArrayToStringTest
[INFO] Running org.apache.phoenix.schema.types.PrimitiveDoublePhoenixArrayToStringTest
[INFO] Tests run: 6, Failures: 0, Errors: 0, Skipped: 0, Time elapsed: 0.007 s - in org.apache.phoenix.schema.types.PrimitiveDoublePhoenixArrayToStringTest
[INFO] Running org.apache.phoenix.schema.types.PrimitiveShortPhoenixArrayToStringTest
[INFO] Tests run: 6, Failures: 0, Errors: 0, Skipped: 0, Time elapsed: 0.008 s - in org.apache.phoenix.schema.types.PrimitiveShortPhoenixArrayToStringTest
[INFO] Running org.apache.phoenix.schema.types.PDateArrayToStringTest
[INFO] Tests run: 6, Failures: 0, Errors: 0, Skipped: 0, Time elapsed: 0.006 s - in org.apache.phoenix.schema.types.PDateArrayToStringTest
[INFO] Running org.apache.phoenix.schema.PMetaDataImplTest
[INFO] Tests run: 6, Failures: 0, Errors: 0, Skipped: 0, Time elapsed: 0.095 s - in org.apache.phoenix.schema.PMetaDataImplTest
[INFO] Tests run: 69, Failures: 0, Errors: 0, Skipped: 0, Time elapsed: 0.123 s - in org.apache.phoenix.schema.types.PDataTypeForArraysTest
[INFO] Tests run: 37, Failures: 0, Errors: 0, Skipped: 0, Time elapsed: 0.275 s - in org.apache.phoenix.schema.types.PDataTypeTest
[INFO] Running org.apache.phoenix.metrics.MetricTypeTest
[INFO] Running org.apache.phoenix.query.ConnectionlessTest
[INFO] Tests run: 1, Failures: 0, Errors: 0, Skipped: 0, Time elapsed: 0.002 s - in org.apache.phoenix.metrics.MetricTypeTest
[INFO] Running org.apache.phoenix.schema.ImmutableStorageSchemeTest
[INFO] Running org.apache.phoenix.query.PhoenixStatsCacheRemovalListenerTest
[INFO] Tests run: 1, Failures: 0, Errors: 0, Skipped: 0, Time elapsed: 0.004 s - in org.apache.phoenix.query.PhoenixStatsCacheRemovalListenerTest
[INFO] Running org.apache.phoenix.query.GuidePostsCacheWrapperTest
[INFO] Tests run: 1, Failures: 0, Errors: 0, Skipped: 0, Time elapsed: 0.71 s - in org.apache.phoenix.schema.RowKeyValueAccessorTest
[INFO] Running org.apache.phoenix.query.PhoenixStatsCacheLoaderTest
[INFO] Tests run: 7, Failures: 0, Errors: 0, Skipped: 0, Time elapsed: 0.637 s - in org.apache.phoenix.schema.RowKeySchemaTest
[INFO] Tests run: 4, Failures: 0, Errors: 0, Skipped: 0, Time elapsed: 0.117 s - in org.apache.phoenix.query.GuidePostsCacheWrapperTest
[INFO] Running org.apache.phoenix.query.ParallelIteratorsSplitTest
[INFO] Running org.apache.phoenix.query.ConnectionQueryServicesImplTest
[INFO] Tests run: 2, Failures: 0, Errors: 0, Skipped: 0, Time elapsed: 0.923 s - in org.apache.phoenix.schema.MutationTest
[INFO] Running org.apache.phoenix.query.GuidePostsCacheProviderTest
[INFO] Tests run: 3, Failures: 0, Errors: 0, Skipped: 0, Time elapsed: 0.554 s - in org.apache.phoenix.query.ConnectionlessTest
[INFO] Tests run: 1, Failures: 0, Errors: 0, Skipped: 0, Time elapsed: 0.394 s - in org.apache.phoenix.query.ConnectionQueryServicesImplTest
[INFO] Running org.apache.phoenix.query.KeyRangeCoalesceTest
[INFO] Running org.apache.phoenix.query.OrderByTest
[INFO] Tests run: 1, Failures: 0, Errors: 0, Skipped: 0, Time elapsed: 0.447 s - in org.apache.phoenix.query.PhoenixStatsCacheLoaderTest
[INFO] Running org.apache.phoenix.query.KeyRangeIntersectTest
[INFO] Tests run: 9, Failures: 0, Errors: 0, Skipped: 0, Time elapsed: 0.039 s - in org.apache.phoenix.query.KeyRangeIntersectTest
[INFO] Running org.apache.phoenix.query.PropertyPolicyProviderTest
[INFO] Tests run: 13, Failures: 0, Errors: 0, Skipped: 0, Time elapsed: 0.104 s - in org.apache.phoenix.query.KeyRangeCoalesceTest
[INFO] Running org.apache.phoenix.query.KeyRangeUnionTest
[INFO] Tests run: 6, Failures: 0, Errors: 0, Skipped: 0, Time elapsed: 0.246 s - in org.apache.phoenix.query.GuidePostsCacheProviderTest
[INFO] Running org.apache.phoenix.query.EncodedColumnQualifierCellsListTest
[INFO] Tests run: 22, Failures: 0, Errors: 0, Skipped: 0, Time elapsed: 0.047 s - in org.apache.phoenix.query.EncodedColumnQualifierCellsListTest
[INFO] Running org.apache.phoenix.query.KeyRangeMoreTest
[INFO] Tests run: 8, Failures: 0, Errors: 0, Skipped: 0, Time elapsed: 0.082 s - in org.apache.phoenix.query.KeyRangeUnionTest
[INFO] Running org.apache.phoenix.query.QueryPlanTest
[INFO] Tests run: 8, Failures: 0, Errors: 0, Skipped: 0, Time elapsed: 1.093 s - in org.apache.phoenix.query.ParallelIteratorsSplitTest
[INFO] Running org.apache.phoenix.query.ScannerLeaseRenewalTest
[INFO] Tests run: 4, Failures: 0, Errors: 0, Skipped: 0, Time elapsed: 0.612 s - in org.apache.phoenix.query.PropertyPolicyProviderTest
[INFO] Running org.apache.phoenix.query.HBaseFactoryProviderTest
[INFO] Tests run: 49, Failures: 0, Errors: 0, Skipped: 0, Time elapsed: 6.8 s - in org.apache.phoenix.compile.QueryOptimizerTest
[INFO] Tests run: 3, Failures: 0, Errors: 0, Skipped: 0, Time elapsed: 0.004 s - in org.apache.phoenix.query.HBaseFactoryProviderTest
[INFO] Running org.apache.phoenix.query.KeyRangeClipTest
[INFO] Running org.apache.phoenix.execute.UnnestArrayPlanTest
[INFO] Tests run: 6, Failures: 0, Errors: 0, Skipped: 0, Time elapsed: 0.024 s - in org.apache.phoenix.execute.UnnestArrayPlanTest
[INFO] Running org.apache.phoenix.execute.MutationStateTest
[INFO] Tests run: 4, Failures: 0, Errors: 0, Skipped: 0, Time elapsed: 0.84 s - in org.apache.phoenix.query.OrderByTest
[INFO] Running org.apache.phoenix.execute.LiteralResultIteratorPlanTest
[INFO] Tests run: 22, Failures: 0, Errors: 0, Skipped: 0, Time elapsed: 1.596 s - in org.apache.phoenix.schema.ImmutableStorageSchemeTest
[INFO] Running org.apache.phoenix.execute.CorrelatePlanTest
[INFO] Tests run: 4, Failures: 0, Errors: 0, Skipped: 0, Time elapsed: 0.471 s - in org.apache.phoenix.execute.MutationStateTest
[INFO] Running org.apache.phoenix.execute.DescVarLengthFastByteComparisonsTest
[INFO] Tests run: 2, Failures: 0, Errors: 0, Skipped: 0, Time elapsed: 0.003 s - in org.apache.phoenix.execute.DescVarLengthFastByteComparisonsTest
[INFO] Running org.apache.phoenix.jdbc.PhoenixPreparedStatementTest
[INFO] Tests run: 3, Failures: 0, Errors: 0, Skipped: 0, Time elapsed: 0.542 s - in org.apache.phoenix.execute.LiteralResultIteratorPlanTest
[INFO] Running org.apache.phoenix.jdbc.PhoenixResultSetMetadataTest
[INFO] Tests run: 8, Failures: 0, Errors: 0, Skipped: 0, Time elapsed: 0.74 s - in org.apache.phoenix.query.KeyRangeClipTest
[INFO] Running org.apache.phoenix.jdbc.PhoenixEmbeddedDriverTest
[INFO] Tests run: 6, Failures: 0, Errors: 0, Skipped: 0, Time elapsed: 0.603 s - in org.apache.phoenix.execute.CorrelatePlanTest
[INFO] Running org.apache.phoenix.jdbc.ReadOnlyPropertiesTest
[INFO] Tests run: 4, Failures: 0, Errors: 0, Skipped: 0, Time elapsed: 0.004 s - in org.apache.phoenix.jdbc.ReadOnlyPropertiesTest
[INFO] Running org.apache.phoenix.jdbc.PhoenixDriverTest
[INFO] Tests run: 4, Failures: 0, Errors: 0, Skipped: 0, Time elapsed: 0.29 s - in org.apache.phoenix.jdbc.PhoenixEmbeddedDriverTest
[INFO] Running org.apache.phoenix.parse.BuiltInFunctionInfoTest
[INFO] Tests run: 3, Failures: 0, Errors: 0, Skipped: 0, Time elapsed: 0.005 s - in org.apache.phoenix.parse.BuiltInFunctionInfoTest
[INFO] Running org.apache.phoenix.parse.QueryParserTest
[INFO] Tests run: 5, Failures: 0, Errors: 0, Skipped: 0, Time elapsed: 1.836 s - in org.apache.phoenix.query.QueryPlanTest
[INFO] Running org.apache.phoenix.parse.CastParseNodeTest
[INFO] Tests run: 3, Failures: 0, Errors: 0, Skipped: 0, Time elapsed: 0.002 s - in org.apache.phoenix.parse.CastParseNodeTest
[INFO] Tests run: 8, Failures: 0, Errors: 0, Skipped: 0, Time elapsed: 0.814 s - in org.apache.phoenix.jdbc.PhoenixPreparedStatementTest
[INFO] Running org.apache.phoenix.parse.CursorParserTest
[INFO] Running org.apache.phoenix.filter.EncodedQualifiersColumnProjectionFilterTest
[INFO] Tests run: 1, Failures: 0, Errors: 0, Skipped: 0, Time elapsed: 0.007 s - in org.apache.phoenix.filter.EncodedQualifiersColumnProjectionFilterTest
[INFO] Running org.apache.phoenix.filter.SkipScanFilterTest
[INFO] Tests run: 70, Failures: 0, Errors: 0, Skipped: 0, Time elapsed: 0.311 s - in org.apache.phoenix.parse.QueryParserTest
[INFO] Running org.apache.phoenix.filter.SkipScanFilterIntersectTest
[INFO] Tests run: 1, Failures: 0, Errors: 0, Skipped: 0, Time elapsed: 0.704 s - in org.apache.phoenix.jdbc.PhoenixResultSetMetadataTest
[INFO] Running org.apache.phoenix.filter.SkipScanBigFilterTest
[INFO] Tests run: 22, Failures: 0, Errors: 0, Skipped: 0, Time elapsed: 0.079 s - in org.apache.phoenix.parse.CursorParserTest
[INFO] Running org.apache.phoenix.filter.DistinctPrefixFilterTest
[INFO] Tests run: 19, Failures: 0, Errors: 0, Skipped: 0, Time elapsed: 0.031 s - in org.apache.phoenix.filter.SkipScanFilterIntersectTest
[INFO] Running org.apache.phoenix.cache.JodaTimezoneCacheTest
[INFO] Tests run: 4, Failures: 0, Errors: 0, Skipped: 0, Time elapsed: 0.013 s - in org.apache.phoenix.cache.JodaTimezoneCacheTest
[INFO] Running org.apache.phoenix.cache.TenantCacheTest
[INFO] Tests run: 8, Failures: 0, Errors: 0, Skipped: 0, Time elapsed: 0.045 s - in org.apache.phoenix.filter.DistinctPrefixFilterTest
[INFO] Running org.apache.hadoop.hbase.regionserver.wal.IndexedKeyValueTest
[INFO] Tests run: 7, Failures: 0, Errors: 0, Skipped: 0, Time elapsed: 0.057 s - in org.apache.phoenix.cache.TenantCacheTest
[INFO] Running org.apache.hadoop.hbase.regionserver.wal.ReadWriteKeyValuesWithCodecTest
[INFO] Tests run: 20, Failures: 0, Errors: 0, Skipped: 0, Time elapsed: 0.174 s - in org.apache.phoenix.filter.SkipScanFilterTest
[INFO] Running org.apache.hadoop.hbase.regionserver.wal.IndexedWALEditCodecTest
[INFO] Tests run: 1, Failures: 0, Errors: 0, Skipped: 0, Time elapsed: 0.034 s - in org.apache.hadoop.hbase.regionserver.wal.IndexedWALEditCodecTest
[INFO] Running org.apache.hadoop.hbase.regionserver.PhoenixRpcSchedulerFactoryTest
[INFO] Tests run: 2, Failures: 0, Errors: 0, Skipped: 0, Time elapsed: 0.044 s - in org.apache.hadoop.hbase.regionserver.PhoenixRpcSchedulerFactoryTest
[INFO] Running org.apache.hadoop.hbase.ipc.PhoenixIndexRpcSchedulerTest
[INFO] Tests run: 2, Failures: 0, Errors: 0, Skipped: 0, Time elapsed: 0.383 s - in org.apache.hadoop.hbase.regionserver.wal.ReadWriteKeyValuesWithCodecTest
[INFO] Tests run: 2, Failures: 0, Errors: 0, Skipped: 0, Time elapsed: 0.577 s - in org.apache.hadoop.hbase.regionserver.wal.IndexedKeyValueTest
[INFO] Tests run: 2, Failures: 0, Errors: 0, Skipped: 0, Time elapsed: 0.886 s - in org.apache.phoenix.filter.SkipScanBigFilterTest
[WARNING] Tests run: 7, Failures: 0, Errors: 0, Skipped: 1, Time elapsed: 1.32 s - in org.apache.phoenix.jdbc.PhoenixDriverTest
[INFO] Tests run: 2, Failures: 0, Errors: 0, Skipped: 0, Time elapsed: 1.06 s - in org.apache.hadoop.hbase.ipc.PhoenixIndexRpcSchedulerTest
[INFO] Tests run: 5, Failures: 0, Errors: 0, Skipped: 0, Time elapsed: 3.599 s - in org.apache.phoenix.query.KeyRangeMoreTest
[INFO] Tests run: 2, Failures: 0, Errors: 0, Skipped: 0, Time elapsed: 5.433 s - in org.apache.phoenix.query.ScannerLeaseRenewalTest
[WARNING] Tests run: 200, Failures: 0, Errors: 0, Skipped: 2, Time elapsed: 8.97 s - in org.apache.phoenix.compile.QueryCompilerTest
[INFO] 
[INFO] Results:
[INFO] 
[ERROR] Failures: 
[ERROR]   IndexScrutinyTableOutputTest.testGetOutputTableUpsert:83 expected:<... "HAS_TARGET_ROW", "[ID" INTEGER, "PK_PART2" TINYINT, "NAME" VARCHAR, "ZIP" BIGINT, ":ID" INTEGER, ":PK_PART2" TINYINT, "0:NAME" VARCHAR, "0:ZIP" BIGINT) VALUES (]?, ?, ?, ?, ?, ?, ?,...> but was:<... "HAS_TARGET_ROW", "[BEYOND_MAX_LOOKBACK", "ID" INTEGER, "PK_PART2" TINYINT, "NAME" VARCHAR, "ZIP" BIGINT, ":ID" INTEGER, ":PK_PART2" TINYINT, "0:NAME" VARCHAR, "0:ZIP" BIGINT) VALUES (?, ]?, ?, ?, ?, ?, ?, ?,...>
[ERROR]   IndexScrutinyTableOutputTest.testGetSqlQueryAllInvalidRows:50 expected:<..."HAS_TARGET_ROW" , "[]ID" , "PK_PART2" , "...> but was:<..."HAS_TARGET_ROW" , "[BEYOND_MAX_LOOKBACK" , "]ID" , "PK_PART2" , "...>
[ERROR]   IndexScrutinyTableOutputTest.testGetSqlQueryBadCoveredColVal:72 expected:<..."HAS_TARGET_ROW" , "[]ID" , "PK_PART2" , "...> but was:<..."HAS_TARGET_ROW" , "[BEYOND_MAX_LOOKBACK" , "]ID" , "PK_PART2" , "...>
[ERROR]   IndexScrutinyTableOutputTest.testGetSqlQueryMissingTargetRows:61 expected:<..."HAS_TARGET_ROW" , "[]ID" , "PK_PART2" , "...> but was:<..."HAS_TARGET_ROW" , "[BEYOND_MAX_LOOKBACK" , "]ID" , "PK_PART2" , "...>
[INFO] 
[ERROR] Tests run: 1789, Failures: 4, Errors: 0, Skipped: 5
[INFO] 
[INFO] ------------------------------------------------------------------------
[INFO] Reactor Summary for Apache Phoenix 4.16.0-SNAPSHOT:
[INFO] 
[INFO] Phoenix Hbase 1.5.0 compatibility .................. SUCCESS [ 10.653 s]
[INFO] Phoenix Hbase 1.4.0 compatibility .................. SUCCESS [  2.611 s]
[INFO] Phoenix Hbase 1.3.0 compatibility .................. SUCCESS [  3.797 s]
[INFO] Apache Phoenix ..................................... SUCCESS [  2.123 s]
[INFO] Phoenix Core ....................................... FAILURE [01:11 min]
[INFO] Phoenix - Pherf .................................... SKIPPED
[INFO] Phoenix Client ..................................... SKIPPED
[INFO] Phoenix Server ..................................... SKIPPED
[INFO] Phoenix Assembly ................................... SKIPPED
[INFO] Phoenix - Tracing Web Application .................. SKIPPED
[INFO] ------------------------------------------------------------------------
[INFO] BUILD FAILURE
[INFO] ------------------------------------------------------------------------
[INFO] Total time:  01:31 min
[INFO] Finished at: 2020-03-26T18:19:47Z
[INFO] ------------------------------------------------------------------------
[ERROR] Failed to execute goal org.apache.maven.plugins:maven-surefire-plugin:2.22.0:test (default-test) on project phoenix-core: There are test failures.
[ERROR] 
[ERROR] Please refer to <https://builds.apache.org/job/Phoenix-4.x-matrix/HBASE_PROFILE=1.3/ws/phoenix-core/target/surefire-reports> for the individual test results.
[ERROR] Please refer to dump files (if any exist) [date]-jvmRun[N].dump, [date].dumpstream and [date]-jvmRun[N].dumpstream.
[ERROR] -> [Help 1]
[ERROR] 
[ERROR] To see the full stack trace of the errors, re-run Maven with the -e switch.
[ERROR] Re-run Maven using the -X switch to enable full debug logging.
[ERROR] 
[ERROR] For more information about the errors and possible solutions, please read the following articles:
[ERROR] [Help 1] http://cwiki.apache.org/confluence/display/MAVEN/MojoFailureException
[ERROR] 
[ERROR] After correcting the problems, you can resume the build with the command
[ERROR]   mvn <args> -rf :phoenix-core
Build step 'Invoke top-level Maven targets' marked build as failure
Archiving artifacts
Recording test results
Not sending mail to unregistered user s.kadam@salesforce.com