You are viewing a plain text version of this content. The canonical link for it is here.
Posted to builds@beam.apache.org by Apache Jenkins Server <je...@builds.apache.org> on 2023/02/17 22:23:02 UTC
Build failed in Jenkins: beam_PostCommit_Python_Examples_Flink #1497
See <https://ci-beam.apache.org/job/beam_PostCommit_Python_Examples_Flink/1497/display/redirect?page=changes>
Changes:
[noreply] Stop use of self hosted runners for some workflows. (#25542)
[noreply] Run prbot updates on hosted runners (#25544)
[noreply] prism-fixstatic (#25546)
------------------------------------------
[...truncated 43.12 MB...]
apache_beam/examples/complete/game/user_score_it_test.py::UserScoreIT::test_userscore_output_checksum_on_small_input
<https://ci-beam.apache.org/job/beam_PostCommit_Python_Examples_Flink/ws/src/build/gradleenv/-1720702907/lib/python3.10/site-packages/_pytest/threadexception.py>:73: PytestUnhandledThreadExceptionWarning: Exception in thread read_grpc_client_inputs
Traceback (most recent call last):
File "/usr/lib/python3.10/threading.py", line 1009, in _bootstrap_inner
self.run()
File "/usr/lib/python3.10/threading.py", line 946, in run
self._target(*self._args, **self._kwargs)
File "<https://ci-beam.apache.org/job/beam_PostCommit_Python_Examples_Flink/ws/src/sdks/python/apache_beam/runners/worker/data_plane.py",> line 671, in <lambda>
target=lambda: self._read_inputs(elements_iterator),
File "<https://ci-beam.apache.org/job/beam_PostCommit_Python_Examples_Flink/ws/src/sdks/python/apache_beam/runners/worker/data_plane.py",> line 654, in _read_inputs
for elements in elements_iterator:
File "<https://ci-beam.apache.org/job/beam_PostCommit_Python_Examples_Flink/ws/src/build/gradleenv/-1720702907/lib/python3.10/site-packages/grpc/_channel.py",> line 426, in __next__
return self._next()
File "<https://ci-beam.apache.org/job/beam_PostCommit_Python_Examples_Flink/ws/src/build/gradleenv/-1720702907/lib/python3.10/site-packages/grpc/_channel.py",> line 826, in _next
raise self
grpc._channel._MultiThreadedRendezvous: <_MultiThreadedRendezvous of RPC that terminated with:
status = StatusCode.CANCELLED
details = "Multiplexer hanging up"
debug_error_string = "UNKNOWN:Error received from peer ipv6:%5B::1%5D:35377 {grpc_message:"Multiplexer hanging up", grpc_status:1, created_time:"2023-02-17T22:17:48.062625642+00:00"}"
>
warnings.warn(pytest.PytestUnhandledThreadExceptionWarning(msg))
apache_beam/examples/cookbook/bigquery_tornadoes_it_test.py::BigqueryTornadoesIT::test_bigquery_tornadoes_it
apache_beam/examples/cookbook/filters_test.py::FiltersTest::test_filters_output_bigquery_matcher
apache_beam/examples/dataframe/flight_delays_it_test.py::FlightDelaysTest::test_flight_delays
<https://ci-beam.apache.org/job/beam_PostCommit_Python_Examples_Flink/ws/src/sdks/python/apache_beam/io/gcp/bigquery.py>:2485: BeamDeprecationWarning: options is deprecated since First stable release. References to <pipeline>.options will not be supported
temp_location = pcoll.pipeline.options.view_as(
apache_beam/examples/cookbook/bigquery_tornadoes_it_test.py::BigqueryTornadoesIT::test_bigquery_tornadoes_it
apache_beam/examples/cookbook/filters_test.py::FiltersTest::test_filters_output_bigquery_matcher
apache_beam/examples/dataframe/flight_delays_it_test.py::FlightDelaysTest::test_flight_delays
<https://ci-beam.apache.org/job/beam_PostCommit_Python_Examples_Flink/ws/src/sdks/python/apache_beam/io/gcp/bigquery.py>:2487: BeamDeprecationWarning: options is deprecated since First stable release. References to <pipeline>.options will not be supported
job_name = pcoll.pipeline.options.view_as(GoogleCloudOptions).job_name
apache_beam/examples/cookbook/bigquery_tornadoes_it_test.py::BigqueryTornadoesIT::test_bigquery_tornadoes_it
apache_beam/examples/cookbook/filters_test.py::FiltersTest::test_filters_output_bigquery_matcher
apache_beam/examples/dataframe/flight_delays_it_test.py::FlightDelaysTest::test_flight_delays
<https://ci-beam.apache.org/job/beam_PostCommit_Python_Examples_Flink/ws/src/sdks/python/apache_beam/io/gcp/bigquery.py>:2511: BeamDeprecationWarning: options is deprecated since First stable release. References to <pipeline>.options will not be supported
pipeline_options=pcoll.pipeline.options,
apache_beam/examples/cookbook/bigquery_tornadoes_it_test.py::BigqueryTornadoesIT::test_bigquery_tornadoes_it
apache_beam/examples/cookbook/filters_test.py::FiltersTest::test_filters_output_bigquery_matcher
<https://ci-beam.apache.org/job/beam_PostCommit_Python_Examples_Flink/ws/src/sdks/python/apache_beam/io/gcp/bigquery.py>:1988: BeamDeprecationWarning: options is deprecated since First stable release. References to <pipeline>.options will not be supported
self.table_reference.projectId = pcoll.pipeline.options.view_as(
apache_beam/examples/cookbook/bigquery_tornadoes_it_test.py::BigqueryTornadoesIT::test_bigquery_tornadoes_it
apache_beam/examples/cookbook/filters_test.py::FiltersTest::test_filters_output_bigquery_matcher
<https://ci-beam.apache.org/job/beam_PostCommit_Python_Examples_Flink/ws/src/sdks/python/apache_beam/io/gcp/bigquery_file_loads.py>:1166: BeamDeprecationWarning: options is deprecated since First stable release. References to <pipeline>.options will not be supported
self.project = self.project or p.options.view_as(GoogleCloudOptions).project
apache_beam/examples/cookbook/bigquery_tornadoes_it_test.py::BigqueryTornadoesIT::test_bigquery_tornadoes_it
apache_beam/examples/cookbook/filters_test.py::FiltersTest::test_filters_output_bigquery_matcher
<https://ci-beam.apache.org/job/beam_PostCommit_Python_Examples_Flink/ws/src/sdks/python/apache_beam/io/gcp/tests/utils.py>:100: PendingDeprecationWarning: Client.dataset is deprecated and will be removed in a future version. Use a string like 'my_project.my_dataset' or a cloud.google.bigquery.DatasetReference object, instead.
table_ref = client.dataset(dataset_id).table(table_id)
apache_beam/examples/cookbook/bigquery_tornadoes_it_test.py::BigqueryTornadoesIT::test_bigquery_tornadoes_it
<https://ci-beam.apache.org/job/beam_PostCommit_Python_Examples_Flink/ws/src/build/gradleenv/-1720702907/lib/python3.10/site-packages/_pytest/threadexception.py>:73: PytestUnhandledThreadExceptionWarning: Exception in thread read_grpc_client_inputs
Traceback (most recent call last):
File "/usr/lib/python3.10/threading.py", line 1009, in _bootstrap_inner
self.run()
File "/usr/lib/python3.10/threading.py", line 946, in run
self._target(*self._args, **self._kwargs)
File "<https://ci-beam.apache.org/job/beam_PostCommit_Python_Examples_Flink/ws/src/sdks/python/apache_beam/runners/worker/data_plane.py",> line 671, in <lambda>
target=lambda: self._read_inputs(elements_iterator),
File "<https://ci-beam.apache.org/job/beam_PostCommit_Python_Examples_Flink/ws/src/sdks/python/apache_beam/runners/worker/data_plane.py",> line 654, in _read_inputs
for elements in elements_iterator:
File "<https://ci-beam.apache.org/job/beam_PostCommit_Python_Examples_Flink/ws/src/build/gradleenv/-1720702907/lib/python3.10/site-packages/grpc/_channel.py",> line 426, in __next__
return self._next()
File "<https://ci-beam.apache.org/job/beam_PostCommit_Python_Examples_Flink/ws/src/build/gradleenv/-1720702907/lib/python3.10/site-packages/grpc/_channel.py",> line 826, in _next
raise self
grpc._channel._MultiThreadedRendezvous: <_MultiThreadedRendezvous of RPC that terminated with:
status = StatusCode.CANCELLED
details = "Multiplexer hanging up"
debug_error_string = "UNKNOWN:Error received from peer ipv6:%5B::1%5D:35095 {grpc_message:"Multiplexer hanging up", grpc_status:1, created_time:"2023-02-17T22:18:14.982705683+00:00"}"
>
warnings.warn(pytest.PytestUnhandledThreadExceptionWarning(msg))
apache_beam/examples/cookbook/coders_it_test.py::CodersIT::test_coders_output_files_on_small_input
<https://ci-beam.apache.org/job/beam_PostCommit_Python_Examples_Flink/ws/src/build/gradleenv/-1720702907/lib/python3.10/site-packages/_pytest/threadexception.py>:73: PytestUnhandledThreadExceptionWarning: Exception in thread read_grpc_client_inputs
Traceback (most recent call last):
File "/usr/lib/python3.10/threading.py", line 1009, in _bootstrap_inner
self.run()
File "/usr/lib/python3.10/threading.py", line 946, in run
self._target(*self._args, **self._kwargs)
File "<https://ci-beam.apache.org/job/beam_PostCommit_Python_Examples_Flink/ws/src/sdks/python/apache_beam/runners/worker/data_plane.py",> line 671, in <lambda>
target=lambda: self._read_inputs(elements_iterator),
File "<https://ci-beam.apache.org/job/beam_PostCommit_Python_Examples_Flink/ws/src/sdks/python/apache_beam/runners/worker/data_plane.py",> line 654, in _read_inputs
for elements in elements_iterator:
File "<https://ci-beam.apache.org/job/beam_PostCommit_Python_Examples_Flink/ws/src/build/gradleenv/-1720702907/lib/python3.10/site-packages/grpc/_channel.py",> line 426, in __next__
return self._next()
File "<https://ci-beam.apache.org/job/beam_PostCommit_Python_Examples_Flink/ws/src/build/gradleenv/-1720702907/lib/python3.10/site-packages/grpc/_channel.py",> line 826, in _next
raise self
grpc._channel._MultiThreadedRendezvous: <_MultiThreadedRendezvous of RPC that terminated with:
status = StatusCode.CANCELLED
details = "Multiplexer hanging up"
debug_error_string = "UNKNOWN:Error received from peer ipv6:%5B::1%5D:33169 {grpc_message:"Multiplexer hanging up", grpc_status:1, created_time:"2023-02-17T22:18:49.417408677+00:00"}"
>
warnings.warn(pytest.PytestUnhandledThreadExceptionWarning(msg))
apache_beam/examples/cookbook/custom_ptransform_it_test.py::CustomPTransformIT::test_custom_ptransform_output_files_on_small_input
<https://ci-beam.apache.org/job/beam_PostCommit_Python_Examples_Flink/ws/src/build/gradleenv/-1720702907/lib/python3.10/site-packages/_pytest/threadexception.py>:73: PytestUnhandledThreadExceptionWarning: Exception in thread read_grpc_client_inputs
Traceback (most recent call last):
File "/usr/lib/python3.10/threading.py", line 1009, in _bootstrap_inner
self.run()
File "/usr/lib/python3.10/threading.py", line 946, in run
self._target(*self._args, **self._kwargs)
File "<https://ci-beam.apache.org/job/beam_PostCommit_Python_Examples_Flink/ws/src/sdks/python/apache_beam/runners/worker/data_plane.py",> line 671, in <lambda>
target=lambda: self._read_inputs(elements_iterator),
File "<https://ci-beam.apache.org/job/beam_PostCommit_Python_Examples_Flink/ws/src/sdks/python/apache_beam/runners/worker/data_plane.py",> line 654, in _read_inputs
for elements in elements_iterator:
File "<https://ci-beam.apache.org/job/beam_PostCommit_Python_Examples_Flink/ws/src/build/gradleenv/-1720702907/lib/python3.10/site-packages/grpc/_channel.py",> line 426, in __next__
return self._next()
File "<https://ci-beam.apache.org/job/beam_PostCommit_Python_Examples_Flink/ws/src/build/gradleenv/-1720702907/lib/python3.10/site-packages/grpc/_channel.py",> line 826, in _next
raise self
grpc._channel._MultiThreadedRendezvous: <_MultiThreadedRendezvous of RPC that terminated with:
status = StatusCode.CANCELLED
details = "Multiplexer hanging up"
debug_error_string = "UNKNOWN:Error received from peer ipv6:%5B::1%5D:35963 {grpc_message:"Multiplexer hanging up", grpc_status:1, created_time:"2023-02-17T22:19:45.934555513+00:00"}"
>
warnings.warn(pytest.PytestUnhandledThreadExceptionWarning(msg))
apache_beam/examples/cookbook/filters_test.py::FiltersTest::test_filters_output_bigquery_matcher
<https://ci-beam.apache.org/job/beam_PostCommit_Python_Examples_Flink/ws/src/build/gradleenv/-1720702907/lib/python3.10/site-packages/_pytest/threadexception.py>:73: PytestUnhandledThreadExceptionWarning: Exception in thread read_grpc_client_inputs
Traceback (most recent call last):
File "/usr/lib/python3.10/threading.py", line 1009, in _bootstrap_inner
self.run()
File "/usr/lib/python3.10/threading.py", line 946, in run
self._target(*self._args, **self._kwargs)
File "<https://ci-beam.apache.org/job/beam_PostCommit_Python_Examples_Flink/ws/src/sdks/python/apache_beam/runners/worker/data_plane.py",> line 671, in <lambda>
target=lambda: self._read_inputs(elements_iterator),
File "<https://ci-beam.apache.org/job/beam_PostCommit_Python_Examples_Flink/ws/src/sdks/python/apache_beam/runners/worker/data_plane.py",> line 654, in _read_inputs
for elements in elements_iterator:
File "<https://ci-beam.apache.org/job/beam_PostCommit_Python_Examples_Flink/ws/src/build/gradleenv/-1720702907/lib/python3.10/site-packages/grpc/_channel.py",> line 426, in __next__
return self._next()
File "<https://ci-beam.apache.org/job/beam_PostCommit_Python_Examples_Flink/ws/src/build/gradleenv/-1720702907/lib/python3.10/site-packages/grpc/_channel.py",> line 826, in _next
raise self
grpc._channel._MultiThreadedRendezvous: <_MultiThreadedRendezvous of RPC that terminated with:
status = StatusCode.CANCELLED
details = "Multiplexer hanging up"
debug_error_string = "UNKNOWN:Error received from peer ipv6:%5B::1%5D:43343 {grpc_message:"Multiplexer hanging up", grpc_status:1, created_time:"2023-02-17T22:20:16.142615159+00:00"}"
>
warnings.warn(pytest.PytestUnhandledThreadExceptionWarning(msg))
apache_beam/examples/cookbook/group_with_coder_test.py::GroupWithCoderTest::test_basics_with_type_check
<https://ci-beam.apache.org/job/beam_PostCommit_Python_Examples_Flink/ws/src/build/gradleenv/-1720702907/lib/python3.10/site-packages/_pytest/threadexception.py>:73: PytestUnhandledThreadExceptionWarning: Exception in thread read_grpc_client_inputs
Traceback (most recent call last):
File "/usr/lib/python3.10/threading.py", line 1009, in _bootstrap_inner
self.run()
File "/usr/lib/python3.10/threading.py", line 946, in run
self._target(*self._args, **self._kwargs)
File "<https://ci-beam.apache.org/job/beam_PostCommit_Python_Examples_Flink/ws/src/sdks/python/apache_beam/runners/worker/data_plane.py",> line 671, in <lambda>
target=lambda: self._read_inputs(elements_iterator),
File "<https://ci-beam.apache.org/job/beam_PostCommit_Python_Examples_Flink/ws/src/sdks/python/apache_beam/runners/worker/data_plane.py",> line 654, in _read_inputs
for elements in elements_iterator:
File "<https://ci-beam.apache.org/job/beam_PostCommit_Python_Examples_Flink/ws/src/build/gradleenv/-1720702907/lib/python3.10/site-packages/grpc/_channel.py",> line 426, in __next__
return self._next()
File "<https://ci-beam.apache.org/job/beam_PostCommit_Python_Examples_Flink/ws/src/build/gradleenv/-1720702907/lib/python3.10/site-packages/grpc/_channel.py",> line 826, in _next
raise self
grpc._channel._MultiThreadedRendezvous: <_MultiThreadedRendezvous of RPC that terminated with:
status = StatusCode.CANCELLED
details = "Multiplexer hanging up"
debug_error_string = "UNKNOWN:Error received from peer ipv6:%5B::1%5D:35369 {grpc_message:"Multiplexer hanging up", grpc_status:1, created_time:"2023-02-17T22:20:52.032870454+00:00"}"
>
warnings.warn(pytest.PytestUnhandledThreadExceptionWarning(msg))
apache_beam/examples/dataframe/flight_delays_it_test.py: 43 warnings
<https://ci-beam.apache.org/job/beam_PostCommit_Python_Examples_Flink/ws/src/sdks/python/apache_beam/examples/dataframe/flight_delays.py>:47: FutureWarning: The default value of numeric_only in DataFrame.mean is deprecated. In a future version, it will default to False. In addition, specifying 'numeric_only=None' is deprecated. Select only valid columns or specify the value of numeric_only to silence this warning.
return airline_df[at_top_airports].mean()
apache_beam/examples/dataframe/flight_delays_it_test.py::FlightDelaysTest::test_flight_delays
apache_beam/examples/dataframe/wordcount_test.py::WordCountTest::test_basics
<https://ci-beam.apache.org/job/beam_PostCommit_Python_Examples_Flink/ws/src/sdks/python/apache_beam/dataframe/io.py>:659: FutureWarning: WriteToFiles is experimental.
return pcoll | fileio.WriteToFiles(
apache_beam/examples/dataframe/flight_delays_it_test.py::FlightDelaysTest::test_flight_delays
apache_beam/examples/dataframe/wordcount_test.py::WordCountTest::test_basics
<https://ci-beam.apache.org/job/beam_PostCommit_Python_Examples_Flink/ws/src/sdks/python/apache_beam/io/fileio.py>:593: BeamDeprecationWarning: options is deprecated since First stable release. References to <pipeline>.options will not be supported
p.options.view_as(GoogleCloudOptions).temp_location or
apache_beam/examples/dataframe/flight_delays_it_test.py::FlightDelaysTest::test_flight_delays
<https://ci-beam.apache.org/job/beam_PostCommit_Python_Examples_Flink/ws/src/build/gradleenv/-1720702907/lib/python3.10/site-packages/_pytest/threadexception.py>:73: PytestUnhandledThreadExceptionWarning: Exception in thread read_grpc_client_inputs
Traceback (most recent call last):
File "/usr/lib/python3.10/threading.py", line 1009, in _bootstrap_inner
self.run()
File "/usr/lib/python3.10/threading.py", line 946, in run
self._target(*self._args, **self._kwargs)
File "<https://ci-beam.apache.org/job/beam_PostCommit_Python_Examples_Flink/ws/src/sdks/python/apache_beam/runners/worker/data_plane.py",> line 671, in <lambda>
target=lambda: self._read_inputs(elements_iterator),
File "<https://ci-beam.apache.org/job/beam_PostCommit_Python_Examples_Flink/ws/src/sdks/python/apache_beam/runners/worker/data_plane.py",> line 654, in _read_inputs
for elements in elements_iterator:
File "<https://ci-beam.apache.org/job/beam_PostCommit_Python_Examples_Flink/ws/src/build/gradleenv/-1720702907/lib/python3.10/site-packages/grpc/_channel.py",> line 426, in __next__
return self._next()
File "<https://ci-beam.apache.org/job/beam_PostCommit_Python_Examples_Flink/ws/src/build/gradleenv/-1720702907/lib/python3.10/site-packages/grpc/_channel.py",> line 826, in _next
raise self
grpc._channel._MultiThreadedRendezvous: <_MultiThreadedRendezvous of RPC that terminated with:
status = StatusCode.CANCELLED
details = "Multiplexer hanging up"
debug_error_string = "UNKNOWN:Error received from peer ipv6:%5B::1%5D:37337 {grpc_message:"Multiplexer hanging up", grpc_status:1, created_time:"2023-02-17T22:22:05.139810208+00:00"}"
>
warnings.warn(pytest.PytestUnhandledThreadExceptionWarning(msg))
-- Docs: https://docs.pytest.org/en/stable/how-to/capture-warnings.html
- generated xml file: <https://ci-beam.apache.org/job/beam_PostCommit_Python_Examples_Flink/ws/src/sdks/python/pytest_postCommitExamples-flink-py310.xml> -
=== 18 passed, 9 skipped, 6825 deselected, 134 warnings in 734.98s (0:12:14) ===
FAILURE: Build failed with an exception.
* Where:
Script '<https://ci-beam.apache.org/job/beam_PostCommit_Python_Examples_Flink/ws/src/sdks/python/test-suites/portable/common.gradle'> line: 245
* What went wrong:
Execution failed for task ':sdks:python:test-suites:portable:py37:flinkExamples'.
> Process 'command 'sh'' finished with non-zero exit value 1
* Try:
> Run with --stacktrace option to get the stack trace.
> Run with --info or --debug option to get more log output.
* Get more help at https://help.gradle.org
Deprecated Gradle features were used in this build, making it incompatible with Gradle 8.0.
You can use '--warning-mode all' to show the individual deprecation warnings and determine if they come from your own scripts or plugins.
See https://docs.gradle.org/7.5.1/userguide/command_line_interface.html#sec:command_line_warnings
BUILD FAILED in 15m 41s
133 actionable tasks: 87 executed, 44 from cache, 2 up-to-date
Publishing build scan...
https://gradle.com/s/z6o5sizwz4noo
Build step 'Invoke Gradle script' changed build result to FAILURE
Build step 'Invoke Gradle script' marked build as failure
---------------------------------------------------------------------
To unsubscribe, e-mail: builds-unsubscribe@beam.apache.org
For additional commands, e-mail: builds-help@beam.apache.org
Jenkins build is back to normal : beam_PostCommit_Python_Examples_Flink #1498
Posted by Apache Jenkins Server <je...@builds.apache.org>.
See <https://ci-beam.apache.org/job/beam_PostCommit_Python_Examples_Flink/1498/display/redirect?page=changes>
---------------------------------------------------------------------
To unsubscribe, e-mail: builds-unsubscribe@beam.apache.org
For additional commands, e-mail: builds-help@beam.apache.org