You are viewing a plain text version of this content. The canonical link for it is here.
Posted to builds@cassandra.apache.org by Apache Jenkins Server <je...@builds.apache.org> on 2025/02/20 22:09:56 UTC
Build complete: Cassandra-trunk #2030 [UNSTABLE] 1a6b8e06288bbb62e2f816c8d7b24569a0a839a0
-------------------------------------------------------------------------------
Build Cassandra-trunk #2030 Still Unstable
URL: https://ci-cassandra.apache.org/job/Cassandra-trunk/2030/
-------------------------------------------------------------------------------
Changes:
[Sam Tunnicliffe] Invalidate affected prepared stmts on every table metadata change
-------------------------------------------------------------------------------
Failed Tests:
24 tests failed.
FAILED: dtest-latest.cqlsh_tests.test_cqlsh_copy.TestCqlshCopy.Tests / dtest-latest jdk11 5/64 / test_bulk_round_trip_with_timeouts
FAILED: dtest-novnode.pushed_notifications_test.TestPushedNotifications.Tests / dtest-novnode jdk17 56/64 / test_move_single_node_localhost
FAILED: dtest-novnode.topology_test.TestTopology.Tests / dtest-novnode jdk17 21/64 / test_movement
FAILED: dtest-upgrade-large.upgrade_tests.upgrade_through_versions_test.TestProtoV3Upgrade_AllVersions_RandomPartitioner_EndsAt_Trunk_HEAD.Tests / dtest-upgrade-large jdk11 11/32 / test_parallel_upgrade_with_internode_ssl
FAILED: dtest-upgrade-large.upgrade_tests.upgrade_through_versions_test.TestUpgrade_current_5_0_x_To_indev_trunk.Tests / dtest-upgrade-large jdk11 11/32 / test_parallel_upgrade
FAILED: org.apache.cassandra.db.commitlog.CommitlogShutdownTest.Tests / test-system-keyspace-directory jdk17 7/16 / testShutdownWithPendingTasks-system_keyspace_directory_jdk17_x86_64
FAILED: org.apache.cassandra.fuzz.sai.MultiNodeSAITest.Tests / jvm-dtest jdk17 5/12 / indexOnlySaiTest-cassandra.testtag_IS_UNDEFINED
FAILED: org.apache.cassandra.fuzz.sai.MultiNodeSAITest.Tests / jvm-dtest jdk11 5/12 / indexOnlySaiTest-cassandra.testtag_IS_UNDEFINED
FAILED: org.apache.cassandra.transport.SimpleClientPerfTest.Tests / test-burn jdk11 2/2 / measureLargeWithCompression[5/v5]-_jdk11_x86_64
FAILED: org.apache.cassandra.transport.SimpleClientPerfTest.Tests / test-burn jdk17 2/2 / measureLargeWithCompression[5/v5]-_jdk17_x86_64
FAILED: org.apache.cassandra.transport.SimpleClientPerfTest.Tests / test-burn jdk11 2/2 / measureLargeWithCompression[6/v6-beta]-_jdk11_x86_64
FAILED: org.apache.cassandra.transport.SimpleClientPerfTest.Tests / test-burn jdk17 2/2 / measureLargeWithCompression[6/v6-beta]-_jdk17_x86_64
FAILED: org.apache.cassandra.transport.SimpleClientPerfTest.Tests / test-burn jdk11 2/2 / measureLarge[5/v5]-_jdk11_x86_64
FAILED: org.apache.cassandra.transport.SimpleClientPerfTest.Tests / test-burn jdk17 2/2 / measureLarge[5/v5]-_jdk17_x86_64
FAILED: org.apache.cassandra.transport.SimpleClientPerfTest.Tests / test-burn jdk11 2/2 / measureLarge[6/v6-beta]-_jdk11_x86_64
FAILED: org.apache.cassandra.transport.SimpleClientPerfTest.Tests / test-burn jdk17 2/2 / measureLarge[6/v6-beta]-_jdk17_x86_64
FAILED: org.apache.cassandra.db.compaction.CorruptedSSTablesCompactionsTest.Tests / test-compression jdk11 16/16 / testCorruptedSSTablesWithUnifiedCompactionStrategyParallelized-compression_jdk11_x86_64
FAILED: org.apache.cassandra.db.compaction.CorruptedSSTablesCompactionsTest.Tests / test-compression jdk17 16/16 / testCorruptedSSTablesWithUnifiedCompactionStrategyParallelized-compression_jdk17_x86_64
FAILED: org.apache.cassandra.db.compaction.CorruptedSSTablesCompactionsTest.Tests / test-compression jdk11 16/16 / testCorruptedSSTablesWithLeveledCompactionStrategy-compression_jdk11_x86_64
FAILED: org.apache.cassandra.db.compaction.CorruptedSSTablesCompactionsTest.Tests / test-compression jdk17 16/16 / testCorruptedSSTablesWithLeveledCompactionStrategy-compression_jdk17_x86_64
FAILED: org.apache.cassandra.db.compaction.CorruptedSSTablesCompactionsTest.Tests / test-compression jdk11 16/16 / testCorruptedSSTablesWithSizeTieredCompactionStrategy-compression_jdk11_x86_64
FAILED: org.apache.cassandra.db.compaction.CorruptedSSTablesCompactionsTest.Tests / test-compression jdk17 16/16 / testCorruptedSSTablesWithSizeTieredCompactionStrategy-compression_jdk17_x86_64
FAILED: org.apache.cassandra.db.compaction.CorruptedSSTablesCompactionsTest.Tests / test-compression jdk11 16/16 / testCorruptedSSTablesWithUnifiedCompactionStrategy-compression_jdk11_x86_64
FAILED: org.apache.cassandra.db.compaction.CorruptedSSTablesCompactionsTest.Tests / test-compression jdk17 16/16 / testCorruptedSSTablesWithUnifiedCompactionStrategy-compression_jdk17_x86_64
-------------------------------------------------------------------------------
For complete test report and logs see https://nightlies.apache.org/cassandra/Cassandra-trunk/2030/