You are viewing a plain text version of this content. The canonical link for it is here.
Posted to builds@beam.apache.org by Apache Jenkins Server <je...@builds.apache.org> on 2022/08/22 18:16:16 UTC

Build failed in Jenkins: beam_PostCommit_Java_DataflowV2 #2016

See <https://ci-beam.apache.org/job/beam_PostCommit_Java_DataflowV2/2016/display/redirect?page=changes>

Changes:

[noreply] Add Release category to release announcement blogs (#22785)

[noreply] [BEAM-13657] Update Python version used by mypy. (#22804)


------------------------------------------
[...truncated 54.11 KB...]
Collecting soupsieve>1.2
  Using cached soupsieve-2.3.2.post1-py3-none-any.whl (37 kB)
Collecting six>=1.9.0
  Using cached six-1.16.0-py2.py3-none-any.whl (11 kB)
Installing collected packages: soupsieve, six, pyyaml, tenacity, beautifulsoup4
Successfully installed beautifulsoup4-4.11.1 pyyaml-5.4.1 six-1.16.0 soupsieve-2.3.2.post1 tenacity-5.1.5
Executing python <https://ci-beam.apache.org/job/beam_PostCommit_Java_DataflowV2/ws/src/sdks/java/container/license_scripts/pull_licenses_java.py> --license_index=<https://ci-beam.apache.org/job/beam_PostCommit_Java_DataflowV2/ws/src/sdks/java/container/build/reports/dependency-license/index.json>        --output_dir=<https://ci-beam.apache.org/job/beam_PostCommit_Java_DataflowV2/ws/src/sdks/java/container/build/target/java_third_party_licenses>        --dep_url_yaml=<https://ci-beam.apache.org/job/beam_PostCommit_Java_DataflowV2/ws/src/sdks/java/container/license_scripts/dep_urls_java.yaml>        --manual_license_path=<https://ci-beam.apache.org/job/beam_PostCommit_Java_DataflowV2/ws/src/sdks/java/container/license_scripts/manual_licenses>
INFO:root:Pulling license for 240 dependencies using 16 threads.
INFO:root:Replaced local file URL with file://<https://ci-beam.apache.org/job/beam_PostCommit_Java_DataflowV2/ws/src/sdks/java/container/license_scripts/manual_licenses/xz/COPYING> for xz-1.5
INFO:root:pull_licenses_java.py succeed. It took 7.186738 seconds with 16 threads.
Copying licenses from <https://ci-beam.apache.org/job/beam_PostCommit_Java_DataflowV2/ws/src/sdks/java/container/build/target/java_third_party_licenses> to <https://ci-beam.apache.org/job/beam_PostCommit_Java_DataflowV2/ws/src/sdks/java/container/build/target/third_party_licenses.>
Finished license_scripts.sh

> Task :sdks:java:container:goPrepare UP-TO-DATE
> Task :sdks:java:container:java8:copyJavaThirdPartyLicenses

> Task :sdks:java:container:goBuild
/home/jenkins/go/bin/go1.18.1 build -o ./build/target/linux_amd64/boot boot.go boot_test.go

> Task :sdks:java:container:java8:copySdkHarnessLauncher
Execution optimizations have been disabled for task ':sdks:java:container:java8:copySdkHarnessLauncher' to ensure correctness due to the following reasons:
  - Gradle detected a problem with the following location: '<https://ci-beam.apache.org/job/beam_PostCommit_Java_DataflowV2/ws/src/sdks/java/container/build/target'.> Reason: Task ':sdks:java:container:java8:copySdkHarnessLauncher' uses this output of task ':sdks:java:container:downloadCloudProfilerAgent' without declaring an explicit or implicit dependency. This can lead to incorrect results being produced, depending on what order the tasks are executed. Please refer to https://docs.gradle.org/7.4/userguide/validation_problems.html#implicit_dependency for more details about this problem.
  - Gradle detected a problem with the following location: '<https://ci-beam.apache.org/job/beam_PostCommit_Java_DataflowV2/ws/src/sdks/java/container/build/target'.> Reason: Task ':sdks:java:container:java8:copySdkHarnessLauncher' uses this output of task ':sdks:java:container:pullLicenses' without declaring an explicit or implicit dependency. This can lead to incorrect results being produced, depending on what order the tasks are executed. Please refer to https://docs.gradle.org/7.4/userguide/validation_problems.html#implicit_dependency for more details about this problem.

> Task :release:go-licenses:java:dockerRun
go: downloading github.com/golang/protobuf v1.5.2
go: downloading google.golang.org/grpc v1.47.0
go: downloading google.golang.org/protobuf v1.28.0
go: downloading google.golang.org/genproto v0.0.0-20220602131408-e326c6e8e9c8
go: downloading golang.org/x/net v0.0.0-20220607020251-c690dde0001d
go: downloading golang.org/x/sys v0.0.0-20220520151302-bc2c85ada10a
go: downloading golang.org/x/text v0.3.7
go: added github.com/apache/beam/sdks/v2 v2.40.0
go: added github.com/golang/protobuf v1.5.2
go: added golang.org/x/net v0.0.0-20220607020251-c690dde0001d
go: added golang.org/x/sys v0.0.0-20220520151302-bc2c85ada10a
go: added golang.org/x/text v0.3.7
go: added google.golang.org/genproto v0.0.0-20220602131408-e326c6e8e9c8
go: added google.golang.org/grpc v1.47.0
go: added google.golang.org/protobuf v1.28.0
+ go-licenses save github.com/apache/beam/sdks/v2/java/container --save_path=/output/licenses
W0822 15:58:49.163528      28 library.go:94] "golang.org/x/sys/unix" contains non-Go code that can't be inspected for further dependencies:
/go/pkg/mod/golang.org/x/sys@v0.0.0-20220520151302-bc2c85ada10a/unix/asm_linux_amd64.s
+ go-licenses csv github.com/apache/beam/sdks/v2/java/container
+ tee /output/licenses/list.csv
W0822 15:58:53.349608     182 library.go:94] "golang.org/x/sys/unix" contains non-Go code that can't be inspected for further dependencies:
/go/pkg/mod/golang.org/x/sys@v0.0.0-20220520151302-bc2c85ada10a/unix/asm_linux_amd64.s
github.com/apache/beam/sdks/v2/go/pkg/beam,https://github.com/apache/beam/blob/sdks/v2.40.0/sdks/go/README.md,Apache-2.0
github.com/apache/beam/sdks/v2/java/container,https://github.com/apache/beam/blob/sdks/v2.40.0/sdks/LICENSE,Apache-2.0
github.com/golang/protobuf,https://github.com/golang/protobuf/blob/v1.5.2/LICENSE,BSD-3-Clause
golang.org/x/net,https://cs.opensource.google/go/x/net/+/c690dde0:LICENSE,BSD-3-Clause
golang.org/x/sys,https://cs.opensource.google/go/x/sys/+/bc2c85ad:LICENSE,BSD-3-Clause
golang.org/x/text,https://cs.opensource.google/go/x/text/+/v0.3.7:LICENSE,BSD-3-Clause
google.golang.org/genproto/googleapis/rpc/status,https://github.com/googleapis/go-genproto/blob/e326c6e8e9c8/LICENSE,Apache-2.0
google.golang.org/grpc,https://github.com/grpc/grpc-go/blob/v1.47.0/LICENSE,Apache-2.0
google.golang.org/protobuf,https://github.com/protocolbuffers/protobuf-go/blob/v1.28.0/LICENSE,BSD-3-Clause
+ chmod -R a+w /output/licenses

> Task :release:go-licenses:java:createLicenses
> Task :sdks:java:container:java8:copyGolangLicenses
> Task :sdks:java:container:java8:dockerPrepare
> Task :sdks:java:container:java8:docker

> Task :runners:google-cloud-dataflow-java:buildAndPushDockerJavaContainer
WARNING: `gcloud docker` will not be supported for Docker client versions above 18.03.

As an alternative, use `gcloud auth configure-docker` to configure `docker` to
use `gcloud` as a credential helper, then use `docker` as you would for non-GCR
registries, e.g. `docker pull gcr.io/project-id/my-image`. Add
`--verbosity=error` to silence this warning: `gcloud docker
--verbosity=error -- pull gcr.io/project-id/my-image`.

See: https://cloud.google.com/container-registry/docs/support/deprecation-notices#gcloud-docker

The push refers to repository [us.gcr.io/apache-beam-testing/java-postcommit-it/java]
09b20a6e7855: Preparing
d34b096c6ec5: Preparing
bf087560dab0: Preparing
cacebca2caa6: Preparing
09adc4f0bca3: Preparing
cdbfaf391d9d: Preparing
a250d06c0c88: Preparing
c9de7385e4d9: Preparing
acb55fde1c16: Preparing
4d2832a3778f: Preparing
58d3b7b62cd0: Preparing
24735b0c4d6f: Preparing
258f4a38bbde: Preparing
84ee69ed671e: Preparing
bbd027496bcd: Preparing
6b5aaff44254: Preparing
53a0b163e995: Preparing
b626401ef603: Preparing
9b55156abf26: Preparing
293d5db30c9f: Preparing
03127cdb479b: Preparing
9c742cd6c7a5: Preparing
6b5aaff44254: Waiting
58d3b7b62cd0: Waiting
53a0b163e995: Waiting
24735b0c4d6f: Waiting
b626401ef603: Waiting
9b55156abf26: Waiting
258f4a38bbde: Waiting
a250d06c0c88: Waiting
9c742cd6c7a5: Waiting
293d5db30c9f: Waiting
03127cdb479b: Waiting
c9de7385e4d9: Waiting
bbd027496bcd: Waiting
acb55fde1c16: Waiting
4d2832a3778f: Waiting
cacebca2caa6: Pushed
bf087560dab0: Pushed
09adc4f0bca3: Pushed
d34b096c6ec5: Pushed
09b20a6e7855: Pushed
c9de7385e4d9: Pushed
a250d06c0c88: Pushed
4d2832a3778f: Pushed
acb55fde1c16: Pushed
24735b0c4d6f: Pushed
cdbfaf391d9d: Pushed
6b5aaff44254: Layer already exists
53a0b163e995: Layer already exists
58d3b7b62cd0: Pushed
b626401ef603: Layer already exists
9b55156abf26: Layer already exists
293d5db30c9f: Layer already exists
03127cdb479b: Layer already exists
9c742cd6c7a5: Layer already exists
84ee69ed671e: Pushed
bbd027496bcd: Pushed
258f4a38bbde: Pushed
20220822155739: digest: sha256:9797ac41e506465f512a1213dabc151eba152b43875896fdd60ed1fe28e36f44 size: 4935

> Task :runners:google-cloud-dataflow-java:coreSDKJavaRunnerV2IntegrationTest NO-SOURCE
> Task :runners:google-cloud-dataflow-java:examplesJavaRunnerV2IntegrationTest

***********************************************************
***********************************************************
**********************Set Up Pubsub************************
The Pub/Sub topic has been set up for this example: projects/apache-beam-testing/topics/testpipeline-jenkins-0822155930-fc00c061
The Pub/Sub subscription has been set up for this example: projects/apache-beam-testing/subscriptions/testpipeline-jenkins-0822155930-fc00c061
*************************Tear Down*************************
The Pub/Sub topic has been deleted: projects/apache-beam-testing/topics/testpipeline-jenkins-0822155930-fc00c061
The Pub/Sub subscription has been deleted: projects/apache-beam-testing/subscriptions/testpipeline-jenkins-0822155930-fc00c061
***********************************************************
***********************************************************

***********************************************************
***********************************************************
**********************Set Up Pubsub************************
The Pub/Sub topic has been set up for this example: projects/apache-beam-testing/topics/testpipeline-jenkins-0822155930-a35e8a35
The Pub/Sub subscription has been set up for this example: projects/apache-beam-testing/subscriptions/testpipeline-jenkins-0822155930-a35e8a35
*************************Tear Down*************************
The Pub/Sub topic has been deleted: projects/apache-beam-testing/topics/testpipeline-jenkins-0822155930-a35e8a35
The Pub/Sub subscription has been deleted: projects/apache-beam-testing/subscriptions/testpipeline-jenkins-0822155930-a35e8a35
***********************************************************
***********************************************************

> Task :runners:google-cloud-dataflow-java:googleCloudPlatformRunnerV2IntegrationTest

org.apache.beam.sdk.io.gcp.pubsub.PubsubReadIT > testReadPublicData FAILED
    java.lang.AssertionError at PubsubReadIT.java:57

org.apache.beam.sdk.io.gcp.spanner.changestreams.it.SpannerChangeStreamOrderedByTimestampAndTransactionIdIT > testTransactionBoundaries FAILED
    java.lang.RuntimeException at SpannerChangeStreamOrderedByTimestampAndTransactionIdIT.java:197

58 tests completed, 2 failed, 3 skipped

> Task :runners:google-cloud-dataflow-java:googleCloudPlatformRunnerV2IntegrationTest FAILED

> Task :runners:google-cloud-dataflow-java:cleanUpDockerJavaImages
Untagged: us.gcr.io/apache-beam-testing/java-postcommit-it/java:20220822155739
Untagged: us.gcr.io/apache-beam-testing/java-postcommit-it/java@sha256:9797ac41e506465f512a1213dabc151eba152b43875896fdd60ed1fe28e36f44
Deleted: sha256:e12987e38e21e369b782bf77b58c7b800e92839e381a7e77539a6bf9ebd6f5cc
Deleted: sha256:9c4faf5ff78a0750f2616198ddd0d6092d0a1ed44bddddd450d11470c75a739f
Deleted: sha256:140a6aed13910e045db57eb4333a05c5b06ded28e6393806488a89ce80e3ce95
Deleted: sha256:b52f6f75a35932ee191795b7a71bf6f6780c47875a4da6a11a106e9c2ead6c67
Deleted: sha256:99482780bca2012f6f6fc227ba0d3afe46d11cb8076ae04eccb186d45c4b678e
Deleted: sha256:65ea46825d3161452754fe3f512d3c98c1993f13bf6c1cdf9d121d71bdb45645
Deleted: sha256:1d8c0847625b94d6a00a9f9d2148b8b799f3ef2075178ccddc9c21b952a3af0d
Deleted: sha256:56c8999945e6d2fa6bfcab86463302def33dd2a30e9848d5ccb9600944c36093
Deleted: sha256:77a59fafcf6e6b6b06462c4df72620232566b879cf5e89f019f741002334a17e
Deleted: sha256:8d10abc983c83ed6dd32b6e1864194dc977b5e1bf49435774f82a5c3c1116226
Deleted: sha256:63211aadbeddc1a8b0dc3bae86b838c4f7113c822e45f0ee348be2b0c9dc13cf
Deleted: sha256:10d30ea4b67c6678a38e87de1d1fe53912ab3a729a5f53120454d389296532e7
Deleted: sha256:461d2acdb79c5a32027971a73241350d5cf219fda2a1469f90cab2abc77a7f88
Deleted: sha256:83dfad620eceb39f464ea60d22793a5930e22615d585959fea153332b13946b7
Deleted: sha256:e75b14999a426895d17cb4ad673ac24f060f27505f0f858c3673e8948117ee5a
Deleted: sha256:ba8c41c58900bf49881bdbfe7e04f641cf5d4a56b38ab0630c1e76d3c303b6ee
Deleted: sha256:144251a55799ff96d149788f46bc143cd96f12b77c49b7a2788d4db172847667
Deleted: sha256:3eb82b4c9b1703fd02b999173b26f24092ec8567cdd62322a2514bb80c73e5ed
Deleted: sha256:4964214ac5120bbd638eb50b6f8bc36731c16db76fd558c5400c8d8ee7543c97
Deleted: sha256:a5607c897110c8674c692fa52b6a682d1d08be20ee6b20b94d2521fe533c3bf1
Deleted: sha256:8d21d995c47f4dd1ddd22bcd357fc15e509040766442b7ba417ea1866effc404
Deleted: sha256:8c14a18797e1a6361868e77328e82551d06420234b8f85385e1a58206c25ee7c
Deleted: sha256:138ecbc5d8583844366265b79033254b06a0de2d92d4143d667e88c843bb7d13
Deleted: sha256:247bfb1dee148e0ae4a88f60ee5303449a006486d46370e63fe2025abe97df29
Deleted: sha256:805f7771da6bdc2f5da6a3caf2bede03387b6fecbf25a78da7fd0b07179d2745
Deleted: sha256:67700b471ba320278a9d485bc5f560b85cc95012670458c3598201c7eee10b48
Deleted: sha256:2b6acf2c8a731b8c725948f23f37dcf236fe5ad65fe91d4216f8ff571c8edde9
Deleted: sha256:7dc8921b0533b15bf65c8bd1cf678eeffa2603304109eab3babb39268255e48a
Deleted: sha256:748b3e1acb849cdd5752de86a9dff0c1950399c2ca6f20b3aafbe6a53a1ab009
Deleted: sha256:c0f071abda266bb318fd037e8128aafb3e602f10c24abb37c7a6a36188aa6fa7
Deleted: sha256:df9534f2ab17c233ae2e961a11b290cf502267cd5dc665d0332c9401c1b56bc3
Deleted: sha256:ad5470b328d8676699528bac53701a8cfb2740d604df102e616831393304c4c4
Deleted: sha256:56bedfa45670e81e830d45f75816a91b631bf0042af8d104a85e6eb67ba2532a
Deleted: sha256:83a08ee4e0c6dac01226ce2350af01661a94c4c07ba826cf1775fd7420d57ff8
Tag: [us.gcr.io/apache-beam-testing/java-postcommit-it/java:20220822155739]
- referencing digest: [us.gcr.io/apache-beam-testing/java-postcommit-it/java@sha256:9797ac41e506465f512a1213dabc151eba152b43875896fdd60ed1fe28e36f44]

Deleted [[us.gcr.io/apache-beam-testing/java-postcommit-it/java:20220822155739] (referencing [us.gcr.io/apache-beam-testing/java-postcommit-it/java@sha256:9797ac41e506465f512a1213dabc151eba152b43875896fdd60ed1fe28e36f44])].
Removing untagged image us.gcr.io/apache-beam-testing/java-postcommit-it/java@sha256:9797ac41e506465f512a1213dabc151eba152b43875896fdd60ed1fe28e36f44
Digests:
- us.gcr.io/apache-beam-testing/java-postcommit-it/java@sha256:9797ac41e506465f512a1213dabc151eba152b43875896fdd60ed1fe28e36f44
Deleted [us.gcr.io/apache-beam-testing/java-postcommit-it/java@sha256:9797ac41e506465f512a1213dabc151eba152b43875896fdd60ed1fe28e36f44].

FAILURE: Build failed with an exception.

* What went wrong:
Execution failed for task ':runners:google-cloud-dataflow-java:googleCloudPlatformRunnerV2IntegrationTest'.
> There were failing tests. See the report at: file://<https://ci-beam.apache.org/job/beam_PostCommit_Java_DataflowV2/ws/src/runners/google-cloud-dataflow-java/build/reports/tests/googleCloudPlatformRunnerV2IntegrationTest/index.html>

* Try:
> Run with --stacktrace option to get the stack trace.
> Run with --info or --debug option to get more log output.
> Run with --scan to get full insights.

* Get more help at https://help.gradle.org

Deprecated Gradle features were used in this build, making it incompatible with Gradle 8.0.

You can use '--warning-mode all' to show the individual deprecation warnings and determine if they come from your own scripts or plugins.

See https://docs.gradle.org/7.4/userguide/command_line_interface.html#sec:command_line_warnings

Execution optimizations have been disabled for 1 invalid unit(s) of work during this build to ensure correctness.
Please consult deprecation warnings for more details.

BUILD FAILED in 2h 18m 48s
141 actionable tasks: 90 executed, 47 from cache, 4 up-to-date

Publishing build scan...
https://gradle.com/s/x6vxfdpxgisrw

Build step 'Invoke Gradle script' changed build result to FAILURE
Build step 'Invoke Gradle script' marked build as failure

---------------------------------------------------------------------
To unsubscribe, e-mail: builds-unsubscribe@beam.apache.org
For additional commands, e-mail: builds-help@beam.apache.org


Jenkins build is back to normal : beam_PostCommit_Java_DataflowV2 #2017

Posted by Apache Jenkins Server <je...@builds.apache.org>.
See <https://ci-beam.apache.org/job/beam_PostCommit_Java_DataflowV2/2017/display/redirect?page=changes>


---------------------------------------------------------------------
To unsubscribe, e-mail: builds-unsubscribe@beam.apache.org
For additional commands, e-mail: builds-help@beam.apache.org