You are viewing a plain text version of this content. The canonical link for it is here.
Posted to builds@solr.apache.org by Policeman Jenkins Server <je...@thetaphi.de> on 2025/08/27 13:13:15 UTC
[JENKINS] Solr-main-Linux (64bit/hotspot/jdk-24) - Build # 28179 - Still Unstable!
Build: https://jenkins.thetaphi.de/job/Solr-main-Linux/28179/
Java: 64bit/hotspot/jdk-24 -XX:+UseCompressedOops -XX:+UseSerialGC
1 tests failed.
FAILED: org.apache.solr.cloud.TestDistribDocBasedVersion.testPullReplica
Error Message:
com.carrotsearch.randomizedtesting.UncaughtExceptionError: Captured an uncaught exception in thread: Thread[id=5219, name=updateExecutor-2759-thread-1, state=RUNNABLE, group=TGRP-TestDistribDocBasedVersion]
Stack Trace:
com.carrotsearch.randomizedtesting.UncaughtExceptionError: Captured an uncaught exception in thread: Thread[id=5219, name=updateExecutor-2759-thread-1, state=RUNNABLE, group=TGRP-TestDistribDocBasedVersion]
at __randomizedtesting.SeedInfo.seed([E2BF450F619E309D:AA03D2C1C44C19E4]:0)
Caused by: org.apache.solr.common.SolrException: java.util.concurrent.ExecutionException: org.apache.solr.common.cloud.ZooKeeperException:
at __randomizedtesting.SeedInfo.seed([E2BF450F619E309D]:0)
at app//org.apache.solr.update.DefaultSolrCoreState$2.run(DefaultSolrCoreState.java:356)
at app//com.codahale.metrics.InstrumentedExecutorService$InstrumentedRunnable.run(InstrumentedExecutorService.java:212)
at app//org.apache.solr.common.util.ExecutorUtil$MDCAwareThreadPoolExecutor.lambda$execute$0(ExecutorUtil.java:381)
at java.base@24/java.util.concurrent.ThreadPoolExecutor.runWorker(ThreadPoolExecutor.java:1095)
at java.base@24/java.util.concurrent.ThreadPoolExecutor$Worker.run(ThreadPoolExecutor.java:619)
at java.base@24/java.lang.Thread.run(Thread.java:1447)
Caused by: java.util.concurrent.ExecutionException: org.apache.solr.common.cloud.ZooKeeperException:
at java.base/java.util.concurrent.FutureTask.report(FutureTask.java:124)
at java.base/java.util.concurrent.FutureTask.get(FutureTask.java:193)
at org.apache.solr.update.DefaultSolrCoreState$2.run(DefaultSolrCoreState.java:351)
... 5 more
Caused by: org.apache.solr.common.cloud.ZooKeeperException:
at app//org.apache.solr.cloud.RecoveryStrategy.run(RecoveryStrategy.java:330)
at app//com.codahale.metrics.InstrumentedExecutorService$InstrumentedRunnable.run(InstrumentedExecutorService.java:212)
at java.base@24/java.util.concurrent.Executors$RunnableAdapter.call(Executors.java:545)
at java.base@24/java.util.concurrent.FutureTask.run(FutureTask.java:328)
... 4 more
Caused by: org.apache.solr.common.SolrException: SolrCore not found:collection1_shard1_replica_p5 in [control_collection_shard1_replica_n1]
at app//org.apache.solr.cloud.ReplicateFromLeader.startReplication(ReplicateFromLeader.java:75)
at app//org.apache.solr.cloud.ZkController.startReplicationFromLeader(ZkController.java:1538)
at app//org.apache.solr.cloud.RecoveryStrategy.doReplicateOnlyRecovery(RecoveryStrategy.java:431)
at app//org.apache.solr.cloud.RecoveryStrategy.doRecovery(RecoveryStrategy.java:349)
at app//org.apache.solr.cloud.RecoveryStrategy.run(RecoveryStrategy.java:323)
... 7 more
[JENKINS] Solr-main-Linux (64bit/hotspot/jdk-24) - Build # 28181 - Still Unstable!
Posted by Policeman Jenkins Server <je...@thetaphi.de>.
Build: https://jenkins.thetaphi.de/job/Solr-main-Linux/28181/
Java: 64bit/hotspot/jdk-24 -XX:+UseCompressedOops -XX:+UseParallelGC
2 tests failed.
FAILED: org.apache.solr.cloud.TestDistribDocBasedVersion.testPullReplica
Error Message:
com.carrotsearch.randomizedtesting.UncaughtExceptionError: Captured an uncaught exception in thread: Thread[id=5601, name=updateExecutor-2942-thread-1, state=RUNNABLE, group=TGRP-TestDistribDocBasedVersion]
Stack Trace:
com.carrotsearch.randomizedtesting.UncaughtExceptionError: Captured an uncaught exception in thread: Thread[id=5601, name=updateExecutor-2942-thread-1, state=RUNNABLE, group=TGRP-TestDistribDocBasedVersion]
at __randomizedtesting.SeedInfo.seed([E0B77AD522D6B0C1:A80BED1B870499B8]:0)
Caused by: org.apache.solr.common.SolrException: java.util.concurrent.ExecutionException: org.apache.solr.common.cloud.ZooKeeperException:
at __randomizedtesting.SeedInfo.seed([E0B77AD522D6B0C1]:0)
at app//org.apache.solr.update.DefaultSolrCoreState$2.run(DefaultSolrCoreState.java:356)
at app//com.codahale.metrics.InstrumentedExecutorService$InstrumentedRunnable.run(InstrumentedExecutorService.java:212)
at app//org.apache.solr.common.util.ExecutorUtil$MDCAwareThreadPoolExecutor.lambda$execute$0(ExecutorUtil.java:381)
at java.base@24/java.util.concurrent.ThreadPoolExecutor.runWorker(ThreadPoolExecutor.java:1095)
at java.base@24/java.util.concurrent.ThreadPoolExecutor$Worker.run(ThreadPoolExecutor.java:619)
at java.base@24/java.lang.Thread.run(Thread.java:1447)
Caused by: java.util.concurrent.ExecutionException: org.apache.solr.common.cloud.ZooKeeperException:
at java.base/java.util.concurrent.FutureTask.report(FutureTask.java:124)
at java.base/java.util.concurrent.FutureTask.get(FutureTask.java:193)
at org.apache.solr.update.DefaultSolrCoreState$2.run(DefaultSolrCoreState.java:351)
... 5 more
Caused by: org.apache.solr.common.cloud.ZooKeeperException:
at app//org.apache.solr.cloud.RecoveryStrategy.run(RecoveryStrategy.java:330)
at app//com.codahale.metrics.InstrumentedExecutorService$InstrumentedRunnable.run(InstrumentedExecutorService.java:212)
at java.base@24/java.util.concurrent.Executors$RunnableAdapter.call(Executors.java:545)
at java.base@24/java.util.concurrent.FutureTask.run(FutureTask.java:328)
... 4 more
Caused by: org.apache.solr.common.SolrException: SolrCore not found:collection1_shard1_replica_p5 in [control_collection_shard1_replica_n1]
at app//org.apache.solr.cloud.ReplicateFromLeader.startReplication(ReplicateFromLeader.java:75)
at app//org.apache.solr.cloud.ZkController.startReplicationFromLeader(ZkController.java:1538)
at app//org.apache.solr.cloud.RecoveryStrategy.doReplicateOnlyRecovery(RecoveryStrategy.java:431)
at app//org.apache.solr.cloud.RecoveryStrategy.doRecovery(RecoveryStrategy.java:349)
at app//org.apache.solr.cloud.RecoveryStrategy.run(RecoveryStrategy.java:323)
... 7 more
FAILED: org.apache.solr.handler.component.DistributedDebugComponentTest.testTolerantSearch
Error Message:
org.apache.solr.client.solrj.SolrClient$RemoteSolrException: Error from server at http://127.0.0.1:38273/solr: org.apache.solr.client.solrj.SolrServerException: Connection refused
Stack Trace:
org.apache.solr.client.solrj.SolrClient$RemoteSolrException: Error from server at http://127.0.0.1:38273/solr: org.apache.solr.client.solrj.SolrServerException: Connection refused
at __randomizedtesting.SeedInfo.seed([E0B77AD522D6B0C1:264EB10BE1146D94]:0)
at app//org.apache.solr.client.solrj.impl.HttpSolrClient.executeMethod(HttpSolrClient.java:708)
at app//org.apache.solr.client.solrj.impl.HttpSolrClient.request(HttpSolrClient.java:250)
at app//org.apache.solr.client.solrj.impl.HttpSolrClient.request(HttpSolrClient.java:229)
at app//org.apache.solr.client.solrj.SolrRequest.process(SolrRequest.java:285)
at app//org.apache.solr.client.solrj.SolrClient.query(SolrClient.java:926)
at app//org.apache.solr.client.solrj.SolrClient.query(SolrClient.java:939)
at app//org.apache.solr.handler.component.DistributedDebugComponentTest.testTolerantSearch(DistributedDebugComponentTest.java:424)
at java.base@24/jdk.internal.reflect.DirectMethodHandleAccessor.invoke(DirectMethodHandleAccessor.java:104)
at java.base@24/java.lang.reflect.Method.invoke(Method.java:565)
at app//com.carrotsearch.randomizedtesting.RandomizedRunner.invoke(RandomizedRunner.java:1758)
at app//com.carrotsearch.randomizedtesting.RandomizedRunner$8.evaluate(RandomizedRunner.java:946)
at app//com.carrotsearch.randomizedtesting.RandomizedRunner$9.evaluate(RandomizedRunner.java:982)
at app//com.carrotsearch.randomizedtesting.RandomizedRunner$10.evaluate(RandomizedRunner.java:996)
at app//com.carrotsearch.randomizedtesting.rules.SystemPropertiesRestoreRule$1.evaluate(SystemPropertiesRestoreRule.java:80)
at app//org.junit.rules.RunRules.evaluate(RunRules.java:20)
at app//org.apache.lucene.tests.util.TestRuleSetupTeardownChained$1.evaluate(TestRuleSetupTeardownChained.java:48)
at app//org.apache.lucene.tests.util.AbstractBeforeAfterRule$1.evaluate(AbstractBeforeAfterRule.java:43)
at app//org.apache.lucene.tests.util.TestRuleThreadAndTestName$1.evaluate(TestRuleThreadAndTestName.java:45)
at app//org.apache.lucene.tests.util.TestRuleIgnoreAfterMaxFailures$1.evaluate(TestRuleIgnoreAfterMaxFailures.java:60)
at app//org.apache.lucene.tests.util.TestRuleMarkFailure$1.evaluate(TestRuleMarkFailure.java:44)
at app//org.junit.rules.RunRules.evaluate(RunRules.java:20)
at app//com.carrotsearch.randomizedtesting.rules.StatementAdapter.evaluate(StatementAdapter.java:36)
at app//com.carrotsearch.randomizedtesting.ThreadLeakControl$StatementRunner.run(ThreadLeakControl.java:390)
at app//com.carrotsearch.randomizedtesting.ThreadLeakControl.forkTimeoutingTask(ThreadLeakControl.java:843)
at app//com.carrotsearch.randomizedtesting.ThreadLeakControl$3.evaluate(ThreadLeakControl.java:490)
at app//com.carrotsearch.randomizedtesting.RandomizedRunner.runSingleTest(RandomizedRunner.java:955)
at app//com.carrotsearch.randomizedtesting.RandomizedRunner$5.evaluate(RandomizedRunner.java:840)
at app//com.carrotsearch.randomizedtesting.RandomizedRunner$6.evaluate(RandomizedRunner.java:891)
at app//com.carrotsearch.randomizedtesting.RandomizedRunner$7.evaluate(RandomizedRunner.java:902)
at app//org.junit.rules.ExternalResource$1.evaluate(ExternalResource.java:54)
at app//com.carrotsearch.randomizedtesting.rules.StatementAdapter.evaluate(StatementAdapter.java:36)
at app//com.carrotsearch.randomizedtesting.rules.StatementAdapter.evaluate(StatementAdapter.java:36)
at app//org.apache.lucene.tests.util.AbstractBeforeAfterRule$1.evaluate(AbstractBeforeAfterRule.java:43)
at app//com.carrotsearch.randomizedtesting.rules.SystemPropertiesRestoreRule$1.evaluate(SystemPropertiesRestoreRule.java:80)
at app//org.junit.rules.RunRules.evaluate(RunRules.java:20)
at app//org.apache.lucene.tests.util.AbstractBeforeAfterRule$1.evaluate(AbstractBeforeAfterRule.java:43)
at app//com.carrotsearch.randomizedtesting.rules.StatementAdapter.evaluate(StatementAdapter.java:36)
at app//org.apache.lucene.tests.util.TestRuleStoreClassName$1.evaluate(TestRuleStoreClassName.java:38)
at app//com.carrotsearch.randomizedtesting.rules.NoShadowingOrOverridesOnMethodsRule$1.evaluate(NoShadowingOrOverridesOnMethodsRule.java:40)
at app//com.carrotsearch.randomizedtesting.rules.NoShadowingOrOverridesOnMethodsRule$1.evaluate(NoShadowingOrOverridesOnMethodsRule.java:40)
at app//com.carrotsearch.randomizedtesting.rules.StatementAdapter.evaluate(StatementAdapter.java:36)
at app//com.carrotsearch.randomizedtesting.rules.StatementAdapter.evaluate(StatementAdapter.java:36)
at app//org.apache.lucene.tests.util.TestRuleAssertionsRequired$1.evaluate(TestRuleAssertionsRequired.java:53)
at app//org.apache.lucene.tests.util.AbstractBeforeAfterRule$1.evaluate(AbstractBeforeAfterRule.java:43)
at app//org.apache.lucene.tests.util.TestRuleMarkFailure$1.evaluate(TestRuleMarkFailure.java:44)
at app//org.apache.lucene.tests.util.TestRuleIgnoreAfterMaxFailures$1.evaluate(TestRuleIgnoreAfterMaxFailures.java:60)
at app//org.apache.lucene.tests.util.TestRuleIgnoreTestSuites$1.evaluate(TestRuleIgnoreTestSuites.java:47)
at app//org.junit.rules.RunRules.evaluate(RunRules.java:20)
at app//com.carrotsearch.randomizedtesting.rules.StatementAdapter.evaluate(StatementAdapter.java:36)
at app//com.carrotsearch.randomizedtesting.ThreadLeakControl$StatementRunner.run(ThreadLeakControl.java:390)
at app//com.carrotsearch.randomizedtesting.ThreadLeakControl.lambda$forkTimeoutingTask$0(ThreadLeakControl.java:850)
at java.base@24/java.lang.Thread.run(Thread.java:1447)
[JENKINS] Solr-main-Linux (64bit/hotspot/jdk-24) - Build # 28180 - Still Unstable!
Posted by Policeman Jenkins Server <je...@thetaphi.de>.
Build: https://jenkins.thetaphi.de/job/Solr-main-Linux/28180/
Java: 64bit/hotspot/jdk-24 -XX:-UseCompressedOops -XX:+UseG1GC
1 tests failed.
FAILED: org.apache.solr.cloud.TestDistribDocBasedVersion.testPullReplica
Error Message:
com.carrotsearch.randomizedtesting.UncaughtExceptionError: Captured an uncaught exception in thread: Thread[id=5756, name=updateExecutor-2795-thread-1, state=RUNNABLE, group=TGRP-TestDistribDocBasedVersion]
Stack Trace:
com.carrotsearch.randomizedtesting.UncaughtExceptionError: Captured an uncaught exception in thread: Thread[id=5756, name=updateExecutor-2795-thread-1, state=RUNNABLE, group=TGRP-TestDistribDocBasedVersion]
at __randomizedtesting.SeedInfo.seed([351C6E6C45AAFFDB:7DA0F9A2E078D6A2]:0)
Caused by: org.apache.solr.common.SolrException: java.util.concurrent.ExecutionException: org.apache.solr.common.cloud.ZooKeeperException:
at __randomizedtesting.SeedInfo.seed([351C6E6C45AAFFDB]:0)
at app//org.apache.solr.update.DefaultSolrCoreState$2.run(DefaultSolrCoreState.java:356)
at app//com.codahale.metrics.InstrumentedExecutorService$InstrumentedRunnable.run(InstrumentedExecutorService.java:212)
at app//org.apache.solr.common.util.ExecutorUtil$MDCAwareThreadPoolExecutor.lambda$execute$0(ExecutorUtil.java:381)
at java.base@24/java.util.concurrent.ThreadPoolExecutor.runWorker(ThreadPoolExecutor.java:1095)
at java.base@24/java.util.concurrent.ThreadPoolExecutor$Worker.run(ThreadPoolExecutor.java:619)
at java.base@24/java.lang.Thread.run(Thread.java:1447)
Caused by: java.util.concurrent.ExecutionException: org.apache.solr.common.cloud.ZooKeeperException:
at java.base/java.util.concurrent.FutureTask.report(FutureTask.java:124)
at java.base/java.util.concurrent.FutureTask.get(FutureTask.java:193)
at org.apache.solr.update.DefaultSolrCoreState$2.run(DefaultSolrCoreState.java:351)
... 5 more
Caused by: org.apache.solr.common.cloud.ZooKeeperException:
at app//org.apache.solr.cloud.RecoveryStrategy.run(RecoveryStrategy.java:330)
at app//com.codahale.metrics.InstrumentedExecutorService$InstrumentedRunnable.run(InstrumentedExecutorService.java:212)
at java.base@24/java.util.concurrent.Executors$RunnableAdapter.call(Executors.java:545)
at java.base@24/java.util.concurrent.FutureTask.run(FutureTask.java:328)
... 4 more
Caused by: org.apache.solr.common.SolrException: SolrCore not found:collection1_shard1_replica_p5 in [control_collection_shard1_replica_n1]
at app//org.apache.solr.cloud.ReplicateFromLeader.startReplication(ReplicateFromLeader.java:75)
at app//org.apache.solr.cloud.ZkController.startReplicationFromLeader(ZkController.java:1538)
at app//org.apache.solr.cloud.RecoveryStrategy.doReplicateOnlyRecovery(RecoveryStrategy.java:431)
at app//org.apache.solr.cloud.RecoveryStrategy.doRecovery(RecoveryStrategy.java:349)
at app//org.apache.solr.cloud.RecoveryStrategy.run(RecoveryStrategy.java:323)
... 7 more