You are viewing a plain text version of this content. The canonical link for it is here.
Posted to builds@mesos.apache.org by Apache Jenkins Server <je...@builds.apache.org> on 2015/07/20 20:02:06 UTC

Build failed in Jenkins: mesos-reviewbot #7156

See <https://builds.apache.org/job/mesos-reviewbot/7156/>

------------------------------------------
[URLTrigger] A change within the response URL invocation (log)
Building remotely on H11 (Ubuntu ubuntu) in workspace <https://builds.apache.org/job/mesos-reviewbot/ws/>
 > git rev-parse --is-inside-work-tree # timeout=10
Fetching changes from the remote Git repository
 > git config remote.origin.url https://git-wip-us.apache.org/repos/asf/mesos.git # timeout=10
Fetching upstream changes from https://git-wip-us.apache.org/repos/asf/mesos.git
 > git --version # timeout=10
 > git fetch --tags --progress https://git-wip-us.apache.org/repos/asf/mesos.git +refs/heads/*:refs/remotes/origin/*
 > git rev-parse origin/master^{commit} # timeout=10
Checking out Revision 49cd532a7217466e61fae98504842c007a278060 (origin/master)
 > git config core.sparsecheckout # timeout=10
 > git checkout -f 49cd532a7217466e61fae98504842c007a278060
 > git rev-list 49cd532a7217466e61fae98504842c007a278060 # timeout=10
 > git tag -a -f -m Jenkins Build #7156 jenkins-mesos-reviewbot-7156 # timeout=10
[mesos-reviewbot] $ /bin/bash -xe /tmp/hudson7346793753877635458.sh
+ export JAVA_HOME=/home/jenkins/tools/java/jdk1.6.0_20-64
+ JAVA_HOME=/home/jenkins/tools/java/jdk1.6.0_20-64
+ export PATH=/home/jenkins/tools/java/jdk1.6.0_20-64/bin:/home/jenkins/tools/java/latest1.6/bin:/home/jenkins/tools/java/latest1.6/bin:/usr/local/sbin:/usr/local/bin:/usr/sbin:/usr/bin:/sbin:/bin:/usr/games:/usr/local/games
+ PATH=/home/jenkins/tools/java/jdk1.6.0_20-64/bin:/home/jenkins/tools/java/latest1.6/bin:/home/jenkins/tools/java/latest1.6/bin:/usr/local/sbin:/usr/local/bin:/usr/sbin:/usr/bin:/sbin:/bin:/usr/games:/usr/local/games
+ export M2_HOME=/home/jenkins/tools/maven/latest
+ M2_HOME=/home/jenkins/tools/maven/latest
+ export PATH=/home/jenkins/tools/maven/latest/bin:/home/jenkins/tools/java/jdk1.6.0_20-64/bin:/home/jenkins/tools/java/latest1.6/bin:/home/jenkins/tools/java/latest1.6/bin:/usr/local/sbin:/usr/local/bin:/usr/sbin:/usr/bin:/sbin:/bin:/usr/games:/usr/local/games
+ PATH=/home/jenkins/tools/maven/latest/bin:/home/jenkins/tools/java/jdk1.6.0_20-64/bin:/home/jenkins/tools/java/latest1.6/bin:/home/jenkins/tools/java/latest1.6/bin:/usr/local/sbin:/usr/local/bin:/usr/sbin:/usr/bin:/sbin:/bin:/usr/games:/usr/local/games
+ date
Mon Jul 20 18:01:26 UTC 2015
+ chmod -R +w 3rdparty bin bootstrap CHANGELOG configure.ac Dockerfile docs Doxyfile include LICENSE m4 Makefile.am mesos.pc.in mpi NOTICE README.md src support
+ git clean -fdx
+ git reset --hard HEAD
HEAD is now at 49cd532 Fix cgroup tests to not verify order.
+ ./support/mesos-style.py
Checking 645 files using filter --filter=-,+build/class,+build/deprecated,+build/endif_comment,+readability/todo,+readability/namespace,+runtime/vlog,+whitespace/blank_line,+whitespace/comma,+whitespace/end_of_line,+whitespace/ending_newline,+whitespace/forcolon,+whitespace/indent,+whitespace/line_length,+whitespace/operators,+whitespace/semicolon,+whitespace/tab,+whitespace/todo
src/tests/mesos.cpp:735:  Tab found; better to use spaces  [whitespace/tab] [1]
src/tests/mesos.cpp:736:  Tab found; better to use spaces  [whitespace/tab] [1]
src/tests/mesos.cpp:737:  Tab found; better to use spaces  [whitespace/tab] [1]
src/tests/mesos.cpp:738:  Tab found; better to use spaces  [whitespace/tab] [1]
src/tests/mesos.cpp:739:  Tab found; better to use spaces  [whitespace/tab] [1]
src/tests/mesos.cpp:740:  Tab found; better to use spaces  [whitespace/tab] [1]
src/tests/mesos.cpp:741:  Tab found; better to use spaces  [whitespace/tab] [1]
src/tests/mesos.cpp:743:  Tab found; better to use spaces  [whitespace/tab] [1]
src/tests/mesos.cpp:744:  Tab found; better to use spaces  [whitespace/tab] [1]
src/tests/mesos.cpp:745:  Tab found; better to use spaces  [whitespace/tab] [1]
src/tests/mesos.cpp:746:  Tab found; better to use spaces  [whitespace/tab] [1]
src/tests/mesos.cpp:747:  Lines should be <= 80 characters long  [whitespace/line_length] [2]
src/tests/mesos.cpp:751:  Lines should be <= 80 characters long  [whitespace/line_length] [2]
src/tests/mesos.cpp:754:  Lines should be <= 80 characters long  [whitespace/line_length] [2]
src/tests/mesos.cpp:755:  Tab found; better to use spaces  [whitespace/tab] [1]
src/tests/mesos.cpp:756:  Tab found; better to use spaces  [whitespace/tab] [1]
Total errors found: 16
Build step 'Execute shell' marked build as failure

Jenkins build is back to normal : mesos-reviewbot #7169

Posted by Apache Jenkins Server <je...@builds.apache.org>.
See <https://builds.apache.org/job/mesos-reviewbot/7169/>


Build failed in Jenkins: mesos-reviewbot #7168

Posted by Apache Jenkins Server <je...@builds.apache.org>.
See <https://builds.apache.org/job/mesos-reviewbot/7168/>

------------------------------------------
[...truncated 6133 lines...]
rm -rf messages/.libs messages/_libs
rm -rf module/.libs module/_libs
rm -rf sched/.libs sched/_libs
rm -rf scheduler/.libs scheduler/_libs
rm -rf slave/.libs slave/_libs
rm -rf slave/containerizer/.libs slave/containerizer/_libs
rm -rf slave/containerizer/isolators/cgroups/.libs slave/containerizer/isolators/cgroups/_libs
rm -rf slave/containerizer/isolators/filesystem/.libs slave/containerizer/isolators/filesystem/_libs
rm -rf slave/containerizer/isolators/namespaces/.libs slave/containerizer/isolators/namespaces/_libs
rm -rf slave/containerizer/isolators/network/.libs slave/containerizer/isolators/network/_libs
rm -rf slave/containerizer/isolators/posix/.libs slave/containerizer/isolators/posix/_libs
rm -rf slave/containerizer/mesos/.libs slave/containerizer/mesos/_libs
rm -rf slave/resource_estimators/.libs slave/resource_estimators/_libs
rm -rf state/.libs state/_libs
rm -f tests/common/*.o
rm -f usage/*.o
rm -f usage/*.lo
rm -rf usage/.libs usage/_libs
rm -f watcher/*.o
rm -rf watcher/.libs watcher/_libs
rm -f watcher/*.lo
rm -rf zookeeper/.libs zookeeper/_libs
rm -f zookeeper/*.o
rm -f zookeeper/*.lo
rm -rf ./.deps authentication/.deps authentication/cram_md5/.deps authorizer/.deps cli/.deps common/.deps containerizer/.deps docker/.deps examples/.deps exec/.deps executor/.deps fetcher/.deps files/.deps health-check/.deps hook/.deps java/jni/.deps jvm/.deps jvm/org/apache/.deps launcher/.deps linux/.deps linux/routing/.deps linux/routing/diagnosis/.deps linux/routing/filter/.deps linux/routing/link/.deps linux/routing/queueing/.deps local/.deps log/.deps log/tool/.deps logging/.deps master/.deps master/allocator/.deps master/allocator/sorter/drf/.deps messages/.deps module/.deps sched/.deps scheduler/.deps slave/.deps slave/containerizer/.deps slave/containerizer/isolators/cgroups/.deps slave/containerizer/isolators/filesystem/.deps slave/containerizer/isolators/namespaces/.deps slave/containerizer/isolators/network/.deps slave/containerizer/isolators/posix/.deps slave/containerizer/mesos/.deps slave/resource_estimators/.deps state/.deps tests/.deps tests/common/.deps usage/.deps watcher/.deps zookeeper/.deps
rm -f Makefile
make[2]: Leaving directory `<https://builds.apache.org/job/mesos-reviewbot/ws/mesos-0.24.0/_build/src'>
rm -f config.status config.cache config.log configure.lineno config.status.lineno
rm -f Makefile
make[1]: Leaving directory `<https://builds.apache.org/job/mesos-reviewbot/ws/mesos-0.24.0/_build'>
if test -d "mesos-0.24.0"; then find "mesos-0.24.0" -type d ! -perm -200 -exec chmod u+w {} ';' && rm -rf "mesos-0.24.0" || { sleep 5 && rm -rf "mesos-0.24.0"; }; else :; fi
==============================================
mesos-0.24.0 archives ready for distribution: 
mesos-0.24.0.tar.gz
==============================================

real	14m21.789s
user	82m20.907s
sys	6m35.831s
+ chmod -R +w 3rdparty aclocal.m4 ar-lib autom4te.cache bin bootstrap CHANGELOG compile config.guess config.log config.lt config.status config.sub configure configure.ac depcomp Dockerfile docs Doxyfile include install-sh libtool LICENSE ltmain.sh m4 Makefile Makefile.am Makefile.in mesos-0.24.0.tar.gz mesos.pc mesos.pc.in missing mpi NOTICE README.md src support
+ git clean -fdx
Removing .clang-format
Removing .gitignore
Removing .libs/
Removing .reviewboardrc
Removing 3rdparty/Makefile
Removing 3rdparty/Makefile.in
Removing 3rdparty/libprocess/.deps/
Removing 3rdparty/libprocess/3rdparty/.deps/
Removing 3rdparty/libprocess/3rdparty/Makefile
Removing 3rdparty/libprocess/3rdparty/Makefile.in
Removing 3rdparty/libprocess/3rdparty/gmock_sources.cc
Removing 3rdparty/libprocess/3rdparty/stout/Makefile
Removing 3rdparty/libprocess/3rdparty/stout/Makefile.in
Removing 3rdparty/libprocess/3rdparty/stout/aclocal.m4
Removing 3rdparty/libprocess/3rdparty/stout/autom4te.cache/
Removing 3rdparty/libprocess/3rdparty/stout/config.log
Removing 3rdparty/libprocess/3rdparty/stout/config.status
Removing 3rdparty/libprocess/3rdparty/stout/configure
Removing 3rdparty/libprocess/3rdparty/stout/include/Makefile
Removing 3rdparty/libprocess/3rdparty/stout/include/Makefile.in
Removing 3rdparty/libprocess/3rdparty/stout/missing
Removing 3rdparty/libprocess/Makefile
Removing 3rdparty/libprocess/Makefile.in
Removing 3rdparty/libprocess/aclocal.m4
Removing 3rdparty/libprocess/ar-lib
Removing 3rdparty/libprocess/autom4te.cache/
Removing 3rdparty/libprocess/compile
Removing 3rdparty/libprocess/config.guess
Removing 3rdparty/libprocess/config.log
Removing 3rdparty/libprocess/config.lt
Removing 3rdparty/libprocess/config.status
Removing 3rdparty/libprocess/config.sub
Removing 3rdparty/libprocess/configure
Removing 3rdparty/libprocess/depcomp
Removing 3rdparty/libprocess/include/Makefile
Removing 3rdparty/libprocess/include/Makefile.in
Removing 3rdparty/libprocess/libtool
Removing 3rdparty/libprocess/ltmain.sh
Removing 3rdparty/libprocess/m4/libtool.m4
Removing 3rdparty/libprocess/m4/ltoptions.m4
Removing 3rdparty/libprocess/m4/ltsugar.m4
Removing 3rdparty/libprocess/m4/ltversion.m4
Removing 3rdparty/libprocess/m4/lt~obsolete.m4
Removing 3rdparty/libprocess/missing
Removing Makefile
Removing Makefile.in
Removing aclocal.m4
Removing ar-lib
Removing autom4te.cache/
Removing bin/gdb-mesos-local.sh
Removing bin/gdb-mesos-master.sh
Removing bin/gdb-mesos-slave.sh
Removing bin/gdb-mesos-tests.sh
Removing bin/lldb-mesos-local.sh
Removing bin/lldb-mesos-master.sh
Removing bin/lldb-mesos-slave.sh
Removing bin/lldb-mesos-tests.sh
Removing bin/mesos-local-flags.sh
Removing bin/mesos-local.sh
Removing bin/mesos-master-flags.sh
Removing bin/mesos-master.sh
Removing bin/mesos-slave-flags.sh
Removing bin/mesos-slave.sh
Removing bin/mesos-tests-flags.sh
Removing bin/mesos-tests.sh
Removing bin/mesos.sh
Removing bin/valgrind-mesos-local.sh
Removing bin/valgrind-mesos-master.sh
Removing bin/valgrind-mesos-slave.sh
Removing bin/valgrind-mesos-tests.sh
Removing compile
Removing config.guess
Removing config.log
Removing config.lt
Removing config.status
Removing config.sub
Removing configure
Removing depcomp
Removing include/mesos/version.hpp
Removing install-sh
Removing libtool
Removing ltmain.sh
Removing m4/libtool.m4
Removing m4/ltoptions.m4
Removing m4/ltsugar.m4
Removing m4/ltversion.m4
Removing m4/lt~obsolete.m4
Removing mesos-0.24.0.tar.gz
Removing mesos.pc
Removing missing
Removing mpi/mpiexec-mesos
Removing src/.deps/
Removing src/Makefile
Removing src/Makefile.in
Removing src/authentication/.deps/
Removing src/authentication/cram_md5/.deps/
Removing src/authorizer/.deps/
Removing src/cli/.deps/
Removing src/common/.deps/
Removing src/containerizer/
Removing src/deploy/mesos-daemon.sh
Removing src/deploy/mesos-start-cluster.sh
Removing src/deploy/mesos-start-masters.sh
Removing src/deploy/mesos-start-slaves.sh
Removing src/deploy/mesos-stop-cluster.sh
Removing src/deploy/mesos-stop-masters.sh
Removing src/deploy/mesos-stop-slaves.sh
Removing src/docker/.deps/
Removing src/examples/.deps/
Removing src/examples/java/test-exception-framework
Removing src/examples/java/test-executor
Removing src/examples/java/test-framework
Removing src/examples/java/test-log
Removing src/examples/java/test-multiple-executors-framework
Removing src/examples/python/test-containerizer
Removing src/examples/python/test-executor
Removing src/examples/python/test-framework
Removing src/exec/.deps/
Removing src/executor/
Removing src/fetcher/
Removing src/files/.deps/
Removing src/health-check/.deps/
Removing src/hook/.deps/
Removing src/java/generated/org/apache/mesos/MesosNativeLibrary.java
Removing src/java/jni/.deps/
Removing src/java/mesos.pom
Removing src/jvm/.deps/
Removing src/jvm/org/apache/.deps/
Removing src/launcher/.deps/
Removing src/linux/.deps/
Removing src/linux/routing/.deps/
Removing src/linux/routing/diagnosis/.deps/
Removing src/linux/routing/filter/.deps/
Removing src/linux/routing/link/.deps/
Removing src/linux/routing/queueing/.deps/
Removing src/local/.deps/
Removing src/log/.deps/
Removing src/log/tool/.deps/
Removing src/logging/.deps/
Removing src/master/.deps/
Removing src/master/allocator/.deps/
Removing src/master/allocator/sorter/drf/.deps/
Removing src/messages/.deps/
Removing src/module/.deps/
Removing src/python/interface/setup.py
Removing src/python/native/ext_modules.py
Removing src/python/native/setup.py
Removing src/python/setup.py
Removing src/sched/.deps/
Removing src/scheduler/.deps/
Removing src/slave/.deps/
Removing src/slave/containerizer/.deps/
Removing src/slave/containerizer/isolators/cgroups/.deps/
Removing src/slave/containerizer/isolators/filesystem/.deps/
Removing src/slave/containerizer/isolators/namespaces/.deps/
Removing src/slave/containerizer/isolators/network/.deps/
Removing src/slave/containerizer/isolators/posix/.deps/
Removing src/slave/containerizer/mesos/.deps/
Removing src/slave/resource_estimators/.deps/
Removing src/state/.deps/
Removing src/tests/.deps/
Removing src/tests/common/.deps/
Removing src/usage/.deps/
Removing src/watcher/.deps/
Removing src/zookeeper/.deps/
+ git reset --hard HEAD
HEAD is now at a7de651 Replaced tabs with spaces and fixed line length.
+ date
Tue Jul 21 02:04:33 UTC 2015
+ set +x
git rev-parse HEAD
Checking if review: 36574 needs verification
Skipping blocking review 36574
Checking if review: 36575 needs verification
Skipping blocking review 36575
Checking if review: 36596 needs verification
Skipping blocking review 36596
Checking if review: 36585 needs verification
Latest diff timestamp: 2015-07-19 00:32:55
Latest review timestamp: 2015-07-19 00:57:58
Checking if review: 36580 needs verification
Skipping blocking review 36580
Checking if review: 36603 needs verification
Latest diff timestamp: 2015-07-19 17:39:17
Traceback (most recent call last):
  File "./support/verify_reviews.py", line 193, in <module>
    needs_verification(review_request):
  File "./support/verify_reviews.py", line 171, in needs_verification
    changes = api(changes_url)
  File "./support/verify_reviews.py", line 61, in api
    return json.loads(urllib2.urlopen(url, data=data).read())
  File "/usr/lib/python2.7/urllib2.py", line 127, in urlopen
    return _opener.open(url, data, timeout)
  File "/usr/lib/python2.7/urllib2.py", line 410, in open
    response = meth(req, response)
  File "/usr/lib/python2.7/urllib2.py", line 523, in http_response
    'http', request, response, code, msg, hdrs)
  File "/usr/lib/python2.7/urllib2.py", line 448, in error
    return self._call_chain(*args)
  File "/usr/lib/python2.7/urllib2.py", line 382, in _call_chain
    result = func(*args)
  File "/usr/lib/python2.7/urllib2.py", line 531, in http_error_default
    raise HTTPError(req.get_full_url(), code, msg, hdrs, fp)
urllib2.HTTPError: HTTP Error 500: INTERNAL SERVER ERROR
git clean -fd
git reset --hard a7de6513cd2ff431a541e93c01858a0330584015

Build step 'Execute shell' marked build as failure

Build failed in Jenkins: mesos-reviewbot #7167

Posted by Apache Jenkins Server <je...@builds.apache.org>.
See <https://builds.apache.org/job/mesos-reviewbot/7167/>

------------------------------------------
[...truncated 6133 lines...]
rm -f usage/*.lo
rm -f watcher/*.o
rm -f watcher/*.lo
rm -f zookeeper/*.o
rm -f zookeeper/*.lo
rm -rf master/allocator/.libs master/allocator/_libs
rm -rf master/allocator/sorter/drf/.libs master/allocator/sorter/drf/_libs
rm -rf messages/.libs messages/_libs
rm -rf module/.libs module/_libs
rm -rf sched/.libs sched/_libs
rm -rf scheduler/.libs scheduler/_libs
rm -rf slave/.libs slave/_libs
rm -rf slave/containerizer/.libs slave/containerizer/_libs
rm -rf slave/containerizer/isolators/cgroups/.libs slave/containerizer/isolators/cgroups/_libs
rm -rf slave/containerizer/isolators/filesystem/.libs slave/containerizer/isolators/filesystem/_libs
rm -rf slave/containerizer/isolators/namespaces/.libs slave/containerizer/isolators/namespaces/_libs
rm -rf slave/containerizer/isolators/network/.libs slave/containerizer/isolators/network/_libs
rm -rf slave/containerizer/isolators/posix/.libs slave/containerizer/isolators/posix/_libs
rm -rf slave/containerizer/mesos/.libs slave/containerizer/mesos/_libs
rm -rf slave/resource_estimators/.libs slave/resource_estimators/_libs
rm -rf state/.libs state/_libs
rm -rf usage/.libs usage/_libs
rm -rf watcher/.libs watcher/_libs
rm -rf zookeeper/.libs zookeeper/_libs
rm -rf ./.deps authentication/.deps authentication/cram_md5/.deps authorizer/.deps cli/.deps common/.deps containerizer/.deps docker/.deps examples/.deps exec/.deps executor/.deps fetcher/.deps files/.deps health-check/.deps hook/.deps java/jni/.deps jvm/.deps jvm/org/apache/.deps launcher/.deps linux/.deps linux/routing/.deps linux/routing/diagnosis/.deps linux/routing/filter/.deps linux/routing/link/.deps linux/routing/queueing/.deps local/.deps log/.deps log/tool/.deps logging/.deps master/.deps master/allocator/.deps master/allocator/sorter/drf/.deps messages/.deps module/.deps sched/.deps scheduler/.deps slave/.deps slave/containerizer/.deps slave/containerizer/isolators/cgroups/.deps slave/containerizer/isolators/filesystem/.deps slave/containerizer/isolators/namespaces/.deps slave/containerizer/isolators/network/.deps slave/containerizer/isolators/posix/.deps slave/containerizer/mesos/.deps slave/resource_estimators/.deps state/.deps tests/.deps tests/common/.deps usage/.deps watcher/.deps zookeeper/.deps
rm -f Makefile
make[2]: Leaving directory `<https://builds.apache.org/job/mesos-reviewbot/ws/mesos-0.24.0/_build/src'>
rm -f config.status config.cache config.log configure.lineno config.status.lineno
rm -f Makefile
make[1]: Leaving directory `<https://builds.apache.org/job/mesos-reviewbot/ws/mesos-0.24.0/_build'>
if test -d "mesos-0.24.0"; then find "mesos-0.24.0" -type d ! -perm -200 -exec chmod u+w {} ';' && rm -rf "mesos-0.24.0" || { sleep 5 && rm -rf "mesos-0.24.0"; }; else :; fi
==============================================
mesos-0.24.0 archives ready for distribution: 
mesos-0.24.0.tar.gz
==============================================

real	14m57.662s
user	80m47.037s
sys	6m59.322s
+ chmod -R +w 3rdparty aclocal.m4 ar-lib autom4te.cache bin bootstrap CHANGELOG compile config.guess config.log config.lt config.status config.sub configure configure.ac depcomp Dockerfile docs Doxyfile include install-sh libtool LICENSE ltmain.sh m4 Makefile Makefile.am Makefile.in mesos-0.24.0.tar.gz mesos.pc mesos.pc.in missing mpi NOTICE README.md src support
+ git clean -fdx
Removing .clang-format
Removing .gitignore
Removing .libs/
Removing .reviewboardrc
Removing 3rdparty/Makefile
Removing 3rdparty/Makefile.in
Removing 3rdparty/libprocess/.deps/
Removing 3rdparty/libprocess/3rdparty/.deps/
Removing 3rdparty/libprocess/3rdparty/Makefile
Removing 3rdparty/libprocess/3rdparty/Makefile.in
Removing 3rdparty/libprocess/3rdparty/gmock_sources.cc
Removing 3rdparty/libprocess/3rdparty/stout/Makefile
Removing 3rdparty/libprocess/3rdparty/stout/Makefile.in
Removing 3rdparty/libprocess/3rdparty/stout/aclocal.m4
Removing 3rdparty/libprocess/3rdparty/stout/autom4te.cache/
Removing 3rdparty/libprocess/3rdparty/stout/config.log
Removing 3rdparty/libprocess/3rdparty/stout/config.status
Removing 3rdparty/libprocess/3rdparty/stout/configure
Removing 3rdparty/libprocess/3rdparty/stout/include/Makefile
Removing 3rdparty/libprocess/3rdparty/stout/include/Makefile.in
Removing 3rdparty/libprocess/3rdparty/stout/missing
Removing 3rdparty/libprocess/Makefile
Removing 3rdparty/libprocess/Makefile.in
Removing 3rdparty/libprocess/aclocal.m4
Removing 3rdparty/libprocess/ar-lib
Removing 3rdparty/libprocess/autom4te.cache/
Removing 3rdparty/libprocess/compile
Removing 3rdparty/libprocess/config.guess
Removing 3rdparty/libprocess/config.log
Removing 3rdparty/libprocess/config.lt
Removing 3rdparty/libprocess/config.status
Removing 3rdparty/libprocess/config.sub
Removing 3rdparty/libprocess/configure
Removing 3rdparty/libprocess/depcomp
Removing 3rdparty/libprocess/include/Makefile
Removing 3rdparty/libprocess/include/Makefile.in
Removing 3rdparty/libprocess/libtool
Removing 3rdparty/libprocess/ltmain.sh
Removing 3rdparty/libprocess/m4/libtool.m4
Removing 3rdparty/libprocess/m4/ltoptions.m4
Removing 3rdparty/libprocess/m4/ltsugar.m4
Removing 3rdparty/libprocess/m4/ltversion.m4
Removing 3rdparty/libprocess/m4/lt~obsolete.m4
Removing 3rdparty/libprocess/missing
Removing Makefile
Removing Makefile.in
Removing aclocal.m4
Removing ar-lib
Removing autom4te.cache/
Removing bin/gdb-mesos-local.sh
Removing bin/gdb-mesos-master.sh
Removing bin/gdb-mesos-slave.sh
Removing bin/gdb-mesos-tests.sh
Removing bin/lldb-mesos-local.sh
Removing bin/lldb-mesos-master.sh
Removing bin/lldb-mesos-slave.sh
Removing bin/lldb-mesos-tests.sh
Removing bin/mesos-local-flags.sh
Removing bin/mesos-local.sh
Removing bin/mesos-master-flags.sh
Removing bin/mesos-master.sh
Removing bin/mesos-slave-flags.sh
Removing bin/mesos-slave.sh
Removing bin/mesos-tests-flags.sh
Removing bin/mesos-tests.sh
Removing bin/mesos.sh
Removing bin/valgrind-mesos-local.sh
Removing bin/valgrind-mesos-master.sh
Removing bin/valgrind-mesos-slave.sh
Removing bin/valgrind-mesos-tests.sh
Removing compile
Removing config.guess
Removing config.log
Removing config.lt
Removing config.status
Removing config.sub
Removing configure
Removing depcomp
Removing include/mesos/version.hpp
Removing install-sh
Removing libtool
Removing ltmain.sh
Removing m4/libtool.m4
Removing m4/ltoptions.m4
Removing m4/ltsugar.m4
Removing m4/ltversion.m4
Removing m4/lt~obsolete.m4
Removing mesos-0.24.0.tar.gz
Removing mesos.pc
Removing missing
Removing mpi/mpiexec-mesos
Removing src/.deps/
Removing src/Makefile
Removing src/Makefile.in
Removing src/authentication/.deps/
Removing src/authentication/cram_md5/.deps/
Removing src/authorizer/.deps/
Removing src/cli/.deps/
Removing src/common/.deps/
Removing src/containerizer/
Removing src/deploy/mesos-daemon.sh
Removing src/deploy/mesos-start-cluster.sh
Removing src/deploy/mesos-start-masters.sh
Removing src/deploy/mesos-start-slaves.sh
Removing src/deploy/mesos-stop-cluster.sh
Removing src/deploy/mesos-stop-masters.sh
Removing src/deploy/mesos-stop-slaves.sh
Removing src/docker/.deps/
Removing src/examples/.deps/
Removing src/examples/java/test-exception-framework
Removing src/examples/java/test-executor
Removing src/examples/java/test-framework
Removing src/examples/java/test-log
Removing src/examples/java/test-multiple-executors-framework
Removing src/examples/python/test-containerizer
Removing src/examples/python/test-executor
Removing src/examples/python/test-framework
Removing src/exec/.deps/
Removing src/executor/
Removing src/fetcher/
Removing src/files/.deps/
Removing src/health-check/.deps/
Removing src/hook/.deps/
Removing src/java/generated/org/apache/mesos/MesosNativeLibrary.java
Removing src/java/jni/.deps/
Removing src/java/mesos.pom
Removing src/jvm/.deps/
Removing src/jvm/org/apache/.deps/
Removing src/launcher/.deps/
Removing src/linux/.deps/
Removing src/linux/routing/.deps/
Removing src/linux/routing/diagnosis/.deps/
Removing src/linux/routing/filter/.deps/
Removing src/linux/routing/link/.deps/
Removing src/linux/routing/queueing/.deps/
Removing src/local/.deps/
Removing src/log/.deps/
Removing src/log/tool/.deps/
Removing src/logging/.deps/
Removing src/master/.deps/
Removing src/master/allocator/.deps/
Removing src/master/allocator/sorter/drf/.deps/
Removing src/messages/.deps/
Removing src/module/.deps/
Removing src/python/interface/setup.py
Removing src/python/native/ext_modules.py
Removing src/python/native/setup.py
Removing src/python/setup.py
Removing src/sched/.deps/
Removing src/scheduler/.deps/
Removing src/slave/.deps/
Removing src/slave/containerizer/.deps/
Removing src/slave/containerizer/isolators/cgroups/.deps/
Removing src/slave/containerizer/isolators/filesystem/.deps/
Removing src/slave/containerizer/isolators/namespaces/.deps/
Removing src/slave/containerizer/isolators/network/.deps/
Removing src/slave/containerizer/isolators/posix/.deps/
Removing src/slave/containerizer/mesos/.deps/
Removing src/slave/resource_estimators/.deps/
Removing src/state/.deps/
Removing src/tests/.deps/
Removing src/tests/common/.deps/
Removing src/usage/.deps/
Removing src/watcher/.deps/
Removing src/zookeeper/.deps/
+ git reset --hard HEAD
HEAD is now at a7de651 Replaced tabs with spaces and fixed line length.
+ date
Tue Jul 21 01:40:00 UTC 2015
+ set +x
git rev-parse HEAD
Checking if review: 36574 needs verification
Skipping blocking review 36574
Checking if review: 36575 needs verification
Skipping blocking review 36575
Checking if review: 36596 needs verification
Skipping blocking review 36596
Checking if review: 36585 needs verification
Latest diff timestamp: 2015-07-19 00:32:55
Latest review timestamp: 2015-07-19 00:57:58
Checking if review: 36580 needs verification
Skipping blocking review 36580
Checking if review: 36603 needs verification
Latest diff timestamp: 2015-07-19 17:39:17
Traceback (most recent call last):
  File "./support/verify_reviews.py", line 193, in <module>
    needs_verification(review_request):
  File "./support/verify_reviews.py", line 171, in needs_verification
    changes = api(changes_url)
  File "./support/verify_reviews.py", line 61, in api
    return json.loads(urllib2.urlopen(url, data=data).read())
  File "/usr/lib/python2.7/urllib2.py", line 127, in urlopen
    return _opener.open(url, data, timeout)
  File "/usr/lib/python2.7/urllib2.py", line 410, in open
    response = meth(req, response)
  File "/usr/lib/python2.7/urllib2.py", line 523, in http_response
    'http', request, response, code, msg, hdrs)
  File "/usr/lib/python2.7/urllib2.py", line 448, in error
    return self._call_chain(*args)
  File "/usr/lib/python2.7/urllib2.py", line 382, in _call_chain
    result = func(*args)
  File "/usr/lib/python2.7/urllib2.py", line 531, in http_error_default
    raise HTTPError(req.get_full_url(), code, msg, hdrs, fp)
urllib2.HTTPError: HTTP Error 500: INTERNAL SERVER ERROR
git clean -fd
git reset --hard a7de6513cd2ff431a541e93c01858a0330584015

Build step 'Execute shell' marked build as failure

Build failed in Jenkins: mesos-reviewbot #7166

Posted by Apache Jenkins Server <je...@builds.apache.org>.
See <https://builds.apache.org/job/mesos-reviewbot/7166/>

------------------------------------------
[...truncated 6132 lines...]
rm -rf messages/.libs messages/_libs
rm -rf module/.libs module/_libs
rm -rf sched/.libs sched/_libs
rm -rf scheduler/.libs scheduler/_libs
rm -rf slave/.libs slave/_libs
rm -rf slave/containerizer/.libs slave/containerizer/_libs
rm -rf slave/containerizer/isolators/cgroups/.libs slave/containerizer/isolators/cgroups/_libs
rm -f tests/common/*.o
rm -rf slave/containerizer/isolators/filesystem/.libs slave/containerizer/isolators/filesystem/_libs
rm -f usage/*.o
rm -rf slave/containerizer/isolators/namespaces/.libs slave/containerizer/isolators/namespaces/_libs
rm -f usage/*.lo
rm -rf slave/containerizer/isolators/network/.libs slave/containerizer/isolators/network/_libs
rm -f watcher/*.o
rm -rf slave/containerizer/isolators/posix/.libs slave/containerizer/isolators/posix/_libs
rm -f watcher/*.lo
rm -f zookeeper/*.o
rm -rf slave/containerizer/mesos/.libs slave/containerizer/mesos/_libs
rm -f zookeeper/*.lo
rm -rf slave/resource_estimators/.libs slave/resource_estimators/_libs
rm -rf state/.libs state/_libs
rm -rf usage/.libs usage/_libs
rm -rf watcher/.libs watcher/_libs
rm -rf zookeeper/.libs zookeeper/_libs
rm -rf ./.deps authentication/.deps authentication/cram_md5/.deps authorizer/.deps cli/.deps common/.deps containerizer/.deps docker/.deps examples/.deps exec/.deps executor/.deps fetcher/.deps files/.deps health-check/.deps hook/.deps java/jni/.deps jvm/.deps jvm/org/apache/.deps launcher/.deps linux/.deps linux/routing/.deps linux/routing/diagnosis/.deps linux/routing/filter/.deps linux/routing/link/.deps linux/routing/queueing/.deps local/.deps log/.deps log/tool/.deps logging/.deps master/.deps master/allocator/.deps master/allocator/sorter/drf/.deps messages/.deps module/.deps sched/.deps scheduler/.deps slave/.deps slave/containerizer/.deps slave/containerizer/isolators/cgroups/.deps slave/containerizer/isolators/filesystem/.deps slave/containerizer/isolators/namespaces/.deps slave/containerizer/isolators/network/.deps slave/containerizer/isolators/posix/.deps slave/containerizer/mesos/.deps slave/resource_estimators/.deps state/.deps tests/.deps tests/common/.deps usage/.deps watcher/.deps zookeeper/.deps
rm -f Makefile
make[2]: Leaving directory `<https://builds.apache.org/job/mesos-reviewbot/ws/mesos-0.24.0/_build/src'>
rm -f config.status config.cache config.log configure.lineno config.status.lineno
rm -f Makefile
make[1]: Leaving directory `<https://builds.apache.org/job/mesos-reviewbot/ws/mesos-0.24.0/_build'>
if test -d "mesos-0.24.0"; then find "mesos-0.24.0" -type d ! -perm -200 -exec chmod u+w {} ';' && rm -rf "mesos-0.24.0" || { sleep 5 && rm -rf "mesos-0.24.0"; }; else :; fi
==============================================
mesos-0.24.0 archives ready for distribution: 
mesos-0.24.0.tar.gz
==============================================

real	14m37.637s
user	83m54.573s
sys	6m1.811s
+ chmod -R +w 3rdparty aclocal.m4 ar-lib autom4te.cache bin bootstrap CHANGELOG compile config.guess config.log config.lt config.status config.sub configure configure.ac depcomp Dockerfile docs Doxyfile include install-sh libtool LICENSE ltmain.sh m4 Makefile Makefile.am Makefile.in mesos-0.24.0.tar.gz mesos.pc mesos.pc.in missing mpi NOTICE README.md src support
+ git clean -fdx
Removing .clang-format
Removing .gitignore
Removing .libs/
Removing .reviewboardrc
Removing 3rdparty/Makefile
Removing 3rdparty/Makefile.in
Removing 3rdparty/libprocess/.deps/
Removing 3rdparty/libprocess/3rdparty/.deps/
Removing 3rdparty/libprocess/3rdparty/Makefile
Removing 3rdparty/libprocess/3rdparty/Makefile.in
Removing 3rdparty/libprocess/3rdparty/gmock_sources.cc
Removing 3rdparty/libprocess/3rdparty/stout/Makefile
Removing 3rdparty/libprocess/3rdparty/stout/Makefile.in
Removing 3rdparty/libprocess/3rdparty/stout/aclocal.m4
Removing 3rdparty/libprocess/3rdparty/stout/autom4te.cache/
Removing 3rdparty/libprocess/3rdparty/stout/config.log
Removing 3rdparty/libprocess/3rdparty/stout/config.status
Removing 3rdparty/libprocess/3rdparty/stout/configure
Removing 3rdparty/libprocess/3rdparty/stout/include/Makefile
Removing 3rdparty/libprocess/3rdparty/stout/include/Makefile.in
Removing 3rdparty/libprocess/3rdparty/stout/missing
Removing 3rdparty/libprocess/Makefile
Removing 3rdparty/libprocess/Makefile.in
Removing 3rdparty/libprocess/aclocal.m4
Removing 3rdparty/libprocess/ar-lib
Removing 3rdparty/libprocess/autom4te.cache/
Removing 3rdparty/libprocess/compile
Removing 3rdparty/libprocess/config.guess
Removing 3rdparty/libprocess/config.log
Removing 3rdparty/libprocess/config.lt
Removing 3rdparty/libprocess/config.status
Removing 3rdparty/libprocess/config.sub
Removing 3rdparty/libprocess/configure
Removing 3rdparty/libprocess/depcomp
Removing 3rdparty/libprocess/include/Makefile
Removing 3rdparty/libprocess/include/Makefile.in
Removing 3rdparty/libprocess/libtool
Removing 3rdparty/libprocess/ltmain.sh
Removing 3rdparty/libprocess/m4/libtool.m4
Removing 3rdparty/libprocess/m4/ltoptions.m4
Removing 3rdparty/libprocess/m4/ltsugar.m4
Removing 3rdparty/libprocess/m4/ltversion.m4
Removing 3rdparty/libprocess/m4/lt~obsolete.m4
Removing 3rdparty/libprocess/missing
Removing Makefile
Removing Makefile.in
Removing aclocal.m4
Removing ar-lib
Removing autom4te.cache/
Removing bin/gdb-mesos-local.sh
Removing bin/gdb-mesos-master.sh
Removing bin/gdb-mesos-slave.sh
Removing bin/gdb-mesos-tests.sh
Removing bin/lldb-mesos-local.sh
Removing bin/lldb-mesos-master.sh
Removing bin/lldb-mesos-slave.sh
Removing bin/lldb-mesos-tests.sh
Removing bin/mesos-local-flags.sh
Removing bin/mesos-local.sh
Removing bin/mesos-master-flags.sh
Removing bin/mesos-master.sh
Removing bin/mesos-slave-flags.sh
Removing bin/mesos-slave.sh
Removing bin/mesos-tests-flags.sh
Removing bin/mesos-tests.sh
Removing bin/mesos.sh
Removing bin/valgrind-mesos-local.sh
Removing bin/valgrind-mesos-master.sh
Removing bin/valgrind-mesos-slave.sh
Removing bin/valgrind-mesos-tests.sh
Removing compile
Removing config.guess
Removing config.log
Removing config.lt
Removing config.status
Removing config.sub
Removing configure
Removing depcomp
Removing include/mesos/version.hpp
Removing install-sh
Removing libtool
Removing ltmain.sh
Removing m4/libtool.m4
Removing m4/ltoptions.m4
Removing m4/ltsugar.m4
Removing m4/ltversion.m4
Removing m4/lt~obsolete.m4
Removing mesos-0.24.0.tar.gz
Removing mesos.pc
Removing missing
Removing mpi/mpiexec-mesos
Removing src/.deps/
Removing src/Makefile
Removing src/Makefile.in
Removing src/authentication/.deps/
Removing src/authentication/cram_md5/.deps/
Removing src/authorizer/.deps/
Removing src/cli/.deps/
Removing src/common/.deps/
Removing src/containerizer/
Removing src/deploy/mesos-daemon.sh
Removing src/deploy/mesos-start-cluster.sh
Removing src/deploy/mesos-start-masters.sh
Removing src/deploy/mesos-start-slaves.sh
Removing src/deploy/mesos-stop-cluster.sh
Removing src/deploy/mesos-stop-masters.sh
Removing src/deploy/mesos-stop-slaves.sh
Removing src/docker/.deps/
Removing src/examples/.deps/
Removing src/examples/java/test-exception-framework
Removing src/examples/java/test-executor
Removing src/examples/java/test-framework
Removing src/examples/java/test-log
Removing src/examples/java/test-multiple-executors-framework
Removing src/examples/python/test-containerizer
Removing src/examples/python/test-executor
Removing src/examples/python/test-framework
Removing src/exec/.deps/
Removing src/executor/
Removing src/fetcher/
Removing src/files/.deps/
Removing src/health-check/.deps/
Removing src/hook/.deps/
Removing src/java/generated/org/apache/mesos/MesosNativeLibrary.java
Removing src/java/jni/.deps/
Removing src/java/mesos.pom
Removing src/jvm/.deps/
Removing src/jvm/org/apache/.deps/
Removing src/launcher/.deps/
Removing src/linux/.deps/
Removing src/linux/routing/.deps/
Removing src/linux/routing/diagnosis/.deps/
Removing src/linux/routing/filter/.deps/
Removing src/linux/routing/link/.deps/
Removing src/linux/routing/queueing/.deps/
Removing src/local/.deps/
Removing src/log/.deps/
Removing src/log/tool/.deps/
Removing src/logging/.deps/
Removing src/master/.deps/
Removing src/master/allocator/.deps/
Removing src/master/allocator/sorter/drf/.deps/
Removing src/messages/.deps/
Removing src/module/.deps/
Removing src/python/interface/setup.py
Removing src/python/native/ext_modules.py
Removing src/python/native/setup.py
Removing src/python/setup.py
Removing src/sched/.deps/
Removing src/scheduler/.deps/
Removing src/slave/.deps/
Removing src/slave/containerizer/.deps/
Removing src/slave/containerizer/isolators/cgroups/.deps/
Removing src/slave/containerizer/isolators/filesystem/.deps/
Removing src/slave/containerizer/isolators/namespaces/.deps/
Removing src/slave/containerizer/isolators/network/.deps/
Removing src/slave/containerizer/isolators/posix/.deps/
Removing src/slave/containerizer/mesos/.deps/
Removing src/slave/resource_estimators/.deps/
Removing src/state/.deps/
Removing src/tests/.deps/
Removing src/tests/common/.deps/
Removing src/usage/.deps/
Removing src/watcher/.deps/
Removing src/zookeeper/.deps/
+ git reset --hard HEAD
HEAD is now at a7de651 Replaced tabs with spaces and fixed line length.
+ date
Tue Jul 21 01:17:56 UTC 2015
+ set +x
git rev-parse HEAD
Checking if review: 36574 needs verification
Skipping blocking review 36574
Checking if review: 36575 needs verification
Skipping blocking review 36575
Checking if review: 36596 needs verification
Skipping blocking review 36596
Checking if review: 36585 needs verification
Latest diff timestamp: 2015-07-19 00:32:55
Latest review timestamp: 2015-07-19 00:57:58
Checking if review: 36580 needs verification
Skipping blocking review 36580
Checking if review: 36603 needs verification
Latest diff timestamp: 2015-07-19 17:39:17
Traceback (most recent call last):
  File "./support/verify_reviews.py", line 193, in <module>
    needs_verification(review_request):
  File "./support/verify_reviews.py", line 171, in needs_verification
    changes = api(changes_url)
  File "./support/verify_reviews.py", line 61, in api
    return json.loads(urllib2.urlopen(url, data=data).read())
  File "/usr/lib/python2.7/urllib2.py", line 127, in urlopen
    return _opener.open(url, data, timeout)
  File "/usr/lib/python2.7/urllib2.py", line 410, in open
    response = meth(req, response)
  File "/usr/lib/python2.7/urllib2.py", line 523, in http_response
    'http', request, response, code, msg, hdrs)
  File "/usr/lib/python2.7/urllib2.py", line 448, in error
    return self._call_chain(*args)
  File "/usr/lib/python2.7/urllib2.py", line 382, in _call_chain
    result = func(*args)
  File "/usr/lib/python2.7/urllib2.py", line 531, in http_error_default
    raise HTTPError(req.get_full_url(), code, msg, hdrs, fp)
urllib2.HTTPError: HTTP Error 500: INTERNAL SERVER ERROR
git clean -fd
git reset --hard a7de6513cd2ff431a541e93c01858a0330584015

Build step 'Execute shell' marked build as failure

Build failed in Jenkins: mesos-reviewbot #7165

Posted by Apache Jenkins Server <je...@builds.apache.org>.
See <https://builds.apache.org/job/mesos-reviewbot/7165/>

------------------------------------------
[...truncated 6139 lines...]
rm -f usage/*.o
rm -f usage/*.lo
rm -f watcher/*.o
rm -rf slave/containerizer/.libs slave/containerizer/_libs
rm -f watcher/*.lo
rm -f zookeeper/*.o
rm -f zookeeper/*.lo
rm -rf slave/containerizer/isolators/cgroups/.libs slave/containerizer/isolators/cgroups/_libs
rm -rf slave/containerizer/isolators/filesystem/.libs slave/containerizer/isolators/filesystem/_libs
rm -rf slave/containerizer/isolators/namespaces/.libs slave/containerizer/isolators/namespaces/_libs
rm -rf slave/containerizer/isolators/network/.libs slave/containerizer/isolators/network/_libs
rm -rf slave/containerizer/isolators/posix/.libs slave/containerizer/isolators/posix/_libs
rm -rf slave/containerizer/mesos/.libs slave/containerizer/mesos/_libs
rm -rf slave/resource_estimators/.libs slave/resource_estimators/_libs
rm -rf state/.libs state/_libs
rm -rf usage/.libs usage/_libs
rm -rf watcher/.libs watcher/_libs
rm -rf zookeeper/.libs zookeeper/_libs
rm -rf ./.deps authentication/.deps authentication/cram_md5/.deps authorizer/.deps cli/.deps common/.deps containerizer/.deps docker/.deps examples/.deps exec/.deps executor/.deps fetcher/.deps files/.deps health-check/.deps hook/.deps java/jni/.deps jvm/.deps jvm/org/apache/.deps launcher/.deps linux/.deps linux/routing/.deps linux/routing/diagnosis/.deps linux/routing/filter/.deps linux/routing/link/.deps linux/routing/queueing/.deps local/.deps log/.deps log/tool/.deps logging/.deps master/.deps master/allocator/.deps master/allocator/sorter/drf/.deps messages/.deps module/.deps sched/.deps scheduler/.deps slave/.deps slave/containerizer/.deps slave/containerizer/isolators/cgroups/.deps slave/containerizer/isolators/filesystem/.deps slave/containerizer/isolators/namespaces/.deps slave/containerizer/isolators/network/.deps slave/containerizer/isolators/posix/.deps slave/containerizer/mesos/.deps slave/resource_estimators/.deps state/.deps tests/.deps tests/common/.deps usage/.deps watcher/.deps zookeeper/.deps
rm -f Makefile
make[2]: Leaving directory `<https://builds.apache.org/job/mesos-reviewbot/ws/mesos-0.24.0/_build/src'>
rm -f config.status config.cache config.log configure.lineno config.status.lineno
rm -f Makefile
make[1]: Leaving directory `<https://builds.apache.org/job/mesos-reviewbot/ws/mesos-0.24.0/_build'>
if test -d "mesos-0.24.0"; then find "mesos-0.24.0" -type d ! -perm -200 -exec chmod u+w {} ';' && rm -rf "mesos-0.24.0" || { sleep 5 && rm -rf "mesos-0.24.0"; }; else :; fi
==============================================
mesos-0.24.0 archives ready for distribution: 
mesos-0.24.0.tar.gz
==============================================

real	19m12.999s
user	92m1.826s
sys	9m11.934s
+ chmod -R +w 3rdparty aclocal.m4 ar-lib autom4te.cache bin bootstrap CHANGELOG compile config.guess config.log config.lt config.status config.sub configure configure.ac depcomp Dockerfile docs Doxyfile include install-sh libtool LICENSE ltmain.sh m4 Makefile Makefile.am Makefile.in mesos-0.24.0.tar.gz mesos.pc mesos.pc.in missing mpi NOTICE README.md src support
+ git clean -fdx
Removing .clang-format
Removing .gitignore
Removing .libs/
Removing .reviewboardrc
Removing 3rdparty/Makefile
Removing 3rdparty/Makefile.in
Removing 3rdparty/libprocess/.deps/
Removing 3rdparty/libprocess/3rdparty/.deps/
Removing 3rdparty/libprocess/3rdparty/Makefile
Removing 3rdparty/libprocess/3rdparty/Makefile.in
Removing 3rdparty/libprocess/3rdparty/gmock_sources.cc
Removing 3rdparty/libprocess/3rdparty/stout/Makefile
Removing 3rdparty/libprocess/3rdparty/stout/Makefile.in
Removing 3rdparty/libprocess/3rdparty/stout/aclocal.m4
Removing 3rdparty/libprocess/3rdparty/stout/autom4te.cache/
Removing 3rdparty/libprocess/3rdparty/stout/config.log
Removing 3rdparty/libprocess/3rdparty/stout/config.status
Removing 3rdparty/libprocess/3rdparty/stout/configure
Removing 3rdparty/libprocess/3rdparty/stout/include/Makefile
Removing 3rdparty/libprocess/3rdparty/stout/include/Makefile.in
Removing 3rdparty/libprocess/3rdparty/stout/missing
Removing 3rdparty/libprocess/Makefile
Removing 3rdparty/libprocess/Makefile.in
Removing 3rdparty/libprocess/aclocal.m4
Removing 3rdparty/libprocess/ar-lib
Removing 3rdparty/libprocess/autom4te.cache/
Removing 3rdparty/libprocess/compile
Removing 3rdparty/libprocess/config.guess
Removing 3rdparty/libprocess/config.log
Removing 3rdparty/libprocess/config.lt
Removing 3rdparty/libprocess/config.status
Removing 3rdparty/libprocess/config.sub
Removing 3rdparty/libprocess/configure
Removing 3rdparty/libprocess/depcomp
Removing 3rdparty/libprocess/include/Makefile
Removing 3rdparty/libprocess/include/Makefile.in
Removing 3rdparty/libprocess/libtool
Removing 3rdparty/libprocess/ltmain.sh
Removing 3rdparty/libprocess/m4/libtool.m4
Removing 3rdparty/libprocess/m4/ltoptions.m4
Removing 3rdparty/libprocess/m4/ltsugar.m4
Removing 3rdparty/libprocess/m4/ltversion.m4
Removing 3rdparty/libprocess/m4/lt~obsolete.m4
Removing 3rdparty/libprocess/missing
Removing Makefile
Removing Makefile.in
Removing aclocal.m4
Removing ar-lib
Removing autom4te.cache/
Removing bin/gdb-mesos-local.sh
Removing bin/gdb-mesos-master.sh
Removing bin/gdb-mesos-slave.sh
Removing bin/gdb-mesos-tests.sh
Removing bin/lldb-mesos-local.sh
Removing bin/lldb-mesos-master.sh
Removing bin/lldb-mesos-slave.sh
Removing bin/lldb-mesos-tests.sh
Removing bin/mesos-local-flags.sh
Removing bin/mesos-local.sh
Removing bin/mesos-master-flags.sh
Removing bin/mesos-master.sh
Removing bin/mesos-slave-flags.sh
Removing bin/mesos-slave.sh
Removing bin/mesos-tests-flags.sh
Removing bin/mesos-tests.sh
Removing bin/mesos.sh
Removing bin/valgrind-mesos-local.sh
Removing bin/valgrind-mesos-master.sh
Removing bin/valgrind-mesos-slave.sh
Removing bin/valgrind-mesos-tests.sh
Removing compile
Removing config.guess
Removing config.log
Removing config.lt
Removing config.status
Removing config.sub
Removing configure
Removing depcomp
Removing include/mesos/version.hpp
Removing install-sh
Removing libtool
Removing ltmain.sh
Removing m4/libtool.m4
Removing m4/ltoptions.m4
Removing m4/ltsugar.m4
Removing m4/ltversion.m4
Removing m4/lt~obsolete.m4
Removing mesos-0.24.0.tar.gz
Removing mesos.pc
Removing missing
Removing mpi/mpiexec-mesos
Removing src/.deps/
Removing src/Makefile
Removing src/Makefile.in
Removing src/authentication/.deps/
Removing src/authentication/cram_md5/.deps/
Removing src/authorizer/.deps/
Removing src/cli/.deps/
Removing src/common/.deps/
Removing src/containerizer/
Removing src/deploy/mesos-daemon.sh
Removing src/deploy/mesos-start-cluster.sh
Removing src/deploy/mesos-start-masters.sh
Removing src/deploy/mesos-start-slaves.sh
Removing src/deploy/mesos-stop-cluster.sh
Removing src/deploy/mesos-stop-masters.sh
Removing src/deploy/mesos-stop-slaves.sh
Removing src/docker/.deps/
Removing src/examples/.deps/
Removing src/examples/java/test-exception-framework
Removing src/examples/java/test-executor
Removing src/examples/java/test-framework
Removing src/examples/java/test-log
Removing src/examples/java/test-multiple-executors-framework
Removing src/examples/python/test-containerizer
Removing src/examples/python/test-executor
Removing src/examples/python/test-framework
Removing src/exec/.deps/
Removing src/executor/
Removing src/fetcher/
Removing src/files/.deps/
Removing src/health-check/.deps/
Removing src/hook/.deps/
Removing src/java/generated/org/apache/mesos/MesosNativeLibrary.java
Removing src/java/jni/.deps/
Removing src/java/mesos.pom
Removing src/jvm/.deps/
Removing src/jvm/org/apache/.deps/
Removing src/launcher/.deps/
Removing src/linux/.deps/
Removing src/linux/routing/.deps/
Removing src/linux/routing/diagnosis/.deps/
Removing src/linux/routing/filter/.deps/
Removing src/linux/routing/link/.deps/
Removing src/linux/routing/queueing/.deps/
Removing src/local/.deps/
Removing src/log/.deps/
Removing src/log/tool/.deps/
Removing src/logging/.deps/
Removing src/master/.deps/
Removing src/master/allocator/.deps/
Removing src/master/allocator/sorter/drf/.deps/
Removing src/messages/.deps/
Removing src/module/.deps/
Removing src/python/interface/setup.py
Removing src/python/native/ext_modules.py
Removing src/python/native/setup.py
Removing src/python/setup.py
Removing src/sched/.deps/
Removing src/scheduler/.deps/
Removing src/slave/.deps/
Removing src/slave/containerizer/.deps/
Removing src/slave/containerizer/isolators/cgroups/.deps/
Removing src/slave/containerizer/isolators/filesystem/.deps/
Removing src/slave/containerizer/isolators/namespaces/.deps/
Removing src/slave/containerizer/isolators/network/.deps/
Removing src/slave/containerizer/isolators/posix/.deps/
Removing src/slave/containerizer/mesos/.deps/
Removing src/slave/resource_estimators/.deps/
Removing src/state/.deps/
Removing src/tests/.deps/
Removing src/tests/common/.deps/
Removing src/usage/.deps/
Removing src/watcher/.deps/
Removing src/zookeeper/.deps/
+ git reset --hard HEAD
HEAD is now at a7de651 Replaced tabs with spaces and fixed line length.
+ date
Tue Jul 21 00:32:54 UTC 2015
+ set +x
git rev-parse HEAD
Checking if review: 36185 needs verification
Latest diff timestamp: 2015-07-11 08:45:01
Latest review timestamp: 2015-07-11 09:38:12
Checking if review: 35797 needs verification
Latest diff timestamp: 2015-07-18 14:22:16
Latest review timestamp: 2015-07-18 15:35:06
Checking if review: 36574 needs verification
Skipping blocking review 36574
Checking if review: 36575 needs verification
Skipping blocking review 36575
Checking if review: 36596 needs verification
Skipping blocking review 36596
Checking if review: 36585 needs verification
Latest diff timestamp: 2015-07-19 00:32:55
Latest review timestamp: 2015-07-19 00:57:58
Checking if review: 36580 needs verification
Skipping blocking review 36580
Checking if review: 36603 needs verification
Latest diff timestamp: 2015-07-19 17:39:17
Traceback (most recent call last):
  File "./support/verify_reviews.py", line 193, in <module>
    needs_verification(review_request):
  File "./support/verify_reviews.py", line 171, in needs_verification
    changes = api(changes_url)
  File "./support/verify_reviews.py", line 61, in api
    return json.loads(urllib2.urlopen(url, data=data).read())
  File "/usr/lib/python2.7/urllib2.py", line 127, in urlopen
    return _opener.open(url, data, timeout)
  File "/usr/lib/python2.7/urllib2.py", line 410, in open
    response = meth(req, response)
  File "/usr/lib/python2.7/urllib2.py", line 523, in http_response
    'http', request, response, code, msg, hdrs)
  File "/usr/lib/python2.7/urllib2.py", line 448, in error
    return self._call_chain(*args)
  File "/usr/lib/python2.7/urllib2.py", line 382, in _call_chain
    result = func(*args)
  File "/usr/lib/python2.7/urllib2.py", line 531, in http_error_default
    raise HTTPError(req.get_full_url(), code, msg, hdrs, fp)
urllib2.HTTPError: HTTP Error 500: INTERNAL SERVER ERROR
git clean -fd
git reset --hard a7de6513cd2ff431a541e93c01858a0330584015

Build step 'Execute shell' marked build as failure

Build failed in Jenkins: mesos-reviewbot #7164

Posted by Apache Jenkins Server <je...@builds.apache.org>.
See <https://builds.apache.org/job/mesos-reviewbot/7164/>

------------------------------------------
[...truncated 6139 lines...]
rm -rf slave/containerizer/isolators/cgroups/.libs slave/containerizer/isolators/cgroups/_libs
rm -rf slave/containerizer/isolators/filesystem/.libs slave/containerizer/isolators/filesystem/_libs
rm -rf slave/containerizer/isolators/namespaces/.libs slave/containerizer/isolators/namespaces/_libs
rm -rf slave/containerizer/isolators/network/.libs slave/containerizer/isolators/network/_libs
rm -rf slave/containerizer/isolators/posix/.libs slave/containerizer/isolators/posix/_libs
rm -rf slave/containerizer/mesos/.libs slave/containerizer/mesos/_libs
rm -rf slave/resource_estimators/.libs slave/resource_estimators/_libs
rm -rf state/.libs state/_libs
rm -rf usage/.libs usage/_libs
rm -rf watcher/.libs watcher/_libs
rm -rf zookeeper/.libs zookeeper/_libs
rm -f tests/common/*.o
rm -f usage/*.o
rm -f usage/*.lo
rm -f watcher/*.o
rm -f watcher/*.lo
rm -f zookeeper/*.o
rm -f zookeeper/*.lo
rm -rf ./.deps authentication/.deps authentication/cram_md5/.deps authorizer/.deps cli/.deps common/.deps containerizer/.deps docker/.deps examples/.deps exec/.deps executor/.deps fetcher/.deps files/.deps health-check/.deps hook/.deps java/jni/.deps jvm/.deps jvm/org/apache/.deps launcher/.deps linux/.deps linux/routing/.deps linux/routing/diagnosis/.deps linux/routing/filter/.deps linux/routing/link/.deps linux/routing/queueing/.deps local/.deps log/.deps log/tool/.deps logging/.deps master/.deps master/allocator/.deps master/allocator/sorter/drf/.deps messages/.deps module/.deps sched/.deps scheduler/.deps slave/.deps slave/containerizer/.deps slave/containerizer/isolators/cgroups/.deps slave/containerizer/isolators/filesystem/.deps slave/containerizer/isolators/namespaces/.deps slave/containerizer/isolators/network/.deps slave/containerizer/isolators/posix/.deps slave/containerizer/mesos/.deps slave/resource_estimators/.deps state/.deps tests/.deps tests/common/.deps usage/.deps watcher/.deps zookeeper/.deps
rm -f Makefile
make[2]: Leaving directory `<https://builds.apache.org/job/mesos-reviewbot/ws/mesos-0.24.0/_build/src'>
rm -f config.status config.cache config.log configure.lineno config.status.lineno
rm -f Makefile
make[1]: Leaving directory `<https://builds.apache.org/job/mesos-reviewbot/ws/mesos-0.24.0/_build'>
if test -d "mesos-0.24.0"; then find "mesos-0.24.0" -type d ! -perm -200 -exec chmod u+w {} ';' && rm -rf "mesos-0.24.0" || { sleep 5 && rm -rf "mesos-0.24.0"; }; else :; fi
==============================================
mesos-0.24.0 archives ready for distribution: 
mesos-0.24.0.tar.gz
==============================================

real	14m40.961s
user	83m16.215s
sys	6m34.262s
+ chmod -R +w 3rdparty aclocal.m4 ar-lib autom4te.cache bin bootstrap CHANGELOG compile config.guess config.log config.lt config.status config.sub configure configure.ac depcomp Dockerfile docs Doxyfile include install-sh libtool LICENSE ltmain.sh m4 Makefile Makefile.am Makefile.in mesos-0.24.0.tar.gz mesos.pc mesos.pc.in missing mpi NOTICE README.md src support
+ git clean -fdx
Removing .clang-format
Removing .gitignore
Removing .libs/
Removing .reviewboardrc
Removing 3rdparty/Makefile
Removing 3rdparty/Makefile.in
Removing 3rdparty/libprocess/.deps/
Removing 3rdparty/libprocess/3rdparty/.deps/
Removing 3rdparty/libprocess/3rdparty/Makefile
Removing 3rdparty/libprocess/3rdparty/Makefile.in
Removing 3rdparty/libprocess/3rdparty/gmock_sources.cc
Removing 3rdparty/libprocess/3rdparty/stout/Makefile
Removing 3rdparty/libprocess/3rdparty/stout/Makefile.in
Removing 3rdparty/libprocess/3rdparty/stout/aclocal.m4
Removing 3rdparty/libprocess/3rdparty/stout/autom4te.cache/
Removing 3rdparty/libprocess/3rdparty/stout/config.log
Removing 3rdparty/libprocess/3rdparty/stout/config.status
Removing 3rdparty/libprocess/3rdparty/stout/configure
Removing 3rdparty/libprocess/3rdparty/stout/include/Makefile
Removing 3rdparty/libprocess/3rdparty/stout/include/Makefile.in
Removing 3rdparty/libprocess/3rdparty/stout/missing
Removing 3rdparty/libprocess/Makefile
Removing 3rdparty/libprocess/Makefile.in
Removing 3rdparty/libprocess/aclocal.m4
Removing 3rdparty/libprocess/ar-lib
Removing 3rdparty/libprocess/autom4te.cache/
Removing 3rdparty/libprocess/compile
Removing 3rdparty/libprocess/config.guess
Removing 3rdparty/libprocess/config.log
Removing 3rdparty/libprocess/config.lt
Removing 3rdparty/libprocess/config.status
Removing 3rdparty/libprocess/config.sub
Removing 3rdparty/libprocess/configure
Removing 3rdparty/libprocess/depcomp
Removing 3rdparty/libprocess/include/Makefile
Removing 3rdparty/libprocess/include/Makefile.in
Removing 3rdparty/libprocess/libtool
Removing 3rdparty/libprocess/ltmain.sh
Removing 3rdparty/libprocess/m4/libtool.m4
Removing 3rdparty/libprocess/m4/ltoptions.m4
Removing 3rdparty/libprocess/m4/ltsugar.m4
Removing 3rdparty/libprocess/m4/ltversion.m4
Removing 3rdparty/libprocess/m4/lt~obsolete.m4
Removing 3rdparty/libprocess/missing
Removing Makefile
Removing Makefile.in
Removing aclocal.m4
Removing ar-lib
Removing autom4te.cache/
Removing bin/gdb-mesos-local.sh
Removing bin/gdb-mesos-master.sh
Removing bin/gdb-mesos-slave.sh
Removing bin/gdb-mesos-tests.sh
Removing bin/lldb-mesos-local.sh
Removing bin/lldb-mesos-master.sh
Removing bin/lldb-mesos-slave.sh
Removing bin/lldb-mesos-tests.sh
Removing bin/mesos-local-flags.sh
Removing bin/mesos-local.sh
Removing bin/mesos-master-flags.sh
Removing bin/mesos-master.sh
Removing bin/mesos-slave-flags.sh
Removing bin/mesos-slave.sh
Removing bin/mesos-tests-flags.sh
Removing bin/mesos-tests.sh
Removing bin/mesos.sh
Removing bin/valgrind-mesos-local.sh
Removing bin/valgrind-mesos-master.sh
Removing bin/valgrind-mesos-slave.sh
Removing bin/valgrind-mesos-tests.sh
Removing compile
Removing config.guess
Removing config.log
Removing config.lt
Removing config.status
Removing config.sub
Removing configure
Removing depcomp
Removing include/mesos/version.hpp
Removing install-sh
Removing libtool
Removing ltmain.sh
Removing m4/libtool.m4
Removing m4/ltoptions.m4
Removing m4/ltsugar.m4
Removing m4/ltversion.m4
Removing m4/lt~obsolete.m4
Removing mesos-0.24.0.tar.gz
Removing mesos.pc
Removing missing
Removing mpi/mpiexec-mesos
Removing src/.deps/
Removing src/Makefile
Removing src/Makefile.in
Removing src/authentication/.deps/
Removing src/authentication/cram_md5/.deps/
Removing src/authorizer/.deps/
Removing src/cli/.deps/
Removing src/common/.deps/
Removing src/containerizer/
Removing src/deploy/mesos-daemon.sh
Removing src/deploy/mesos-start-cluster.sh
Removing src/deploy/mesos-start-masters.sh
Removing src/deploy/mesos-start-slaves.sh
Removing src/deploy/mesos-stop-cluster.sh
Removing src/deploy/mesos-stop-masters.sh
Removing src/deploy/mesos-stop-slaves.sh
Removing src/docker/.deps/
Removing src/examples/.deps/
Removing src/examples/java/test-exception-framework
Removing src/examples/java/test-executor
Removing src/examples/java/test-framework
Removing src/examples/java/test-log
Removing src/examples/java/test-multiple-executors-framework
Removing src/examples/python/test-containerizer
Removing src/examples/python/test-executor
Removing src/examples/python/test-framework
Removing src/exec/.deps/
Removing src/executor/
Removing src/fetcher/
Removing src/files/.deps/
Removing src/health-check/.deps/
Removing src/hook/.deps/
Removing src/java/generated/org/apache/mesos/MesosNativeLibrary.java
Removing src/java/jni/.deps/
Removing src/java/mesos.pom
Removing src/jvm/.deps/
Removing src/jvm/org/apache/.deps/
Removing src/launcher/.deps/
Removing src/linux/.deps/
Removing src/linux/routing/.deps/
Removing src/linux/routing/diagnosis/.deps/
Removing src/linux/routing/filter/.deps/
Removing src/linux/routing/link/.deps/
Removing src/linux/routing/queueing/.deps/
Removing src/local/.deps/
Removing src/log/.deps/
Removing src/log/tool/.deps/
Removing src/logging/.deps/
Removing src/master/.deps/
Removing src/master/allocator/.deps/
Removing src/master/allocator/sorter/drf/.deps/
Removing src/messages/.deps/
Removing src/module/.deps/
Removing src/python/interface/setup.py
Removing src/python/native/ext_modules.py
Removing src/python/native/setup.py
Removing src/python/setup.py
Removing src/sched/.deps/
Removing src/scheduler/.deps/
Removing src/slave/.deps/
Removing src/slave/containerizer/.deps/
Removing src/slave/containerizer/isolators/cgroups/.deps/
Removing src/slave/containerizer/isolators/filesystem/.deps/
Removing src/slave/containerizer/isolators/namespaces/.deps/
Removing src/slave/containerizer/isolators/network/.deps/
Removing src/slave/containerizer/isolators/posix/.deps/
Removing src/slave/containerizer/mesos/.deps/
Removing src/slave/resource_estimators/.deps/
Removing src/state/.deps/
Removing src/tests/.deps/
Removing src/tests/common/.deps/
Removing src/usage/.deps/
Removing src/watcher/.deps/
Removing src/zookeeper/.deps/
+ git reset --hard HEAD
HEAD is now at a7de651 Replaced tabs with spaces and fixed line length.
+ date
Tue Jul 21 00:07:54 UTC 2015
+ set +x
git rev-parse HEAD
Checking if review: 36185 needs verification
Latest diff timestamp: 2015-07-11 08:45:01
Latest review timestamp: 2015-07-11 09:38:12
Checking if review: 35797 needs verification
Latest diff timestamp: 2015-07-18 14:22:16
Latest review timestamp: 2015-07-18 15:35:06
Checking if review: 36574 needs verification
Skipping blocking review 36574
Checking if review: 36575 needs verification
Skipping blocking review 36575
Checking if review: 36596 needs verification
Skipping blocking review 36596
Checking if review: 36585 needs verification
Latest diff timestamp: 2015-07-19 00:32:55
Latest review timestamp: 2015-07-19 00:57:58
Checking if review: 36580 needs verification
Skipping blocking review 36580
Checking if review: 36603 needs verification
Latest diff timestamp: 2015-07-19 17:39:17
Traceback (most recent call last):
  File "./support/verify_reviews.py", line 193, in <module>
    needs_verification(review_request):
  File "./support/verify_reviews.py", line 171, in needs_verification
    changes = api(changes_url)
  File "./support/verify_reviews.py", line 61, in api
    return json.loads(urllib2.urlopen(url, data=data).read())
  File "/usr/lib/python2.7/urllib2.py", line 127, in urlopen
    return _opener.open(url, data, timeout)
  File "/usr/lib/python2.7/urllib2.py", line 410, in open
    response = meth(req, response)
  File "/usr/lib/python2.7/urllib2.py", line 523, in http_response
    'http', request, response, code, msg, hdrs)
  File "/usr/lib/python2.7/urllib2.py", line 448, in error
    return self._call_chain(*args)
  File "/usr/lib/python2.7/urllib2.py", line 382, in _call_chain
    result = func(*args)
  File "/usr/lib/python2.7/urllib2.py", line 531, in http_error_default
    raise HTTPError(req.get_full_url(), code, msg, hdrs, fp)
urllib2.HTTPError: HTTP Error 500: INTERNAL SERVER ERROR
git clean -fd
git reset --hard a7de6513cd2ff431a541e93c01858a0330584015

Build step 'Execute shell' marked build as failure

Build failed in Jenkins: mesos-reviewbot #7163

Posted by Apache Jenkins Server <je...@builds.apache.org>.
See <https://builds.apache.org/job/mesos-reviewbot/7163/>

------------------------------------------
[...truncated 6139 lines...]
rm -f tests/common/*.o
rm -rf slave/containerizer/isolators/cgroups/.libs slave/containerizer/isolators/cgroups/_libs
rm -f usage/*.o
rm -f usage/*.lo
rm -f watcher/*.o
rm -rf slave/containerizer/isolators/filesystem/.libs slave/containerizer/isolators/filesystem/_libs
rm -f watcher/*.lo
rm -rf slave/containerizer/isolators/namespaces/.libs slave/containerizer/isolators/namespaces/_libs
rm -f zookeeper/*.o
rm -rf slave/containerizer/isolators/network/.libs slave/containerizer/isolators/network/_libs
rm -f zookeeper/*.lo
rm -rf slave/containerizer/isolators/posix/.libs slave/containerizer/isolators/posix/_libs
rm -rf slave/containerizer/mesos/.libs slave/containerizer/mesos/_libs
rm -rf slave/resource_estimators/.libs slave/resource_estimators/_libs
rm -rf state/.libs state/_libs
rm -rf usage/.libs usage/_libs
rm -rf watcher/.libs watcher/_libs
rm -rf zookeeper/.libs zookeeper/_libs
rm -rf ./.deps authentication/.deps authentication/cram_md5/.deps authorizer/.deps cli/.deps common/.deps containerizer/.deps docker/.deps examples/.deps exec/.deps executor/.deps fetcher/.deps files/.deps health-check/.deps hook/.deps java/jni/.deps jvm/.deps jvm/org/apache/.deps launcher/.deps linux/.deps linux/routing/.deps linux/routing/diagnosis/.deps linux/routing/filter/.deps linux/routing/link/.deps linux/routing/queueing/.deps local/.deps log/.deps log/tool/.deps logging/.deps master/.deps master/allocator/.deps master/allocator/sorter/drf/.deps messages/.deps module/.deps sched/.deps scheduler/.deps slave/.deps slave/containerizer/.deps slave/containerizer/isolators/cgroups/.deps slave/containerizer/isolators/filesystem/.deps slave/containerizer/isolators/namespaces/.deps slave/containerizer/isolators/network/.deps slave/containerizer/isolators/posix/.deps slave/containerizer/mesos/.deps slave/resource_estimators/.deps state/.deps tests/.deps tests/common/.deps usage/.deps watcher/.deps zookeeper/.deps
rm -f Makefile
make[2]: Leaving directory `<https://builds.apache.org/job/mesos-reviewbot/ws/mesos-0.24.0/_build/src'>
rm -f config.status config.cache config.log configure.lineno config.status.lineno
rm -f Makefile
make[1]: Leaving directory `<https://builds.apache.org/job/mesos-reviewbot/ws/mesos-0.24.0/_build'>
if test -d "mesos-0.24.0"; then find "mesos-0.24.0" -type d ! -perm -200 -exec chmod u+w {} ';' && rm -rf "mesos-0.24.0" || { sleep 5 && rm -rf "mesos-0.24.0"; }; else :; fi
==============================================
mesos-0.24.0 archives ready for distribution: 
mesos-0.24.0.tar.gz
==============================================

real	12m54.417s
user	69m49.633s
sys	5m13.516s
+ chmod -R +w 3rdparty aclocal.m4 ar-lib autom4te.cache bin bootstrap CHANGELOG compile config.guess config.log config.lt config.status config.sub configure configure.ac depcomp Dockerfile docs Doxyfile include install-sh libtool LICENSE ltmain.sh m4 Makefile Makefile.am Makefile.in mesos-0.24.0.tar.gz mesos.pc mesos.pc.in missing mpi NOTICE README.md src support
+ git clean -fdx
Removing .clang-format
Removing .gitignore
Removing .libs/
Removing .reviewboardrc
Removing 3rdparty/Makefile
Removing 3rdparty/Makefile.in
Removing 3rdparty/libprocess/.deps/
Removing 3rdparty/libprocess/3rdparty/.deps/
Removing 3rdparty/libprocess/3rdparty/Makefile
Removing 3rdparty/libprocess/3rdparty/Makefile.in
Removing 3rdparty/libprocess/3rdparty/gmock_sources.cc
Removing 3rdparty/libprocess/3rdparty/stout/Makefile
Removing 3rdparty/libprocess/3rdparty/stout/Makefile.in
Removing 3rdparty/libprocess/3rdparty/stout/aclocal.m4
Removing 3rdparty/libprocess/3rdparty/stout/autom4te.cache/
Removing 3rdparty/libprocess/3rdparty/stout/config.log
Removing 3rdparty/libprocess/3rdparty/stout/config.status
Removing 3rdparty/libprocess/3rdparty/stout/configure
Removing 3rdparty/libprocess/3rdparty/stout/include/Makefile
Removing 3rdparty/libprocess/3rdparty/stout/include/Makefile.in
Removing 3rdparty/libprocess/3rdparty/stout/missing
Removing 3rdparty/libprocess/Makefile
Removing 3rdparty/libprocess/Makefile.in
Removing 3rdparty/libprocess/aclocal.m4
Removing 3rdparty/libprocess/ar-lib
Removing 3rdparty/libprocess/autom4te.cache/
Removing 3rdparty/libprocess/compile
Removing 3rdparty/libprocess/config.guess
Removing 3rdparty/libprocess/config.log
Removing 3rdparty/libprocess/config.lt
Removing 3rdparty/libprocess/config.status
Removing 3rdparty/libprocess/config.sub
Removing 3rdparty/libprocess/configure
Removing 3rdparty/libprocess/depcomp
Removing 3rdparty/libprocess/include/Makefile
Removing 3rdparty/libprocess/include/Makefile.in
Removing 3rdparty/libprocess/libtool
Removing 3rdparty/libprocess/ltmain.sh
Removing 3rdparty/libprocess/m4/libtool.m4
Removing 3rdparty/libprocess/m4/ltoptions.m4
Removing 3rdparty/libprocess/m4/ltsugar.m4
Removing 3rdparty/libprocess/m4/ltversion.m4
Removing 3rdparty/libprocess/m4/lt~obsolete.m4
Removing 3rdparty/libprocess/missing
Removing Makefile
Removing Makefile.in
Removing aclocal.m4
Removing ar-lib
Removing autom4te.cache/
Removing bin/gdb-mesos-local.sh
Removing bin/gdb-mesos-master.sh
Removing bin/gdb-mesos-slave.sh
Removing bin/gdb-mesos-tests.sh
Removing bin/lldb-mesos-local.sh
Removing bin/lldb-mesos-master.sh
Removing bin/lldb-mesos-slave.sh
Removing bin/lldb-mesos-tests.sh
Removing bin/mesos-local-flags.sh
Removing bin/mesos-local.sh
Removing bin/mesos-master-flags.sh
Removing bin/mesos-master.sh
Removing bin/mesos-slave-flags.sh
Removing bin/mesos-slave.sh
Removing bin/mesos-tests-flags.sh
Removing bin/mesos-tests.sh
Removing bin/mesos.sh
Removing bin/valgrind-mesos-local.sh
Removing bin/valgrind-mesos-master.sh
Removing bin/valgrind-mesos-slave.sh
Removing bin/valgrind-mesos-tests.sh
Removing compile
Removing config.guess
Removing config.log
Removing config.lt
Removing config.status
Removing config.sub
Removing configure
Removing depcomp
Removing include/mesos/version.hpp
Removing install-sh
Removing libtool
Removing ltmain.sh
Removing m4/libtool.m4
Removing m4/ltoptions.m4
Removing m4/ltsugar.m4
Removing m4/ltversion.m4
Removing m4/lt~obsolete.m4
Removing mesos-0.24.0.tar.gz
Removing mesos.pc
Removing missing
Removing mpi/mpiexec-mesos
Removing src/.deps/
Removing src/Makefile
Removing src/Makefile.in
Removing src/authentication/.deps/
Removing src/authentication/cram_md5/.deps/
Removing src/authorizer/.deps/
Removing src/cli/.deps/
Removing src/common/.deps/
Removing src/containerizer/
Removing src/deploy/mesos-daemon.sh
Removing src/deploy/mesos-start-cluster.sh
Removing src/deploy/mesos-start-masters.sh
Removing src/deploy/mesos-start-slaves.sh
Removing src/deploy/mesos-stop-cluster.sh
Removing src/deploy/mesos-stop-masters.sh
Removing src/deploy/mesos-stop-slaves.sh
Removing src/docker/.deps/
Removing src/examples/.deps/
Removing src/examples/java/test-exception-framework
Removing src/examples/java/test-executor
Removing src/examples/java/test-framework
Removing src/examples/java/test-log
Removing src/examples/java/test-multiple-executors-framework
Removing src/examples/python/test-containerizer
Removing src/examples/python/test-executor
Removing src/examples/python/test-framework
Removing src/exec/.deps/
Removing src/executor/
Removing src/fetcher/
Removing src/files/.deps/
Removing src/health-check/.deps/
Removing src/hook/.deps/
Removing src/java/generated/org/apache/mesos/MesosNativeLibrary.java
Removing src/java/jni/.deps/
Removing src/java/mesos.pom
Removing src/jvm/.deps/
Removing src/jvm/org/apache/.deps/
Removing src/launcher/.deps/
Removing src/linux/.deps/
Removing src/linux/routing/.deps/
Removing src/linux/routing/diagnosis/.deps/
Removing src/linux/routing/filter/.deps/
Removing src/linux/routing/link/.deps/
Removing src/linux/routing/queueing/.deps/
Removing src/local/.deps/
Removing src/log/.deps/
Removing src/log/tool/.deps/
Removing src/logging/.deps/
Removing src/master/.deps/
Removing src/master/allocator/.deps/
Removing src/master/allocator/sorter/drf/.deps/
Removing src/messages/.deps/
Removing src/module/.deps/
Removing src/python/interface/setup.py
Removing src/python/native/ext_modules.py
Removing src/python/native/setup.py
Removing src/python/setup.py
Removing src/sched/.deps/
Removing src/scheduler/.deps/
Removing src/slave/.deps/
Removing src/slave/containerizer/.deps/
Removing src/slave/containerizer/isolators/cgroups/.deps/
Removing src/slave/containerizer/isolators/filesystem/.deps/
Removing src/slave/containerizer/isolators/namespaces/.deps/
Removing src/slave/containerizer/isolators/network/.deps/
Removing src/slave/containerizer/isolators/posix/.deps/
Removing src/slave/containerizer/mesos/.deps/
Removing src/slave/resource_estimators/.deps/
Removing src/state/.deps/
Removing src/tests/.deps/
Removing src/tests/common/.deps/
Removing src/usage/.deps/
Removing src/watcher/.deps/
Removing src/zookeeper/.deps/
+ git reset --hard HEAD
HEAD is now at a7de651 Replaced tabs with spaces and fixed line length.
+ date
Mon Jul 20 22:16:04 UTC 2015
+ set +x
git rev-parse HEAD
Checking if review: 36185 needs verification
Latest diff timestamp: 2015-07-11 08:45:01
Latest review timestamp: 2015-07-11 09:38:12
Checking if review: 35797 needs verification
Latest diff timestamp: 2015-07-18 14:22:16
Latest review timestamp: 2015-07-18 15:35:06
Checking if review: 36574 needs verification
Skipping blocking review 36574
Checking if review: 36575 needs verification
Skipping blocking review 36575
Checking if review: 36596 needs verification
Skipping blocking review 36596
Checking if review: 36585 needs verification
Latest diff timestamp: 2015-07-19 00:32:55
Latest review timestamp: 2015-07-19 00:57:58
Checking if review: 36580 needs verification
Skipping blocking review 36580
Checking if review: 36603 needs verification
Latest diff timestamp: 2015-07-19 17:39:17
Traceback (most recent call last):
  File "./support/verify_reviews.py", line 193, in <module>
    needs_verification(review_request):
  File "./support/verify_reviews.py", line 171, in needs_verification
    changes = api(changes_url)
  File "./support/verify_reviews.py", line 61, in api
    return json.loads(urllib2.urlopen(url, data=data).read())
  File "/usr/lib/python2.7/urllib2.py", line 127, in urlopen
    return _opener.open(url, data, timeout)
  File "/usr/lib/python2.7/urllib2.py", line 410, in open
    response = meth(req, response)
  File "/usr/lib/python2.7/urllib2.py", line 523, in http_response
    'http', request, response, code, msg, hdrs)
  File "/usr/lib/python2.7/urllib2.py", line 448, in error
    return self._call_chain(*args)
  File "/usr/lib/python2.7/urllib2.py", line 382, in _call_chain
    result = func(*args)
  File "/usr/lib/python2.7/urllib2.py", line 531, in http_error_default
    raise HTTPError(req.get_full_url(), code, msg, hdrs, fp)
urllib2.HTTPError: HTTP Error 500: INTERNAL SERVER ERROR
git clean -fd
git reset --hard a7de6513cd2ff431a541e93c01858a0330584015

Build step 'Execute shell' marked build as failure

Build failed in Jenkins: mesos-reviewbot #7162

Posted by Apache Jenkins Server <je...@builds.apache.org>.
See <https://builds.apache.org/job/mesos-reviewbot/7162/>

------------------------------------------
[...truncated 6138 lines...]
rm -f tests/common/*.o
rm -rf slave/containerizer/isolators/cgroups/.libs slave/containerizer/isolators/cgroups/_libs
rm -f usage/*.o
rm -f usage/*.lo
rm -f watcher/*.o
rm -rf slave/containerizer/isolators/filesystem/.libs slave/containerizer/isolators/filesystem/_libs
rm -f watcher/*.lo
rm -f zookeeper/*.o
rm -rf slave/containerizer/isolators/namespaces/.libs slave/containerizer/isolators/namespaces/_libs
rm -rf slave/containerizer/isolators/network/.libs slave/containerizer/isolators/network/_libs
rm -f zookeeper/*.lo
rm -rf slave/containerizer/isolators/posix/.libs slave/containerizer/isolators/posix/_libs
rm -rf slave/containerizer/mesos/.libs slave/containerizer/mesos/_libs
rm -rf slave/resource_estimators/.libs slave/resource_estimators/_libs
rm -rf state/.libs state/_libs
rm -rf usage/.libs usage/_libs
rm -rf watcher/.libs watcher/_libs
rm -rf zookeeper/.libs zookeeper/_libs
rm -rf ./.deps authentication/.deps authentication/cram_md5/.deps authorizer/.deps cli/.deps common/.deps containerizer/.deps docker/.deps examples/.deps exec/.deps executor/.deps fetcher/.deps files/.deps health-check/.deps hook/.deps java/jni/.deps jvm/.deps jvm/org/apache/.deps launcher/.deps linux/.deps linux/routing/.deps linux/routing/diagnosis/.deps linux/routing/filter/.deps linux/routing/link/.deps linux/routing/queueing/.deps local/.deps log/.deps log/tool/.deps logging/.deps master/.deps master/allocator/.deps master/allocator/sorter/drf/.deps messages/.deps module/.deps sched/.deps scheduler/.deps slave/.deps slave/containerizer/.deps slave/containerizer/isolators/cgroups/.deps slave/containerizer/isolators/filesystem/.deps slave/containerizer/isolators/namespaces/.deps slave/containerizer/isolators/network/.deps slave/containerizer/isolators/posix/.deps slave/containerizer/mesos/.deps slave/resource_estimators/.deps state/.deps tests/.deps tests/common/.deps usage/.deps watcher/.deps zookeeper/.deps
rm -f Makefile
make[2]: Leaving directory `<https://builds.apache.org/job/mesos-reviewbot/ws/mesos-0.24.0/_build/src'>
rm -f config.status config.cache config.log configure.lineno config.status.lineno
rm -f Makefile
make[1]: Leaving directory `<https://builds.apache.org/job/mesos-reviewbot/ws/mesos-0.24.0/_build'>
if test -d "mesos-0.24.0"; then find "mesos-0.24.0" -type d ! -perm -200 -exec chmod u+w {} ';' && rm -rf "mesos-0.24.0" || { sleep 5 && rm -rf "mesos-0.24.0"; }; else :; fi
==============================================
mesos-0.24.0 archives ready for distribution: 
mesos-0.24.0.tar.gz
==============================================

real	14m32.360s
user	83m40.343s
sys	6m43.281s
+ chmod -R +w 3rdparty aclocal.m4 ar-lib autom4te.cache bin bootstrap CHANGELOG compile config.guess config.log config.lt config.status config.sub configure configure.ac depcomp Dockerfile docs Doxyfile include install-sh libtool LICENSE ltmain.sh m4 Makefile Makefile.am Makefile.in mesos-0.24.0.tar.gz mesos.pc mesos.pc.in missing mpi NOTICE README.md src support
+ git clean -fdx
Removing .clang-format
Removing .gitignore
Removing .libs/
Removing .reviewboardrc
Removing 3rdparty/Makefile
Removing 3rdparty/Makefile.in
Removing 3rdparty/libprocess/.deps/
Removing 3rdparty/libprocess/3rdparty/.deps/
Removing 3rdparty/libprocess/3rdparty/Makefile
Removing 3rdparty/libprocess/3rdparty/Makefile.in
Removing 3rdparty/libprocess/3rdparty/gmock_sources.cc
Removing 3rdparty/libprocess/3rdparty/stout/Makefile
Removing 3rdparty/libprocess/3rdparty/stout/Makefile.in
Removing 3rdparty/libprocess/3rdparty/stout/aclocal.m4
Removing 3rdparty/libprocess/3rdparty/stout/autom4te.cache/
Removing 3rdparty/libprocess/3rdparty/stout/config.log
Removing 3rdparty/libprocess/3rdparty/stout/config.status
Removing 3rdparty/libprocess/3rdparty/stout/configure
Removing 3rdparty/libprocess/3rdparty/stout/include/Makefile
Removing 3rdparty/libprocess/3rdparty/stout/include/Makefile.in
Removing 3rdparty/libprocess/3rdparty/stout/missing
Removing 3rdparty/libprocess/Makefile
Removing 3rdparty/libprocess/Makefile.in
Removing 3rdparty/libprocess/aclocal.m4
Removing 3rdparty/libprocess/ar-lib
Removing 3rdparty/libprocess/autom4te.cache/
Removing 3rdparty/libprocess/compile
Removing 3rdparty/libprocess/config.guess
Removing 3rdparty/libprocess/config.log
Removing 3rdparty/libprocess/config.lt
Removing 3rdparty/libprocess/config.status
Removing 3rdparty/libprocess/config.sub
Removing 3rdparty/libprocess/configure
Removing 3rdparty/libprocess/depcomp
Removing 3rdparty/libprocess/include/Makefile
Removing 3rdparty/libprocess/include/Makefile.in
Removing 3rdparty/libprocess/libtool
Removing 3rdparty/libprocess/ltmain.sh
Removing 3rdparty/libprocess/m4/libtool.m4
Removing 3rdparty/libprocess/m4/ltoptions.m4
Removing 3rdparty/libprocess/m4/ltsugar.m4
Removing 3rdparty/libprocess/m4/ltversion.m4
Removing 3rdparty/libprocess/m4/lt~obsolete.m4
Removing 3rdparty/libprocess/missing
Removing Makefile
Removing Makefile.in
Removing aclocal.m4
Removing ar-lib
Removing autom4te.cache/
Removing bin/gdb-mesos-local.sh
Removing bin/gdb-mesos-master.sh
Removing bin/gdb-mesos-slave.sh
Removing bin/gdb-mesos-tests.sh
Removing bin/lldb-mesos-local.sh
Removing bin/lldb-mesos-master.sh
Removing bin/lldb-mesos-slave.sh
Removing bin/lldb-mesos-tests.sh
Removing bin/mesos-local-flags.sh
Removing bin/mesos-local.sh
Removing bin/mesos-master-flags.sh
Removing bin/mesos-master.sh
Removing bin/mesos-slave-flags.sh
Removing bin/mesos-slave.sh
Removing bin/mesos-tests-flags.sh
Removing bin/mesos-tests.sh
Removing bin/mesos.sh
Removing bin/valgrind-mesos-local.sh
Removing bin/valgrind-mesos-master.sh
Removing bin/valgrind-mesos-slave.sh
Removing bin/valgrind-mesos-tests.sh
Removing compile
Removing config.guess
Removing config.log
Removing config.lt
Removing config.status
Removing config.sub
Removing configure
Removing depcomp
Removing include/mesos/version.hpp
Removing install-sh
Removing libtool
Removing ltmain.sh
Removing m4/libtool.m4
Removing m4/ltoptions.m4
Removing m4/ltsugar.m4
Removing m4/ltversion.m4
Removing m4/lt~obsolete.m4
Removing mesos-0.24.0.tar.gz
Removing mesos.pc
Removing missing
Removing mpi/mpiexec-mesos
Removing src/.deps/
Removing src/Makefile
Removing src/Makefile.in
Removing src/authentication/.deps/
Removing src/authentication/cram_md5/.deps/
Removing src/authorizer/.deps/
Removing src/cli/.deps/
Removing src/common/.deps/
Removing src/containerizer/
Removing src/deploy/mesos-daemon.sh
Removing src/deploy/mesos-start-cluster.sh
Removing src/deploy/mesos-start-masters.sh
Removing src/deploy/mesos-start-slaves.sh
Removing src/deploy/mesos-stop-cluster.sh
Removing src/deploy/mesos-stop-masters.sh
Removing src/deploy/mesos-stop-slaves.sh
Removing src/docker/.deps/
Removing src/examples/.deps/
Removing src/examples/java/test-exception-framework
Removing src/examples/java/test-executor
Removing src/examples/java/test-framework
Removing src/examples/java/test-log
Removing src/examples/java/test-multiple-executors-framework
Removing src/examples/python/test-containerizer
Removing src/examples/python/test-executor
Removing src/examples/python/test-framework
Removing src/exec/.deps/
Removing src/executor/
Removing src/fetcher/
Removing src/files/.deps/
Removing src/health-check/.deps/
Removing src/hook/.deps/
Removing src/java/generated/org/apache/mesos/MesosNativeLibrary.java
Removing src/java/jni/.deps/
Removing src/java/mesos.pom
Removing src/jvm/.deps/
Removing src/jvm/org/apache/.deps/
Removing src/launcher/.deps/
Removing src/linux/.deps/
Removing src/linux/routing/.deps/
Removing src/linux/routing/diagnosis/.deps/
Removing src/linux/routing/filter/.deps/
Removing src/linux/routing/link/.deps/
Removing src/linux/routing/queueing/.deps/
Removing src/local/.deps/
Removing src/log/.deps/
Removing src/log/tool/.deps/
Removing src/logging/.deps/
Removing src/master/.deps/
Removing src/master/allocator/.deps/
Removing src/master/allocator/sorter/drf/.deps/
Removing src/messages/.deps/
Removing src/module/.deps/
Removing src/python/interface/setup.py
Removing src/python/native/ext_modules.py
Removing src/python/native/setup.py
Removing src/python/setup.py
Removing src/sched/.deps/
Removing src/scheduler/.deps/
Removing src/slave/.deps/
Removing src/slave/containerizer/.deps/
Removing src/slave/containerizer/isolators/cgroups/.deps/
Removing src/slave/containerizer/isolators/filesystem/.deps/
Removing src/slave/containerizer/isolators/namespaces/.deps/
Removing src/slave/containerizer/isolators/network/.deps/
Removing src/slave/containerizer/isolators/posix/.deps/
Removing src/slave/containerizer/mesos/.deps/
Removing src/slave/resource_estimators/.deps/
Removing src/state/.deps/
Removing src/tests/.deps/
Removing src/tests/common/.deps/
Removing src/usage/.deps/
Removing src/watcher/.deps/
Removing src/zookeeper/.deps/
+ git reset --hard HEAD
HEAD is now at a7de651 Replaced tabs with spaces and fixed line length.
+ date
Mon Jul 20 21:57:37 UTC 2015
+ set +x
git rev-parse HEAD
Checking if review: 36185 needs verification
Latest diff timestamp: 2015-07-11 08:45:01
Latest review timestamp: 2015-07-11 09:38:12
Checking if review: 35797 needs verification
Latest diff timestamp: 2015-07-18 14:22:16
Latest review timestamp: 2015-07-18 15:35:06
Checking if review: 36574 needs verification
Skipping blocking review 36574
Checking if review: 36575 needs verification
Skipping blocking review 36575
Checking if review: 36596 needs verification
Skipping blocking review 36596
Checking if review: 36585 needs verification
Latest diff timestamp: 2015-07-19 00:32:55
Latest review timestamp: 2015-07-19 00:57:58
Checking if review: 36580 needs verification
Skipping blocking review 36580
Checking if review: 36603 needs verification
Latest diff timestamp: 2015-07-19 17:39:17
Traceback (most recent call last):
  File "./support/verify_reviews.py", line 193, in <module>
    needs_verification(review_request):
  File "./support/verify_reviews.py", line 171, in needs_verification
    changes = api(changes_url)
  File "./support/verify_reviews.py", line 61, in api
    return json.loads(urllib2.urlopen(url, data=data).read())
  File "/usr/lib/python2.7/urllib2.py", line 127, in urlopen
    return _opener.open(url, data, timeout)
  File "/usr/lib/python2.7/urllib2.py", line 410, in open
    response = meth(req, response)
  File "/usr/lib/python2.7/urllib2.py", line 523, in http_response
    'http', request, response, code, msg, hdrs)
  File "/usr/lib/python2.7/urllib2.py", line 448, in error
    return self._call_chain(*args)
  File "/usr/lib/python2.7/urllib2.py", line 382, in _call_chain
    result = func(*args)
  File "/usr/lib/python2.7/urllib2.py", line 531, in http_error_default
    raise HTTPError(req.get_full_url(), code, msg, hdrs, fp)
urllib2.HTTPError: HTTP Error 500: INTERNAL SERVER ERROR
git clean -fd
git reset --hard a7de6513cd2ff431a541e93c01858a0330584015

Build step 'Execute shell' marked build as failure

Build failed in Jenkins: mesos-reviewbot #7161

Posted by Apache Jenkins Server <je...@builds.apache.org>.
See <https://builds.apache.org/job/mesos-reviewbot/7161/>

------------------------------------------
[...truncated 6141 lines...]
rm -f usage/*.lo
rm -f watcher/*.o
rm -f watcher/*.lo
rm -rf slave/containerizer/isolators/filesystem/.libs slave/containerizer/isolators/filesystem/_libs
rm -f zookeeper/*.o
rm -f zookeeper/*.lo
rm -rf slave/containerizer/isolators/namespaces/.libs slave/containerizer/isolators/namespaces/_libs
rm -rf slave/containerizer/isolators/network/.libs slave/containerizer/isolators/network/_libs
rm -rf slave/containerizer/isolators/posix/.libs slave/containerizer/isolators/posix/_libs
rm -rf slave/containerizer/mesos/.libs slave/containerizer/mesos/_libs
rm -rf slave/resource_estimators/.libs slave/resource_estimators/_libs
rm -rf state/.libs state/_libs
rm -rf usage/.libs usage/_libs
rm -rf watcher/.libs watcher/_libs
rm -rf zookeeper/.libs zookeeper/_libs
rm -rf ./.deps authentication/.deps authentication/cram_md5/.deps authorizer/.deps cli/.deps common/.deps containerizer/.deps docker/.deps examples/.deps exec/.deps executor/.deps fetcher/.deps files/.deps health-check/.deps hook/.deps java/jni/.deps jvm/.deps jvm/org/apache/.deps launcher/.deps linux/.deps linux/routing/.deps linux/routing/diagnosis/.deps linux/routing/filter/.deps linux/routing/link/.deps linux/routing/queueing/.deps local/.deps log/.deps log/tool/.deps logging/.deps master/.deps master/allocator/.deps master/allocator/sorter/drf/.deps messages/.deps module/.deps sched/.deps scheduler/.deps slave/.deps slave/containerizer/.deps slave/containerizer/isolators/cgroups/.deps slave/containerizer/isolators/filesystem/.deps slave/containerizer/isolators/namespaces/.deps slave/containerizer/isolators/network/.deps slave/containerizer/isolators/posix/.deps slave/containerizer/mesos/.deps slave/resource_estimators/.deps state/.deps tests/.deps tests/common/.deps usage/.deps watcher/.deps zookeeper/.deps
rm -f Makefile
make[2]: Leaving directory `<https://builds.apache.org/job/mesos-reviewbot/ws/mesos-0.24.0/_build/src'>
rm -f config.status config.cache config.log configure.lineno config.status.lineno
rm -f Makefile
make[1]: Leaving directory `<https://builds.apache.org/job/mesos-reviewbot/ws/mesos-0.24.0/_build'>
if test -d "mesos-0.24.0"; then find "mesos-0.24.0" -type d ! -perm -200 -exec chmod u+w {} ';' && rm -rf "mesos-0.24.0" || { sleep 5 && rm -rf "mesos-0.24.0"; }; else :; fi
==============================================
mesos-0.24.0 archives ready for distribution: 
mesos-0.24.0.tar.gz
==============================================

real	14m22.093s
user	83m16.754s
sys	6m46.230s
+ chmod -R +w 3rdparty aclocal.m4 ar-lib autom4te.cache bin bootstrap CHANGELOG compile config.guess config.log config.lt config.status config.sub configure configure.ac depcomp Dockerfile docs Doxyfile include install-sh libtool LICENSE ltmain.sh m4 Makefile Makefile.am Makefile.in mesos-0.24.0.tar.gz mesos.pc mesos.pc.in missing mpi NOTICE README.md src support
+ git clean -fdx
Removing .clang-format
Removing .gitignore
Removing .libs/
Removing .reviewboardrc
Removing 3rdparty/Makefile
Removing 3rdparty/Makefile.in
Removing 3rdparty/libprocess/.deps/
Removing 3rdparty/libprocess/3rdparty/.deps/
Removing 3rdparty/libprocess/3rdparty/Makefile
Removing 3rdparty/libprocess/3rdparty/Makefile.in
Removing 3rdparty/libprocess/3rdparty/gmock_sources.cc
Removing 3rdparty/libprocess/3rdparty/stout/Makefile
Removing 3rdparty/libprocess/3rdparty/stout/Makefile.in
Removing 3rdparty/libprocess/3rdparty/stout/aclocal.m4
Removing 3rdparty/libprocess/3rdparty/stout/autom4te.cache/
Removing 3rdparty/libprocess/3rdparty/stout/config.log
Removing 3rdparty/libprocess/3rdparty/stout/config.status
Removing 3rdparty/libprocess/3rdparty/stout/configure
Removing 3rdparty/libprocess/3rdparty/stout/include/Makefile
Removing 3rdparty/libprocess/3rdparty/stout/include/Makefile.in
Removing 3rdparty/libprocess/3rdparty/stout/missing
Removing 3rdparty/libprocess/Makefile
Removing 3rdparty/libprocess/Makefile.in
Removing 3rdparty/libprocess/aclocal.m4
Removing 3rdparty/libprocess/ar-lib
Removing 3rdparty/libprocess/autom4te.cache/
Removing 3rdparty/libprocess/compile
Removing 3rdparty/libprocess/config.guess
Removing 3rdparty/libprocess/config.log
Removing 3rdparty/libprocess/config.lt
Removing 3rdparty/libprocess/config.status
Removing 3rdparty/libprocess/config.sub
Removing 3rdparty/libprocess/configure
Removing 3rdparty/libprocess/depcomp
Removing 3rdparty/libprocess/include/Makefile
Removing 3rdparty/libprocess/include/Makefile.in
Removing 3rdparty/libprocess/libtool
Removing 3rdparty/libprocess/ltmain.sh
Removing 3rdparty/libprocess/m4/libtool.m4
Removing 3rdparty/libprocess/m4/ltoptions.m4
Removing 3rdparty/libprocess/m4/ltsugar.m4
Removing 3rdparty/libprocess/m4/ltversion.m4
Removing 3rdparty/libprocess/m4/lt~obsolete.m4
Removing 3rdparty/libprocess/missing
Removing Makefile
Removing Makefile.in
Removing aclocal.m4
Removing ar-lib
Removing autom4te.cache/
Removing bin/gdb-mesos-local.sh
Removing bin/gdb-mesos-master.sh
Removing bin/gdb-mesos-slave.sh
Removing bin/gdb-mesos-tests.sh
Removing bin/lldb-mesos-local.sh
Removing bin/lldb-mesos-master.sh
Removing bin/lldb-mesos-slave.sh
Removing bin/lldb-mesos-tests.sh
Removing bin/mesos-local-flags.sh
Removing bin/mesos-local.sh
Removing bin/mesos-master-flags.sh
Removing bin/mesos-master.sh
Removing bin/mesos-slave-flags.sh
Removing bin/mesos-slave.sh
Removing bin/mesos-tests-flags.sh
Removing bin/mesos-tests.sh
Removing bin/mesos.sh
Removing bin/valgrind-mesos-local.sh
Removing bin/valgrind-mesos-master.sh
Removing bin/valgrind-mesos-slave.sh
Removing bin/valgrind-mesos-tests.sh
Removing compile
Removing config.guess
Removing config.log
Removing config.lt
Removing config.status
Removing config.sub
Removing configure
Removing depcomp
Removing include/mesos/version.hpp
Removing install-sh
Removing libtool
Removing ltmain.sh
Removing m4/libtool.m4
Removing m4/ltoptions.m4
Removing m4/ltsugar.m4
Removing m4/ltversion.m4
Removing m4/lt~obsolete.m4
Removing mesos-0.24.0.tar.gz
Removing mesos.pc
Removing missing
Removing mpi/mpiexec-mesos
Removing src/.deps/
Removing src/Makefile
Removing src/Makefile.in
Removing src/authentication/.deps/
Removing src/authentication/cram_md5/.deps/
Removing src/authorizer/.deps/
Removing src/cli/.deps/
Removing src/common/.deps/
Removing src/containerizer/
Removing src/deploy/mesos-daemon.sh
Removing src/deploy/mesos-start-cluster.sh
Removing src/deploy/mesos-start-masters.sh
Removing src/deploy/mesos-start-slaves.sh
Removing src/deploy/mesos-stop-cluster.sh
Removing src/deploy/mesos-stop-masters.sh
Removing src/deploy/mesos-stop-slaves.sh
Removing src/docker/.deps/
Removing src/examples/.deps/
Removing src/examples/java/test-exception-framework
Removing src/examples/java/test-executor
Removing src/examples/java/test-framework
Removing src/examples/java/test-log
Removing src/examples/java/test-multiple-executors-framework
Removing src/examples/python/test-containerizer
Removing src/examples/python/test-executor
Removing src/examples/python/test-framework
Removing src/exec/.deps/
Removing src/executor/
Removing src/fetcher/
Removing src/files/.deps/
Removing src/health-check/.deps/
Removing src/hook/.deps/
Removing src/java/generated/org/apache/mesos/MesosNativeLibrary.java
Removing src/java/jni/.deps/
Removing src/java/mesos.pom
Removing src/jvm/.deps/
Removing src/jvm/org/apache/.deps/
Removing src/launcher/.deps/
Removing src/linux/.deps/
Removing src/linux/routing/.deps/
Removing src/linux/routing/diagnosis/.deps/
Removing src/linux/routing/filter/.deps/
Removing src/linux/routing/link/.deps/
Removing src/linux/routing/queueing/.deps/
Removing src/local/.deps/
Removing src/log/.deps/
Removing src/log/tool/.deps/
Removing src/logging/.deps/
Removing src/master/.deps/
Removing src/master/allocator/.deps/
Removing src/master/allocator/sorter/drf/.deps/
Removing src/messages/.deps/
Removing src/module/.deps/
Removing src/python/interface/setup.py
Removing src/python/native/ext_modules.py
Removing src/python/native/setup.py
Removing src/python/setup.py
Removing src/sched/.deps/
Removing src/scheduler/.deps/
Removing src/slave/.deps/
Removing src/slave/containerizer/.deps/
Removing src/slave/containerizer/isolators/cgroups/.deps/
Removing src/slave/containerizer/isolators/filesystem/.deps/
Removing src/slave/containerizer/isolators/namespaces/.deps/
Removing src/slave/containerizer/isolators/network/.deps/
Removing src/slave/containerizer/isolators/posix/.deps/
Removing src/slave/containerizer/mesos/.deps/
Removing src/slave/resource_estimators/.deps/
Removing src/state/.deps/
Removing src/tests/.deps/
Removing src/tests/common/.deps/
Removing src/usage/.deps/
Removing src/watcher/.deps/
Removing src/zookeeper/.deps/
+ git reset --hard HEAD
HEAD is now at a7de651 Replaced tabs with spaces and fixed line length.
+ date
Mon Jul 20 21:27:27 UTC 2015
+ set +x
git rev-parse HEAD
Checking if review: 36318 needs verification
Latest diff timestamp: 2015-07-15 04:39:31
Latest review timestamp: 2015-07-15 05:30:02
Checking if review: 36185 needs verification
Latest diff timestamp: 2015-07-11 08:45:01
Latest review timestamp: 2015-07-11 09:38:12
Checking if review: 35797 needs verification
Latest diff timestamp: 2015-07-18 14:22:16
Latest review timestamp: 2015-07-18 15:35:06
Checking if review: 36574 needs verification
Skipping blocking review 36574
Checking if review: 36575 needs verification
Skipping blocking review 36575
Checking if review: 36596 needs verification
Skipping blocking review 36596
Checking if review: 36585 needs verification
Latest diff timestamp: 2015-07-19 00:32:55
Latest review timestamp: 2015-07-19 00:57:58
Checking if review: 36580 needs verification
Skipping blocking review 36580
Checking if review: 36603 needs verification
Latest diff timestamp: 2015-07-19 17:39:17
Traceback (most recent call last):
  File "./support/verify_reviews.py", line 193, in <module>
    needs_verification(review_request):
  File "./support/verify_reviews.py", line 171, in needs_verification
    changes = api(changes_url)
  File "./support/verify_reviews.py", line 61, in api
    return json.loads(urllib2.urlopen(url, data=data).read())
  File "/usr/lib/python2.7/urllib2.py", line 127, in urlopen
    return _opener.open(url, data, timeout)
  File "/usr/lib/python2.7/urllib2.py", line 410, in open
    response = meth(req, response)
  File "/usr/lib/python2.7/urllib2.py", line 523, in http_response
    'http', request, response, code, msg, hdrs)
  File "/usr/lib/python2.7/urllib2.py", line 448, in error
    return self._call_chain(*args)
  File "/usr/lib/python2.7/urllib2.py", line 382, in _call_chain
    result = func(*args)
  File "/usr/lib/python2.7/urllib2.py", line 531, in http_error_default
    raise HTTPError(req.get_full_url(), code, msg, hdrs, fp)
urllib2.HTTPError: HTTP Error 500: INTERNAL SERVER ERROR
git clean -fd
git reset --hard a7de6513cd2ff431a541e93c01858a0330584015

Build step 'Execute shell' marked build as failure

Build failed in Jenkins: mesos-reviewbot #7160

Posted by Apache Jenkins Server <je...@builds.apache.org>.
See <https://builds.apache.org/job/mesos-reviewbot/7160/>

------------------------------------------
[...truncated 6142 lines...]
rm -rf sched/.libs sched/_libs
rm -rf scheduler/.libs scheduler/_libs
rm -rf slave/.libs slave/_libs
rm -rf slave/containerizer/.libs slave/containerizer/_libs
rm -rf slave/containerizer/isolators/cgroups/.libs slave/containerizer/isolators/cgroups/_libs
rm -rf slave/containerizer/isolators/filesystem/.libs slave/containerizer/isolators/filesystem/_libs
rm -rf slave/containerizer/isolators/namespaces/.libs slave/containerizer/isolators/namespaces/_libs
rm -rf slave/containerizer/isolators/network/.libs slave/containerizer/isolators/network/_libs
rm -rf slave/containerizer/isolators/posix/.libs slave/containerizer/isolators/posix/_libs
rm -rf slave/containerizer/mesos/.libs slave/containerizer/mesos/_libs
rm -rf slave/resource_estimators/.libs slave/resource_estimators/_libs
rm -rf state/.libs state/_libs
rm -rf usage/.libs usage/_libs
rm -rf watcher/.libs watcher/_libs
rm -rf zookeeper/.libs zookeeper/_libs
rm -rf ./.deps authentication/.deps authentication/cram_md5/.deps authorizer/.deps cli/.deps common/.deps containerizer/.deps docker/.deps examples/.deps exec/.deps executor/.deps fetcher/.deps files/.deps health-check/.deps hook/.deps java/jni/.deps jvm/.deps jvm/org/apache/.deps launcher/.deps linux/.deps linux/routing/.deps linux/routing/diagnosis/.deps linux/routing/filter/.deps linux/routing/link/.deps linux/routing/queueing/.deps local/.deps log/.deps log/tool/.deps logging/.deps master/.deps master/allocator/.deps master/allocator/sorter/drf/.deps messages/.deps module/.deps sched/.deps scheduler/.deps slave/.deps slave/containerizer/.deps slave/containerizer/isolators/cgroups/.deps slave/containerizer/isolators/filesystem/.deps slave/containerizer/isolators/namespaces/.deps slave/containerizer/isolators/network/.deps slave/containerizer/isolators/posix/.deps slave/containerizer/mesos/.deps slave/resource_estimators/.deps state/.deps tests/.deps tests/common/.deps usage/.deps watcher/.deps zookeeper/.deps
rm -f Makefile
make[2]: Leaving directory `<https://builds.apache.org/job/mesos-reviewbot/ws/mesos-0.24.0/_build/src'>
rm -f config.status config.cache config.log configure.lineno config.status.lineno
rm -f Makefile
make[1]: Leaving directory `<https://builds.apache.org/job/mesos-reviewbot/ws/mesos-0.24.0/_build'>
if test -d "mesos-0.24.0"; then find "mesos-0.24.0" -type d ! -perm -200 -exec chmod u+w {} ';' && rm -rf "mesos-0.24.0" || { sleep 5 && rm -rf "mesos-0.24.0"; }; else :; fi
==============================================
mesos-0.24.0 archives ready for distribution: 
mesos-0.24.0.tar.gz
==============================================

real	12m52.562s
user	69m44.127s
sys	5m8.861s
+ chmod -R +w 3rdparty aclocal.m4 ar-lib autom4te.cache bin bootstrap CHANGELOG compile config.guess config.log config.lt config.status config.sub configure configure.ac depcomp Dockerfile docs Doxyfile include install-sh libtool LICENSE ltmain.sh m4 Makefile Makefile.am Makefile.in mesos-0.24.0.tar.gz mesos.pc mesos.pc.in missing mpi NOTICE README.md src support
+ git clean -fdx
Removing .clang-format
Removing .gitignore
Removing .libs/
Removing .reviewboardrc
Removing 3rdparty/Makefile
Removing 3rdparty/Makefile.in
Removing 3rdparty/libprocess/.deps/
Removing 3rdparty/libprocess/3rdparty/.deps/
Removing 3rdparty/libprocess/3rdparty/Makefile
Removing 3rdparty/libprocess/3rdparty/Makefile.in
Removing 3rdparty/libprocess/3rdparty/gmock_sources.cc
Removing 3rdparty/libprocess/3rdparty/stout/Makefile
Removing 3rdparty/libprocess/3rdparty/stout/Makefile.in
Removing 3rdparty/libprocess/3rdparty/stout/aclocal.m4
Removing 3rdparty/libprocess/3rdparty/stout/autom4te.cache/
Removing 3rdparty/libprocess/3rdparty/stout/config.log
Removing 3rdparty/libprocess/3rdparty/stout/config.status
Removing 3rdparty/libprocess/3rdparty/stout/configure
Removing 3rdparty/libprocess/3rdparty/stout/include/Makefile
Removing 3rdparty/libprocess/3rdparty/stout/include/Makefile.in
Removing 3rdparty/libprocess/3rdparty/stout/missing
Removing 3rdparty/libprocess/Makefile
Removing 3rdparty/libprocess/Makefile.in
Removing 3rdparty/libprocess/aclocal.m4
Removing 3rdparty/libprocess/ar-lib
Removing 3rdparty/libprocess/autom4te.cache/
Removing 3rdparty/libprocess/compile
Removing 3rdparty/libprocess/config.guess
Removing 3rdparty/libprocess/config.log
Removing 3rdparty/libprocess/config.lt
Removing 3rdparty/libprocess/config.status
Removing 3rdparty/libprocess/config.sub
Removing 3rdparty/libprocess/configure
Removing 3rdparty/libprocess/depcomp
Removing 3rdparty/libprocess/include/Makefile
Removing 3rdparty/libprocess/include/Makefile.in
Removing 3rdparty/libprocess/libtool
Removing 3rdparty/libprocess/ltmain.sh
Removing 3rdparty/libprocess/m4/libtool.m4
Removing 3rdparty/libprocess/m4/ltoptions.m4
Removing 3rdparty/libprocess/m4/ltsugar.m4
Removing 3rdparty/libprocess/m4/ltversion.m4
Removing 3rdparty/libprocess/m4/lt~obsolete.m4
Removing 3rdparty/libprocess/missing
Removing Makefile
Removing Makefile.in
Removing aclocal.m4
Removing ar-lib
Removing autom4te.cache/
Removing bin/gdb-mesos-local.sh
Removing bin/gdb-mesos-master.sh
Removing bin/gdb-mesos-slave.sh
Removing bin/gdb-mesos-tests.sh
Removing bin/lldb-mesos-local.sh
Removing bin/lldb-mesos-master.sh
Removing bin/lldb-mesos-slave.sh
Removing bin/lldb-mesos-tests.sh
Removing bin/mesos-local-flags.sh
Removing bin/mesos-local.sh
Removing bin/mesos-master-flags.sh
Removing bin/mesos-master.sh
Removing bin/mesos-slave-flags.sh
Removing bin/mesos-slave.sh
Removing bin/mesos-tests-flags.sh
Removing bin/mesos-tests.sh
Removing bin/mesos.sh
Removing bin/valgrind-mesos-local.sh
Removing bin/valgrind-mesos-master.sh
Removing bin/valgrind-mesos-slave.sh
Removing bin/valgrind-mesos-tests.sh
Removing compile
Removing config.guess
Removing config.log
Removing config.lt
Removing config.status
Removing config.sub
Removing configure
Removing depcomp
Removing include/mesos/version.hpp
Removing install-sh
Removing libtool
Removing ltmain.sh
Removing m4/libtool.m4
Removing m4/ltoptions.m4
Removing m4/ltsugar.m4
Removing m4/ltversion.m4
Removing m4/lt~obsolete.m4
Removing mesos-0.24.0.tar.gz
Removing mesos.pc
Removing missing
Removing mpi/mpiexec-mesos
Removing src/.deps/
Removing src/Makefile
Removing src/Makefile.in
Removing src/authentication/.deps/
Removing src/authentication/cram_md5/.deps/
Removing src/authorizer/.deps/
Removing src/cli/.deps/
Removing src/common/.deps/
Removing src/containerizer/
Removing src/deploy/mesos-daemon.sh
Removing src/deploy/mesos-start-cluster.sh
Removing src/deploy/mesos-start-masters.sh
Removing src/deploy/mesos-start-slaves.sh
Removing src/deploy/mesos-stop-cluster.sh
Removing src/deploy/mesos-stop-masters.sh
Removing src/deploy/mesos-stop-slaves.sh
Removing src/docker/.deps/
Removing src/examples/.deps/
Removing src/examples/java/test-exception-framework
Removing src/examples/java/test-executor
Removing src/examples/java/test-framework
Removing src/examples/java/test-log
Removing src/examples/java/test-multiple-executors-framework
Removing src/examples/python/test-containerizer
Removing src/examples/python/test-executor
Removing src/examples/python/test-framework
Removing src/exec/.deps/
Removing src/executor/
Removing src/fetcher/
Removing src/files/.deps/
Removing src/health-check/.deps/
Removing src/hook/.deps/
Removing src/java/generated/org/apache/mesos/MesosNativeLibrary.java
Removing src/java/jni/.deps/
Removing src/java/mesos.pom
Removing src/jvm/.deps/
Removing src/jvm/org/apache/.deps/
Removing src/launcher/.deps/
Removing src/linux/.deps/
Removing src/linux/routing/.deps/
Removing src/linux/routing/diagnosis/.deps/
Removing src/linux/routing/filter/.deps/
Removing src/linux/routing/link/.deps/
Removing src/linux/routing/queueing/.deps/
Removing src/local/.deps/
Removing src/log/.deps/
Removing src/log/tool/.deps/
Removing src/logging/.deps/
Removing src/master/.deps/
Removing src/master/allocator/.deps/
Removing src/master/allocator/sorter/drf/.deps/
Removing src/messages/.deps/
Removing src/module/.deps/
Removing src/python/interface/setup.py
Removing src/python/native/ext_modules.py
Removing src/python/native/setup.py
Removing src/python/setup.py
Removing src/sched/.deps/
Removing src/scheduler/.deps/
Removing src/slave/.deps/
Removing src/slave/containerizer/.deps/
Removing src/slave/containerizer/isolators/cgroups/.deps/
Removing src/slave/containerizer/isolators/filesystem/.deps/
Removing src/slave/containerizer/isolators/namespaces/.deps/
Removing src/slave/containerizer/isolators/network/.deps/
Removing src/slave/containerizer/isolators/posix/.deps/
Removing src/slave/containerizer/mesos/.deps/
Removing src/slave/resource_estimators/.deps/
Removing src/state/.deps/
Removing src/tests/.deps/
Removing src/tests/common/.deps/
Removing src/usage/.deps/
Removing src/watcher/.deps/
Removing src/zookeeper/.deps/
+ git reset --hard HEAD
HEAD is now at a7de651 Replaced tabs with spaces and fixed line length.
+ date
Mon Jul 20 21:06:02 UTC 2015
+ set +x
git rev-parse HEAD
Checking if review: 36318 needs verification
Latest diff timestamp: 2015-07-15 04:39:31
Latest review timestamp: 2015-07-15 05:30:02
Checking if review: 36185 needs verification
Latest diff timestamp: 2015-07-11 08:45:01
Latest review timestamp: 2015-07-11 09:38:12
Checking if review: 35797 needs verification
Latest diff timestamp: 2015-07-18 14:22:16
Latest review timestamp: 2015-07-18 15:35:06
Checking if review: 36574 needs verification
Skipping blocking review 36574
Checking if review: 36575 needs verification
Skipping blocking review 36575
Checking if review: 36596 needs verification
Skipping blocking review 36596
Checking if review: 36585 needs verification
Latest diff timestamp: 2015-07-19 00:32:55
Latest review timestamp: 2015-07-19 00:57:58
Checking if review: 36580 needs verification
Skipping blocking review 36580
Checking if review: 36603 needs verification
Latest diff timestamp: 2015-07-19 17:39:17
Traceback (most recent call last):
  File "./support/verify_reviews.py", line 193, in <module>
    needs_verification(review_request):
  File "./support/verify_reviews.py", line 171, in needs_verification
    changes = api(changes_url)
  File "./support/verify_reviews.py", line 61, in api
    return json.loads(urllib2.urlopen(url, data=data).read())
  File "/usr/lib/python2.7/urllib2.py", line 127, in urlopen
    return _opener.open(url, data, timeout)
  File "/usr/lib/python2.7/urllib2.py", line 410, in open
    response = meth(req, response)
  File "/usr/lib/python2.7/urllib2.py", line 523, in http_response
    'http', request, response, code, msg, hdrs)
  File "/usr/lib/python2.7/urllib2.py", line 448, in error
    return self._call_chain(*args)
  File "/usr/lib/python2.7/urllib2.py", line 382, in _call_chain
    result = func(*args)
  File "/usr/lib/python2.7/urllib2.py", line 531, in http_error_default
    raise HTTPError(req.get_full_url(), code, msg, hdrs, fp)
urllib2.HTTPError: HTTP Error 500: INTERNAL SERVER ERROR
git clean -fd
git reset --hard a7de6513cd2ff431a541e93c01858a0330584015

Build step 'Execute shell' marked build as failure

Build failed in Jenkins: mesos-reviewbot #7159

Posted by Apache Jenkins Server <je...@builds.apache.org>.
See <https://builds.apache.org/job/mesos-reviewbot/7159/>

------------------------------------------
[...truncated 6148 lines...]
rm -rf slave/containerizer/isolators/network/.libs slave/containerizer/isolators/network/_libs
rm -rf slave/containerizer/isolators/posix/.libs slave/containerizer/isolators/posix/_libs
rm -rf slave/containerizer/mesos/.libs slave/containerizer/mesos/_libs
rm -rf slave/resource_estimators/.libs slave/resource_estimators/_libs
rm -rf state/.libs state/_libs
rm -rf usage/.libs usage/_libs
rm -rf watcher/.libs watcher/_libs
rm -rf zookeeper/.libs zookeeper/_libs
rm -rf ./.deps authentication/.deps authentication/cram_md5/.deps authorizer/.deps cli/.deps common/.deps containerizer/.deps docker/.deps examples/.deps exec/.deps executor/.deps fetcher/.deps files/.deps health-check/.deps hook/.deps java/jni/.deps jvm/.deps jvm/org/apache/.deps launcher/.deps linux/.deps linux/routing/.deps linux/routing/diagnosis/.deps linux/routing/filter/.deps linux/routing/link/.deps linux/routing/queueing/.deps local/.deps log/.deps log/tool/.deps logging/.deps master/.deps master/allocator/.deps master/allocator/sorter/drf/.deps messages/.deps module/.deps sched/.deps scheduler/.deps slave/.deps slave/containerizer/.deps slave/containerizer/isolators/cgroups/.deps slave/containerizer/isolators/filesystem/.deps slave/containerizer/isolators/namespaces/.deps slave/containerizer/isolators/network/.deps slave/containerizer/isolators/posix/.deps slave/containerizer/mesos/.deps slave/resource_estimators/.deps state/.deps tests/.deps tests/common/.deps usage/.deps watcher/.deps zookeeper/.deps
rm -f Makefile
make[2]: Leaving directory `<https://builds.apache.org/job/mesos-reviewbot/ws/mesos-0.24.0/_build/src'>
rm -f config.status config.cache config.log configure.lineno config.status.lineno
rm -f Makefile
make[1]: Leaving directory `<https://builds.apache.org/job/mesos-reviewbot/ws/mesos-0.24.0/_build'>
if test -d "mesos-0.24.0"; then find "mesos-0.24.0" -type d ! -perm -200 -exec chmod u+w {} ';' && rm -rf "mesos-0.24.0" || { sleep 5 && rm -rf "mesos-0.24.0"; }; else :; fi
==============================================
mesos-0.24.0 archives ready for distribution: 
mesos-0.24.0.tar.gz
==============================================

real	14m43.848s
user	83m15.019s
sys	7m38.918s
+ chmod -R +w 3rdparty aclocal.m4 ar-lib autom4te.cache bin bootstrap CHANGELOG compile config.guess config.log config.lt config.status config.sub configure configure.ac depcomp Dockerfile docs Doxyfile include install-sh libtool LICENSE ltmain.sh m4 Makefile Makefile.am Makefile.in mesos-0.24.0.tar.gz mesos.pc mesos.pc.in missing mpi NOTICE README.md src support
+ git clean -fdx
Removing .clang-format
Removing .gitignore
Removing .libs/
Removing .reviewboardrc
Removing 3rdparty/Makefile
Removing 3rdparty/Makefile.in
Removing 3rdparty/libprocess/.deps/
Removing 3rdparty/libprocess/3rdparty/.deps/
Removing 3rdparty/libprocess/3rdparty/Makefile
Removing 3rdparty/libprocess/3rdparty/Makefile.in
Removing 3rdparty/libprocess/3rdparty/gmock_sources.cc
Removing 3rdparty/libprocess/3rdparty/stout/Makefile
Removing 3rdparty/libprocess/3rdparty/stout/Makefile.in
Removing 3rdparty/libprocess/3rdparty/stout/aclocal.m4
Removing 3rdparty/libprocess/3rdparty/stout/autom4te.cache/
Removing 3rdparty/libprocess/3rdparty/stout/config.log
Removing 3rdparty/libprocess/3rdparty/stout/config.status
Removing 3rdparty/libprocess/3rdparty/stout/configure
Removing 3rdparty/libprocess/3rdparty/stout/include/Makefile
Removing 3rdparty/libprocess/3rdparty/stout/include/Makefile.in
Removing 3rdparty/libprocess/3rdparty/stout/missing
Removing 3rdparty/libprocess/Makefile
Removing 3rdparty/libprocess/Makefile.in
Removing 3rdparty/libprocess/aclocal.m4
Removing 3rdparty/libprocess/ar-lib
Removing 3rdparty/libprocess/autom4te.cache/
Removing 3rdparty/libprocess/compile
Removing 3rdparty/libprocess/config.guess
Removing 3rdparty/libprocess/config.log
Removing 3rdparty/libprocess/config.lt
Removing 3rdparty/libprocess/config.status
Removing 3rdparty/libprocess/config.sub
Removing 3rdparty/libprocess/configure
Removing 3rdparty/libprocess/depcomp
Removing 3rdparty/libprocess/include/Makefile
Removing 3rdparty/libprocess/include/Makefile.in
Removing 3rdparty/libprocess/libtool
Removing 3rdparty/libprocess/ltmain.sh
Removing 3rdparty/libprocess/m4/libtool.m4
Removing 3rdparty/libprocess/m4/ltoptions.m4
Removing 3rdparty/libprocess/m4/ltsugar.m4
Removing 3rdparty/libprocess/m4/ltversion.m4
Removing 3rdparty/libprocess/m4/lt~obsolete.m4
Removing 3rdparty/libprocess/missing
Removing Makefile
Removing Makefile.in
Removing aclocal.m4
Removing ar-lib
Removing autom4te.cache/
Removing bin/gdb-mesos-local.sh
Removing bin/gdb-mesos-master.sh
Removing bin/gdb-mesos-slave.sh
Removing bin/gdb-mesos-tests.sh
Removing bin/lldb-mesos-local.sh
Removing bin/lldb-mesos-master.sh
Removing bin/lldb-mesos-slave.sh
Removing bin/lldb-mesos-tests.sh
Removing bin/mesos-local-flags.sh
Removing bin/mesos-local.sh
Removing bin/mesos-master-flags.sh
Removing bin/mesos-master.sh
Removing bin/mesos-slave-flags.sh
Removing bin/mesos-slave.sh
Removing bin/mesos-tests-flags.sh
Removing bin/mesos-tests.sh
Removing bin/mesos.sh
Removing bin/valgrind-mesos-local.sh
Removing bin/valgrind-mesos-master.sh
Removing bin/valgrind-mesos-slave.sh
Removing bin/valgrind-mesos-tests.sh
Removing compile
Removing config.guess
Removing config.log
Removing config.lt
Removing config.status
Removing config.sub
Removing configure
Removing depcomp
Removing include/mesos/version.hpp
Removing install-sh
Removing libtool
Removing ltmain.sh
Removing m4/libtool.m4
Removing m4/ltoptions.m4
Removing m4/ltsugar.m4
Removing m4/ltversion.m4
Removing m4/lt~obsolete.m4
Removing mesos-0.24.0.tar.gz
Removing mesos.pc
Removing missing
Removing mpi/mpiexec-mesos
Removing src/.deps/
Removing src/Makefile
Removing src/Makefile.in
Removing src/authentication/.deps/
Removing src/authentication/cram_md5/.deps/
Removing src/authorizer/.deps/
Removing src/cli/.deps/
Removing src/common/.deps/
Removing src/containerizer/
Removing src/deploy/mesos-daemon.sh
Removing src/deploy/mesos-start-cluster.sh
Removing src/deploy/mesos-start-masters.sh
Removing src/deploy/mesos-start-slaves.sh
Removing src/deploy/mesos-stop-cluster.sh
Removing src/deploy/mesos-stop-masters.sh
Removing src/deploy/mesos-stop-slaves.sh
Removing src/docker/.deps/
Removing src/examples/.deps/
Removing src/examples/java/test-exception-framework
Removing src/examples/java/test-executor
Removing src/examples/java/test-framework
Removing src/examples/java/test-log
Removing src/examples/java/test-multiple-executors-framework
Removing src/examples/python/test-containerizer
Removing src/examples/python/test-executor
Removing src/examples/python/test-framework
Removing src/exec/.deps/
Removing src/executor/
Removing src/fetcher/
Removing src/files/.deps/
Removing src/health-check/.deps/
Removing src/hook/.deps/
Removing src/java/generated/org/apache/mesos/MesosNativeLibrary.java
Removing src/java/jni/.deps/
Removing src/java/mesos.pom
Removing src/jvm/.deps/
Removing src/jvm/org/apache/.deps/
Removing src/launcher/.deps/
Removing src/linux/.deps/
Removing src/linux/routing/.deps/
Removing src/linux/routing/diagnosis/.deps/
Removing src/linux/routing/filter/.deps/
Removing src/linux/routing/link/.deps/
Removing src/linux/routing/queueing/.deps/
Removing src/local/.deps/
Removing src/log/.deps/
Removing src/log/tool/.deps/
Removing src/logging/.deps/
Removing src/master/.deps/
Removing src/master/allocator/.deps/
Removing src/master/allocator/sorter/drf/.deps/
Removing src/messages/.deps/
Removing src/module/.deps/
Removing src/python/interface/setup.py
Removing src/python/native/ext_modules.py
Removing src/python/native/setup.py
Removing src/python/setup.py
Removing src/sched/.deps/
Removing src/scheduler/.deps/
Removing src/slave/.deps/
Removing src/slave/containerizer/.deps/
Removing src/slave/containerizer/isolators/cgroups/.deps/
Removing src/slave/containerizer/isolators/filesystem/.deps/
Removing src/slave/containerizer/isolators/namespaces/.deps/
Removing src/slave/containerizer/isolators/network/.deps/
Removing src/slave/containerizer/isolators/posix/.deps/
Removing src/slave/containerizer/mesos/.deps/
Removing src/slave/resource_estimators/.deps/
Removing src/state/.deps/
Removing src/tests/.deps/
Removing src/tests/common/.deps/
Removing src/usage/.deps/
Removing src/watcher/.deps/
Removing src/zookeeper/.deps/
+ git reset --hard HEAD
HEAD is now at a7de651 Replaced tabs with spaces and fixed line length.
+ date
Mon Jul 20 20:27:54 UTC 2015
+ set +x
git rev-parse HEAD
Checking if review: 34142 needs verification
Skipping blocking review 34142
Checking if review: 36586 needs verification
Latest diff timestamp: 2015-07-17 23:07:29
Latest review timestamp: 2015-07-18 00:00:12
Checking if review: 34140 needs verification
Skipping blocking review 34140
Checking if review: 36318 needs verification
Latest diff timestamp: 2015-07-15 04:39:31
Latest review timestamp: 2015-07-15 05:30:02
Checking if review: 36185 needs verification
Latest diff timestamp: 2015-07-11 08:45:01
Latest review timestamp: 2015-07-11 09:38:12
Checking if review: 35797 needs verification
Latest diff timestamp: 2015-07-18 14:22:16
Latest review timestamp: 2015-07-18 15:35:06
Checking if review: 36574 needs verification
Skipping blocking review 36574
Checking if review: 36575 needs verification
Skipping blocking review 36575
Checking if review: 36596 needs verification
Skipping blocking review 36596
Checking if review: 36585 needs verification
Latest diff timestamp: 2015-07-19 00:32:55
Latest review timestamp: 2015-07-19 00:57:58
Checking if review: 36580 needs verification
Skipping blocking review 36580
Checking if review: 36603 needs verification
Latest diff timestamp: 2015-07-19 17:39:17
Traceback (most recent call last):
  File "./support/verify_reviews.py", line 193, in <module>
    needs_verification(review_request):
  File "./support/verify_reviews.py", line 171, in needs_verification
    changes = api(changes_url)
  File "./support/verify_reviews.py", line 61, in api
    return json.loads(urllib2.urlopen(url, data=data).read())
  File "/usr/lib/python2.7/urllib2.py", line 127, in urlopen
    return _opener.open(url, data, timeout)
  File "/usr/lib/python2.7/urllib2.py", line 410, in open
    response = meth(req, response)
  File "/usr/lib/python2.7/urllib2.py", line 523, in http_response
    'http', request, response, code, msg, hdrs)
  File "/usr/lib/python2.7/urllib2.py", line 448, in error
    return self._call_chain(*args)
  File "/usr/lib/python2.7/urllib2.py", line 382, in _call_chain
    result = func(*args)
  File "/usr/lib/python2.7/urllib2.py", line 531, in http_error_default
    raise HTTPError(req.get_full_url(), code, msg, hdrs, fp)
urllib2.HTTPError: HTTP Error 500: INTERNAL SERVER ERROR
git clean -fd
git reset --hard a7de6513cd2ff431a541e93c01858a0330584015

Build step 'Execute shell' marked build as failure

Build failed in Jenkins: mesos-reviewbot #7158

Posted by Apache Jenkins Server <je...@builds.apache.org>.
See <https://builds.apache.org/job/mesos-reviewbot/7158/>

------------------------------------------
[...truncated 6149 lines...]
rm -rf slave/containerizer/isolators/network/.libs slave/containerizer/isolators/network/_libs
rm -rf slave/containerizer/isolators/posix/.libs slave/containerizer/isolators/posix/_libs
rm -rf slave/containerizer/mesos/.libs slave/containerizer/mesos/_libs
rm -rf slave/resource_estimators/.libs slave/resource_estimators/_libs
rm -rf state/.libs state/_libs
rm -rf usage/.libs usage/_libs
rm -rf watcher/.libs watcher/_libs
rm -rf zookeeper/.libs zookeeper/_libs
rm -rf ./.deps authentication/.deps authentication/cram_md5/.deps authorizer/.deps cli/.deps common/.deps containerizer/.deps docker/.deps examples/.deps exec/.deps executor/.deps fetcher/.deps files/.deps health-check/.deps hook/.deps java/jni/.deps jvm/.deps jvm/org/apache/.deps launcher/.deps linux/.deps linux/routing/.deps linux/routing/diagnosis/.deps linux/routing/filter/.deps linux/routing/link/.deps linux/routing/queueing/.deps local/.deps log/.deps log/tool/.deps logging/.deps master/.deps master/allocator/.deps master/allocator/sorter/drf/.deps messages/.deps module/.deps sched/.deps scheduler/.deps slave/.deps slave/containerizer/.deps slave/containerizer/isolators/cgroups/.deps slave/containerizer/isolators/filesystem/.deps slave/containerizer/isolators/namespaces/.deps slave/containerizer/isolators/network/.deps slave/containerizer/isolators/posix/.deps slave/containerizer/mesos/.deps slave/resource_estimators/.deps state/.deps tests/.deps tests/common/.deps usage/.deps watcher/.deps zookeeper/.deps
rm -f Makefile
make[2]: Leaving directory `<https://builds.apache.org/job/mesos-reviewbot/ws/mesos-0.24.0/_build/src'>
rm -f config.status config.cache config.log configure.lineno config.status.lineno
rm -f Makefile
make[1]: Leaving directory `<https://builds.apache.org/job/mesos-reviewbot/ws/mesos-0.24.0/_build'>
if test -d "mesos-0.24.0"; then find "mesos-0.24.0" -type d ! -perm -200 -exec chmod u+w {} ';' && rm -rf "mesos-0.24.0" || { sleep 5 && rm -rf "mesos-0.24.0"; }; else :; fi
==============================================
mesos-0.24.0 archives ready for distribution: 
mesos-0.24.0.tar.gz
==============================================

real	14m2.714s
user	78m5.835s
sys	5m39.033s
+ chmod -R +w 3rdparty aclocal.m4 ar-lib autom4te.cache bin bootstrap CHANGELOG compile config.guess config.log config.lt config.status config.sub configure configure.ac depcomp Dockerfile docs Doxyfile include install-sh libtool LICENSE ltmain.sh m4 Makefile Makefile.am Makefile.in mesos-0.24.0.tar.gz mesos.pc mesos.pc.in missing mpi NOTICE README.md src support
+ git clean -fdx
Removing .clang-format
Removing .gitignore
Removing .libs/
Removing .reviewboardrc
Removing 3rdparty/Makefile
Removing 3rdparty/Makefile.in
Removing 3rdparty/libprocess/.deps/
Removing 3rdparty/libprocess/3rdparty/.deps/
Removing 3rdparty/libprocess/3rdparty/Makefile
Removing 3rdparty/libprocess/3rdparty/Makefile.in
Removing 3rdparty/libprocess/3rdparty/gmock_sources.cc
Removing 3rdparty/libprocess/3rdparty/stout/Makefile
Removing 3rdparty/libprocess/3rdparty/stout/Makefile.in
Removing 3rdparty/libprocess/3rdparty/stout/aclocal.m4
Removing 3rdparty/libprocess/3rdparty/stout/autom4te.cache/
Removing 3rdparty/libprocess/3rdparty/stout/config.log
Removing 3rdparty/libprocess/3rdparty/stout/config.status
Removing 3rdparty/libprocess/3rdparty/stout/configure
Removing 3rdparty/libprocess/3rdparty/stout/include/Makefile
Removing 3rdparty/libprocess/3rdparty/stout/include/Makefile.in
Removing 3rdparty/libprocess/3rdparty/stout/missing
Removing 3rdparty/libprocess/Makefile
Removing 3rdparty/libprocess/Makefile.in
Removing 3rdparty/libprocess/aclocal.m4
Removing 3rdparty/libprocess/ar-lib
Removing 3rdparty/libprocess/autom4te.cache/
Removing 3rdparty/libprocess/compile
Removing 3rdparty/libprocess/config.guess
Removing 3rdparty/libprocess/config.log
Removing 3rdparty/libprocess/config.lt
Removing 3rdparty/libprocess/config.status
Removing 3rdparty/libprocess/config.sub
Removing 3rdparty/libprocess/configure
Removing 3rdparty/libprocess/depcomp
Removing 3rdparty/libprocess/include/Makefile
Removing 3rdparty/libprocess/include/Makefile.in
Removing 3rdparty/libprocess/libtool
Removing 3rdparty/libprocess/ltmain.sh
Removing 3rdparty/libprocess/m4/libtool.m4
Removing 3rdparty/libprocess/m4/ltoptions.m4
Removing 3rdparty/libprocess/m4/ltsugar.m4
Removing 3rdparty/libprocess/m4/ltversion.m4
Removing 3rdparty/libprocess/m4/lt~obsolete.m4
Removing 3rdparty/libprocess/missing
Removing Makefile
Removing Makefile.in
Removing aclocal.m4
Removing ar-lib
Removing autom4te.cache/
Removing bin/gdb-mesos-local.sh
Removing bin/gdb-mesos-master.sh
Removing bin/gdb-mesos-slave.sh
Removing bin/gdb-mesos-tests.sh
Removing bin/lldb-mesos-local.sh
Removing bin/lldb-mesos-master.sh
Removing bin/lldb-mesos-slave.sh
Removing bin/lldb-mesos-tests.sh
Removing bin/mesos-local-flags.sh
Removing bin/mesos-local.sh
Removing bin/mesos-master-flags.sh
Removing bin/mesos-master.sh
Removing bin/mesos-slave-flags.sh
Removing bin/mesos-slave.sh
Removing bin/mesos-tests-flags.sh
Removing bin/mesos-tests.sh
Removing bin/mesos.sh
Removing bin/valgrind-mesos-local.sh
Removing bin/valgrind-mesos-master.sh
Removing bin/valgrind-mesos-slave.sh
Removing bin/valgrind-mesos-tests.sh
Removing compile
Removing config.guess
Removing config.log
Removing config.lt
Removing config.status
Removing config.sub
Removing configure
Removing depcomp
Removing include/mesos/version.hpp
Removing install-sh
Removing libtool
Removing ltmain.sh
Removing m4/libtool.m4
Removing m4/ltoptions.m4
Removing m4/ltsugar.m4
Removing m4/ltversion.m4
Removing m4/lt~obsolete.m4
Removing mesos-0.24.0.tar.gz
Removing mesos.pc
Removing missing
Removing mpi/mpiexec-mesos
Removing src/.deps/
Removing src/Makefile
Removing src/Makefile.in
Removing src/authentication/.deps/
Removing src/authentication/cram_md5/.deps/
Removing src/authorizer/.deps/
Removing src/cli/.deps/
Removing src/common/.deps/
Removing src/containerizer/
Removing src/deploy/mesos-daemon.sh
Removing src/deploy/mesos-start-cluster.sh
Removing src/deploy/mesos-start-masters.sh
Removing src/deploy/mesos-start-slaves.sh
Removing src/deploy/mesos-stop-cluster.sh
Removing src/deploy/mesos-stop-masters.sh
Removing src/deploy/mesos-stop-slaves.sh
Removing src/docker/.deps/
Removing src/examples/.deps/
Removing src/examples/java/test-exception-framework
Removing src/examples/java/test-executor
Removing src/examples/java/test-framework
Removing src/examples/java/test-log
Removing src/examples/java/test-multiple-executors-framework
Removing src/examples/python/test-containerizer
Removing src/examples/python/test-executor
Removing src/examples/python/test-framework
Removing src/exec/.deps/
Removing src/executor/
Removing src/fetcher/
Removing src/files/.deps/
Removing src/health-check/.deps/
Removing src/hook/.deps/
Removing src/java/generated/org/apache/mesos/MesosNativeLibrary.java
Removing src/java/jni/.deps/
Removing src/java/mesos.pom
Removing src/jvm/.deps/
Removing src/jvm/org/apache/.deps/
Removing src/launcher/.deps/
Removing src/linux/.deps/
Removing src/linux/routing/.deps/
Removing src/linux/routing/diagnosis/.deps/
Removing src/linux/routing/filter/.deps/
Removing src/linux/routing/link/.deps/
Removing src/linux/routing/queueing/.deps/
Removing src/local/.deps/
Removing src/log/.deps/
Removing src/log/tool/.deps/
Removing src/logging/.deps/
Removing src/master/.deps/
Removing src/master/allocator/.deps/
Removing src/master/allocator/sorter/drf/.deps/
Removing src/messages/.deps/
Removing src/module/.deps/
Removing src/python/interface/setup.py
Removing src/python/native/ext_modules.py
Removing src/python/native/setup.py
Removing src/python/setup.py
Removing src/sched/.deps/
Removing src/scheduler/.deps/
Removing src/slave/.deps/
Removing src/slave/containerizer/.deps/
Removing src/slave/containerizer/isolators/cgroups/.deps/
Removing src/slave/containerizer/isolators/filesystem/.deps/
Removing src/slave/containerizer/isolators/namespaces/.deps/
Removing src/slave/containerizer/isolators/network/.deps/
Removing src/slave/containerizer/isolators/posix/.deps/
Removing src/slave/containerizer/mesos/.deps/
Removing src/slave/resource_estimators/.deps/
Removing src/state/.deps/
Removing src/tests/.deps/
Removing src/tests/common/.deps/
Removing src/usage/.deps/
Removing src/watcher/.deps/
Removing src/zookeeper/.deps/
+ git reset --hard HEAD
HEAD is now at a7de651 Replaced tabs with spaces and fixed line length.
+ date
Mon Jul 20 20:02:45 UTC 2015
+ set +x
git rev-parse HEAD
Checking if review: 34142 needs verification
Skipping blocking review 34142
Checking if review: 36586 needs verification
Latest diff timestamp: 2015-07-17 23:07:29
Latest review timestamp: 2015-07-18 00:00:12
Checking if review: 34140 needs verification
Skipping blocking review 34140
Checking if review: 36318 needs verification
Latest diff timestamp: 2015-07-15 04:39:31
Latest review timestamp: 2015-07-15 05:30:02
Checking if review: 36185 needs verification
Latest diff timestamp: 2015-07-11 08:45:01
Latest review timestamp: 2015-07-11 09:38:12
Checking if review: 35797 needs verification
Latest diff timestamp: 2015-07-18 14:22:16
Latest review timestamp: 2015-07-18 15:35:06
Checking if review: 36574 needs verification
Skipping blocking review 36574
Checking if review: 36575 needs verification
Skipping blocking review 36575
Checking if review: 36596 needs verification
Skipping blocking review 36596
Checking if review: 36585 needs verification
Latest diff timestamp: 2015-07-19 00:32:55
Latest review timestamp: 2015-07-19 00:57:58
Checking if review: 36580 needs verification
Skipping blocking review 36580
Checking if review: 36603 needs verification
Latest diff timestamp: 2015-07-19 17:39:17
Traceback (most recent call last):
  File "./support/verify_reviews.py", line 193, in <module>
    needs_verification(review_request):
  File "./support/verify_reviews.py", line 171, in needs_verification
    changes = api(changes_url)
  File "./support/verify_reviews.py", line 61, in api
    return json.loads(urllib2.urlopen(url, data=data).read())
  File "/usr/lib/python2.7/urllib2.py", line 127, in urlopen
    return _opener.open(url, data, timeout)
  File "/usr/lib/python2.7/urllib2.py", line 410, in open
    response = meth(req, response)
  File "/usr/lib/python2.7/urllib2.py", line 523, in http_response
    'http', request, response, code, msg, hdrs)
  File "/usr/lib/python2.7/urllib2.py", line 448, in error
    return self._call_chain(*args)
  File "/usr/lib/python2.7/urllib2.py", line 382, in _call_chain
    result = func(*args)
  File "/usr/lib/python2.7/urllib2.py", line 531, in http_error_default
    raise HTTPError(req.get_full_url(), code, msg, hdrs, fp)
urllib2.HTTPError: HTTP Error 500: INTERNAL SERVER ERROR
git clean -fd
git reset --hard a7de6513cd2ff431a541e93c01858a0330584015

Build step 'Execute shell' marked build as failure

Re: Build failed in Jenkins: mesos-reviewbot #7157

Posted by Jake Farrell <jf...@apache.org>.
Reviewboard was throwing a `ReviewRequest matching query does not exist`
error, but I was able to access the request by going to the view diff page
for that review. From there I was able to deleted the review so it will not
show up in any of the open for review lists. Can you resubmit that patch
set for review again

-Jake



On Mon, Jul 20, 2015 at 3:49 PM, Benjamin Mahler <be...@gmail.com>
wrote:

> +jfarrell
>
> Looks like https://reviews.apache.org/r/36603/ fails with a 500..
>
> On Mon, Jul 20, 2015 at 12:46 PM, Apache Jenkins Server <
> jenkins@builds.apache.org> wrote:
>
>> See <https://builds.apache.org/job/mesos-reviewbot/7157/changes>
>>
>> Changes:
>>
>> [benjamin.mahler] Replaced tabs with spaces and fixed line length.
>>
>> ------------------------------------------
>> [...truncated 6246 lines...]
>> rm -rf slave/containerizer/isolators/network/.libs
>> slave/containerizer/isolators/network/_libs
>> rm -rf slave/containerizer/isolators/posix/.libs
>> slave/containerizer/isolators/posix/_libs
>> rm -rf slave/containerizer/mesos/.libs slave/containerizer/mesos/_libs
>> rm -rf slave/resource_estimators/.libs slave/resource_estimators/_libs
>> rm -rf state/.libs state/_libs
>> rm -rf usage/.libs usage/_libs
>> rm -rf watcher/.libs watcher/_libs
>> rm -rf zookeeper/.libs zookeeper/_libs
>> rm -rf ./.deps authentication/.deps authentication/cram_md5/.deps
>> authorizer/.deps cli/.deps common/.deps containerizer/.deps docker/.deps
>> examples/.deps exec/.deps executor/.deps fetcher/.deps files/.deps
>> health-check/.deps hook/.deps java/jni/.deps jvm/.deps jvm/org/apache/.deps
>> launcher/.deps linux/.deps linux/routing/.deps
>> linux/routing/diagnosis/.deps linux/routing/filter/.deps
>> linux/routing/link/.deps linux/routing/queueing/.deps local/.deps log/.deps
>> log/tool/.deps logging/.deps master/.deps master/allocator/.deps
>> master/allocator/sorter/drf/.deps messages/.deps module/.deps sched/.deps
>> scheduler/.deps slave/.deps slave/containerizer/.deps
>> slave/containerizer/isolators/cgroups/.deps
>> slave/containerizer/isolators/filesystem/.deps
>> slave/containerizer/isolators/namespaces/.deps
>> slave/containerizer/isolators/network/.deps
>> slave/containerizer/isolators/posix/.deps slave/containerizer/mesos/.deps
>> slave/resource_estimators/.deps state/.deps tests/.deps tests/common/.deps
>> usage/.deps watcher/.deps zookeeper/.deps
>> rm -f Makefile
>> make[2]: Leaving directory `<
>> https://builds.apache.org/job/mesos-reviewbot/ws/mesos-0.24.0/_build/src
>> '>
>> rm -f config.status config.cache config.log configure.lineno
>> config.status.lineno
>> rm -f Makefile
>> make[1]: Leaving directory `<
>> https://builds.apache.org/job/mesos-reviewbot/ws/mesos-0.24.0/_build'>
>> if test -d "mesos-0.24.0"; then find "mesos-0.24.0" -type d ! -perm -200
>> -exec chmod u+w {} ';' && rm -rf "mesos-0.24.0" || { sleep 5 && rm -rf
>> "mesos-0.24.0"; }; else :; fi
>> ==============================================
>> mesos-0.24.0 archives ready for distribution:
>> mesos-0.24.0.tar.gz
>> ==============================================
>>
>> real    13m41.243s
>> user    74m31.396s
>> sys     5m56.444s
>> + chmod -R +w 3rdparty aclocal.m4 ar-lib autom4te.cache bin bootstrap
>> CHANGELOG compile config.guess config.log config.lt config.status
>> config.sub configure configure.ac depcomp Dockerfile docs Doxyfile
>> include install-sh libtool LICENSE ltmain.sh m4 Makefile Makefile.am
>> Makefile.in mesos-0.24.0.tar.gz mesos.pc mesos.pc.in missing mpi NOTICE
>> README.md src support
>> + git clean -fdx
>> Removing .clang-format
>> Removing .gitignore
>> Removing .libs/
>> Removing .reviewboardrc
>> Removing 3rdparty/Makefile
>> Removing 3rdparty/Makefile.in
>> Removing 3rdparty/libprocess/.deps/
>> Removing 3rdparty/libprocess/3rdparty/.deps/
>> Removing 3rdparty/libprocess/3rdparty/Makefile
>> Removing 3rdparty/libprocess/3rdparty/Makefile.in
>> Removing 3rdparty/libprocess/3rdparty/gmock_sources.cc
>> Removing 3rdparty/libprocess/3rdparty/stout/Makefile
>> Removing 3rdparty/libprocess/3rdparty/stout/Makefile.in
>> Removing 3rdparty/libprocess/3rdparty/stout/aclocal.m4
>> Removing 3rdparty/libprocess/3rdparty/stout/autom4te.cache/
>> Removing 3rdparty/libprocess/3rdparty/stout/config.log
>> Removing 3rdparty/libprocess/3rdparty/stout/config.status
>> Removing 3rdparty/libprocess/3rdparty/stout/configure
>> Removing 3rdparty/libprocess/3rdparty/stout/include/Makefile
>> Removing 3rdparty/libprocess/3rdparty/stout/include/Makefile.in
>> Removing 3rdparty/libprocess/3rdparty/stout/missing
>> Removing 3rdparty/libprocess/Makefile
>> Removing 3rdparty/libprocess/Makefile.in
>> Removing 3rdparty/libprocess/aclocal.m4
>> Removing 3rdparty/libprocess/ar-lib
>> Removing 3rdparty/libprocess/autom4te.cache/
>> Removing 3rdparty/libprocess/compile
>> Removing 3rdparty/libprocess/config.guess
>> Removing 3rdparty/libprocess/config.log
>> Removing 3rdparty/libprocess/config.lt
>> Removing 3rdparty/libprocess/config.status
>> Removing 3rdparty/libprocess/config.sub
>> Removing 3rdparty/libprocess/configure
>> Removing 3rdparty/libprocess/depcomp
>> Removing 3rdparty/libprocess/include/Makefile
>> Removing 3rdparty/libprocess/include/Makefile.in
>> Removing 3rdparty/libprocess/libtool
>> Removing 3rdparty/libprocess/ltmain.sh
>> Removing 3rdparty/libprocess/m4/libtool.m4
>> Removing 3rdparty/libprocess/m4/ltoptions.m4
>> Removing 3rdparty/libprocess/m4/ltsugar.m4
>> Removing 3rdparty/libprocess/m4/ltversion.m4
>> Removing 3rdparty/libprocess/m4/lt~obsolete.m4
>> Removing 3rdparty/libprocess/missing
>> Removing Makefile
>> Removing Makefile.in
>> Removing aclocal.m4
>> Removing ar-lib
>> Removing autom4te.cache/
>> Removing bin/gdb-mesos-local.sh
>> Removing bin/gdb-mesos-master.sh
>> Removing bin/gdb-mesos-slave.sh
>> Removing bin/gdb-mesos-tests.sh
>> Removing bin/lldb-mesos-local.sh
>> Removing bin/lldb-mesos-master.sh
>> Removing bin/lldb-mesos-slave.sh
>> Removing bin/lldb-mesos-tests.sh
>> Removing bin/mesos-local-flags.sh
>> Removing bin/mesos-local.sh
>> Removing bin/mesos-master-flags.sh
>> Removing bin/mesos-master.sh
>> Removing bin/mesos-slave-flags.sh
>> Removing bin/mesos-slave.sh
>> Removing bin/mesos-tests-flags.sh
>> Removing bin/mesos-tests.sh
>> Removing bin/mesos.sh
>> Removing bin/valgrind-mesos-local.sh
>> Removing bin/valgrind-mesos-master.sh
>> Removing bin/valgrind-mesos-slave.sh
>> Removing bin/valgrind-mesos-tests.sh
>> Removing compile
>> Removing config.guess
>> Removing config.log
>> Removing config.lt
>> Removing config.status
>> Removing config.sub
>> Removing configure
>> Removing depcomp
>> Removing include/mesos/version.hpp
>> Removing install-sh
>> Removing libtool
>> Removing ltmain.sh
>> Removing m4/libtool.m4
>> Removing m4/ltoptions.m4
>> Removing m4/ltsugar.m4
>> Removing m4/ltversion.m4
>> Removing m4/lt~obsolete.m4
>> Removing mesos-0.24.0.tar.gz
>> Removing mesos.pc
>> Removing missing
>> Removing mpi/mpiexec-mesos
>> Removing src/.deps/
>> Removing src/Makefile
>> Removing src/Makefile.in
>> Removing src/authentication/.deps/
>> Removing src/authentication/cram_md5/.deps/
>> Removing src/authorizer/.deps/
>> Removing src/cli/.deps/
>> Removing src/common/.deps/
>> Removing src/containerizer/
>> Removing src/deploy/mesos-daemon.sh
>> Removing src/deploy/mesos-start-cluster.sh
>> Removing src/deploy/mesos-start-masters.sh
>> Removing src/deploy/mesos-start-slaves.sh
>> Removing src/deploy/mesos-stop-cluster.sh
>> Removing src/deploy/mesos-stop-masters.sh
>> Removing src/deploy/mesos-stop-slaves.sh
>> Removing src/docker/.deps/
>> Removing src/examples/.deps/
>> Removing src/examples/java/test-exception-framework
>> Removing src/examples/java/test-executor
>> Removing src/examples/java/test-framework
>> Removing src/examples/java/test-log
>> Removing src/examples/java/test-multiple-executors-framework
>> Removing src/examples/python/test-containerizer
>> Removing src/examples/python/test-executor
>> Removing src/examples/python/test-framework
>> Removing src/exec/.deps/
>> Removing src/executor/
>> Removing src/fetcher/
>> Removing src/files/.deps/
>> Removing src/health-check/.deps/
>> Removing src/hook/.deps/
>> Removing src/java/generated/org/apache/mesos/MesosNativeLibrary.java
>> Removing src/java/jni/.deps/
>> Removing src/java/mesos.pom
>> Removing src/jvm/.deps/
>> Removing src/jvm/org/apache/.deps/
>> Removing src/launcher/.deps/
>> Removing src/linux/.deps/
>> Removing src/linux/routing/.deps/
>> Removing src/linux/routing/diagnosis/.deps/
>> Removing src/linux/routing/filter/.deps/
>> Removing src/linux/routing/link/.deps/
>> Removing src/linux/routing/queueing/.deps/
>> Removing src/local/.deps/
>> Removing src/log/.deps/
>> Removing src/log/tool/.deps/
>> Removing src/logging/.deps/
>> Removing src/master/.deps/
>> Removing src/master/allocator/.deps/
>> Removing src/master/allocator/sorter/drf/.deps/
>> Removing src/messages/.deps/
>> Removing src/module/.deps/
>> Removing src/python/interface/setup.py
>> Removing src/python/native/ext_modules.py
>> Removing src/python/native/setup.py
>> Removing src/python/setup.py
>> Removing src/sched/.deps/
>> Removing src/scheduler/.deps/
>> Removing src/slave/.deps/
>> Removing src/slave/containerizer/.deps/
>> Removing src/slave/containerizer/isolators/cgroups/.deps/
>> Removing src/slave/containerizer/isolators/filesystem/.deps/
>> Removing src/slave/containerizer/isolators/namespaces/.deps/
>> Removing src/slave/containerizer/isolators/network/.deps/
>> Removing src/slave/containerizer/isolators/posix/.deps/
>> Removing src/slave/containerizer/mesos/.deps/
>> Removing src/slave/resource_estimators/.deps/
>> Removing src/state/.deps/
>> Removing src/tests/.deps/
>> Removing src/tests/common/.deps/
>> Removing src/usage/.deps/
>> Removing src/watcher/.deps/
>> Removing src/zookeeper/.deps/
>> + git reset --hard HEAD
>> HEAD is now at a7de651 Replaced tabs with spaces and fixed line length.
>> + date
>> Mon Jul 20 19:46:53 UTC 2015
>> + set +x
>> git rev-parse HEAD
>> Checking if review: 34142 needs verification
>> Skipping blocking review 34142
>> Checking if review: 36586 needs verification
>> Latest diff timestamp: 2015-07-17 23:07:29
>> Latest review timestamp: 2015-07-18 00:00:12
>> Checking if review: 34140 needs verification
>> Skipping blocking review 34140
>> Checking if review: 36318 needs verification
>> Latest diff timestamp: 2015-07-15 04:39:31
>> Latest review timestamp: 2015-07-15 05:30:02
>> Checking if review: 36185 needs verification
>> Latest diff timestamp: 2015-07-11 08:45:01
>> Latest review timestamp: 2015-07-11 09:38:12
>> Checking if review: 35797 needs verification
>> Latest diff timestamp: 2015-07-18 14:22:16
>> Latest review timestamp: 2015-07-18 15:35:06
>> Checking if review: 36574 needs verification
>> Skipping blocking review 36574
>> Checking if review: 36575 needs verification
>> Skipping blocking review 36575
>> Checking if review: 36596 needs verification
>> Skipping blocking review 36596
>> Checking if review: 36585 needs verification
>> Latest diff timestamp: 2015-07-19 00:32:55
>> Latest review timestamp: 2015-07-19 00:57:58
>> Checking if review: 36580 needs verification
>> Skipping blocking review 36580
>> Checking if review: 36603 needs verification
>> Latest diff timestamp: 2015-07-19 17:39:17
>> Traceback (most recent call last):
>>   File "./support/verify_reviews.py", line 193, in <module>
>>     needs_verification(review_request):
>>   File "./support/verify_reviews.py", line 171, in needs_verification
>>     changes = api(changes_url)
>>   File "./support/verify_reviews.py", line 61, in api
>>     return json.loads(urllib2.urlopen(url, data=data).read())
>>   File "/usr/lib/python2.7/urllib2.py", line 127, in urlopen
>>     return _opener.open(url, data, timeout)
>>   File "/usr/lib/python2.7/urllib2.py", line 410, in open
>>     response = meth(req, response)
>>   File "/usr/lib/python2.7/urllib2.py", line 523, in http_response
>>     'http', request, response, code, msg, hdrs)
>>   File "/usr/lib/python2.7/urllib2.py", line 448, in error
>>     return self._call_chain(*args)
>>   File "/usr/lib/python2.7/urllib2.py", line 382, in _call_chain
>>     result = func(*args)
>>   File "/usr/lib/python2.7/urllib2.py", line 531, in http_error_default
>>     raise HTTPError(req.get_full_url(), code, msg, hdrs, fp)
>> urllib2.HTTPError: HTTP Error 500: INTERNAL SERVER ERROR
>> git clean -fd
>> git reset --hard a7de6513cd2ff431a541e93c01858a0330584015
>>
>> Build step 'Execute shell' marked build as failure
>>
>
>

Re: Build failed in Jenkins: mesos-reviewbot #7157

Posted by Benjamin Mahler <be...@gmail.com>.
+jfarrell

Looks like https://reviews.apache.org/r/36603/ fails with a 500..

On Mon, Jul 20, 2015 at 12:46 PM, Apache Jenkins Server <
jenkins@builds.apache.org> wrote:

> See <https://builds.apache.org/job/mesos-reviewbot/7157/changes>
>
> Changes:
>
> [benjamin.mahler] Replaced tabs with spaces and fixed line length.
>
> ------------------------------------------
> [...truncated 6246 lines...]
> rm -rf slave/containerizer/isolators/network/.libs
> slave/containerizer/isolators/network/_libs
> rm -rf slave/containerizer/isolators/posix/.libs
> slave/containerizer/isolators/posix/_libs
> rm -rf slave/containerizer/mesos/.libs slave/containerizer/mesos/_libs
> rm -rf slave/resource_estimators/.libs slave/resource_estimators/_libs
> rm -rf state/.libs state/_libs
> rm -rf usage/.libs usage/_libs
> rm -rf watcher/.libs watcher/_libs
> rm -rf zookeeper/.libs zookeeper/_libs
> rm -rf ./.deps authentication/.deps authentication/cram_md5/.deps
> authorizer/.deps cli/.deps common/.deps containerizer/.deps docker/.deps
> examples/.deps exec/.deps executor/.deps fetcher/.deps files/.deps
> health-check/.deps hook/.deps java/jni/.deps jvm/.deps jvm/org/apache/.deps
> launcher/.deps linux/.deps linux/routing/.deps
> linux/routing/diagnosis/.deps linux/routing/filter/.deps
> linux/routing/link/.deps linux/routing/queueing/.deps local/.deps log/.deps
> log/tool/.deps logging/.deps master/.deps master/allocator/.deps
> master/allocator/sorter/drf/.deps messages/.deps module/.deps sched/.deps
> scheduler/.deps slave/.deps slave/containerizer/.deps
> slave/containerizer/isolators/cgroups/.deps
> slave/containerizer/isolators/filesystem/.deps
> slave/containerizer/isolators/namespaces/.deps
> slave/containerizer/isolators/network/.deps
> slave/containerizer/isolators/posix/.deps slave/containerizer/mesos/.deps
> slave/resource_estimators/.deps state/.deps tests/.deps tests/common/.deps
> usage/.deps watcher/.deps zookeeper/.deps
> rm -f Makefile
> make[2]: Leaving directory `<
> https://builds.apache.org/job/mesos-reviewbot/ws/mesos-0.24.0/_build/src'>
> rm -f config.status config.cache config.log configure.lineno
> config.status.lineno
> rm -f Makefile
> make[1]: Leaving directory `<
> https://builds.apache.org/job/mesos-reviewbot/ws/mesos-0.24.0/_build'>
> if test -d "mesos-0.24.0"; then find "mesos-0.24.0" -type d ! -perm -200
> -exec chmod u+w {} ';' && rm -rf "mesos-0.24.0" || { sleep 5 && rm -rf
> "mesos-0.24.0"; }; else :; fi
> ==============================================
> mesos-0.24.0 archives ready for distribution:
> mesos-0.24.0.tar.gz
> ==============================================
>
> real    13m41.243s
> user    74m31.396s
> sys     5m56.444s
> + chmod -R +w 3rdparty aclocal.m4 ar-lib autom4te.cache bin bootstrap
> CHANGELOG compile config.guess config.log config.lt config.status
> config.sub configure configure.ac depcomp Dockerfile docs Doxyfile
> include install-sh libtool LICENSE ltmain.sh m4 Makefile Makefile.am
> Makefile.in mesos-0.24.0.tar.gz mesos.pc mesos.pc.in missing mpi NOTICE
> README.md src support
> + git clean -fdx
> Removing .clang-format
> Removing .gitignore
> Removing .libs/
> Removing .reviewboardrc
> Removing 3rdparty/Makefile
> Removing 3rdparty/Makefile.in
> Removing 3rdparty/libprocess/.deps/
> Removing 3rdparty/libprocess/3rdparty/.deps/
> Removing 3rdparty/libprocess/3rdparty/Makefile
> Removing 3rdparty/libprocess/3rdparty/Makefile.in
> Removing 3rdparty/libprocess/3rdparty/gmock_sources.cc
> Removing 3rdparty/libprocess/3rdparty/stout/Makefile
> Removing 3rdparty/libprocess/3rdparty/stout/Makefile.in
> Removing 3rdparty/libprocess/3rdparty/stout/aclocal.m4
> Removing 3rdparty/libprocess/3rdparty/stout/autom4te.cache/
> Removing 3rdparty/libprocess/3rdparty/stout/config.log
> Removing 3rdparty/libprocess/3rdparty/stout/config.status
> Removing 3rdparty/libprocess/3rdparty/stout/configure
> Removing 3rdparty/libprocess/3rdparty/stout/include/Makefile
> Removing 3rdparty/libprocess/3rdparty/stout/include/Makefile.in
> Removing 3rdparty/libprocess/3rdparty/stout/missing
> Removing 3rdparty/libprocess/Makefile
> Removing 3rdparty/libprocess/Makefile.in
> Removing 3rdparty/libprocess/aclocal.m4
> Removing 3rdparty/libprocess/ar-lib
> Removing 3rdparty/libprocess/autom4te.cache/
> Removing 3rdparty/libprocess/compile
> Removing 3rdparty/libprocess/config.guess
> Removing 3rdparty/libprocess/config.log
> Removing 3rdparty/libprocess/config.lt
> Removing 3rdparty/libprocess/config.status
> Removing 3rdparty/libprocess/config.sub
> Removing 3rdparty/libprocess/configure
> Removing 3rdparty/libprocess/depcomp
> Removing 3rdparty/libprocess/include/Makefile
> Removing 3rdparty/libprocess/include/Makefile.in
> Removing 3rdparty/libprocess/libtool
> Removing 3rdparty/libprocess/ltmain.sh
> Removing 3rdparty/libprocess/m4/libtool.m4
> Removing 3rdparty/libprocess/m4/ltoptions.m4
> Removing 3rdparty/libprocess/m4/ltsugar.m4
> Removing 3rdparty/libprocess/m4/ltversion.m4
> Removing 3rdparty/libprocess/m4/lt~obsolete.m4
> Removing 3rdparty/libprocess/missing
> Removing Makefile
> Removing Makefile.in
> Removing aclocal.m4
> Removing ar-lib
> Removing autom4te.cache/
> Removing bin/gdb-mesos-local.sh
> Removing bin/gdb-mesos-master.sh
> Removing bin/gdb-mesos-slave.sh
> Removing bin/gdb-mesos-tests.sh
> Removing bin/lldb-mesos-local.sh
> Removing bin/lldb-mesos-master.sh
> Removing bin/lldb-mesos-slave.sh
> Removing bin/lldb-mesos-tests.sh
> Removing bin/mesos-local-flags.sh
> Removing bin/mesos-local.sh
> Removing bin/mesos-master-flags.sh
> Removing bin/mesos-master.sh
> Removing bin/mesos-slave-flags.sh
> Removing bin/mesos-slave.sh
> Removing bin/mesos-tests-flags.sh
> Removing bin/mesos-tests.sh
> Removing bin/mesos.sh
> Removing bin/valgrind-mesos-local.sh
> Removing bin/valgrind-mesos-master.sh
> Removing bin/valgrind-mesos-slave.sh
> Removing bin/valgrind-mesos-tests.sh
> Removing compile
> Removing config.guess
> Removing config.log
> Removing config.lt
> Removing config.status
> Removing config.sub
> Removing configure
> Removing depcomp
> Removing include/mesos/version.hpp
> Removing install-sh
> Removing libtool
> Removing ltmain.sh
> Removing m4/libtool.m4
> Removing m4/ltoptions.m4
> Removing m4/ltsugar.m4
> Removing m4/ltversion.m4
> Removing m4/lt~obsolete.m4
> Removing mesos-0.24.0.tar.gz
> Removing mesos.pc
> Removing missing
> Removing mpi/mpiexec-mesos
> Removing src/.deps/
> Removing src/Makefile
> Removing src/Makefile.in
> Removing src/authentication/.deps/
> Removing src/authentication/cram_md5/.deps/
> Removing src/authorizer/.deps/
> Removing src/cli/.deps/
> Removing src/common/.deps/
> Removing src/containerizer/
> Removing src/deploy/mesos-daemon.sh
> Removing src/deploy/mesos-start-cluster.sh
> Removing src/deploy/mesos-start-masters.sh
> Removing src/deploy/mesos-start-slaves.sh
> Removing src/deploy/mesos-stop-cluster.sh
> Removing src/deploy/mesos-stop-masters.sh
> Removing src/deploy/mesos-stop-slaves.sh
> Removing src/docker/.deps/
> Removing src/examples/.deps/
> Removing src/examples/java/test-exception-framework
> Removing src/examples/java/test-executor
> Removing src/examples/java/test-framework
> Removing src/examples/java/test-log
> Removing src/examples/java/test-multiple-executors-framework
> Removing src/examples/python/test-containerizer
> Removing src/examples/python/test-executor
> Removing src/examples/python/test-framework
> Removing src/exec/.deps/
> Removing src/executor/
> Removing src/fetcher/
> Removing src/files/.deps/
> Removing src/health-check/.deps/
> Removing src/hook/.deps/
> Removing src/java/generated/org/apache/mesos/MesosNativeLibrary.java
> Removing src/java/jni/.deps/
> Removing src/java/mesos.pom
> Removing src/jvm/.deps/
> Removing src/jvm/org/apache/.deps/
> Removing src/launcher/.deps/
> Removing src/linux/.deps/
> Removing src/linux/routing/.deps/
> Removing src/linux/routing/diagnosis/.deps/
> Removing src/linux/routing/filter/.deps/
> Removing src/linux/routing/link/.deps/
> Removing src/linux/routing/queueing/.deps/
> Removing src/local/.deps/
> Removing src/log/.deps/
> Removing src/log/tool/.deps/
> Removing src/logging/.deps/
> Removing src/master/.deps/
> Removing src/master/allocator/.deps/
> Removing src/master/allocator/sorter/drf/.deps/
> Removing src/messages/.deps/
> Removing src/module/.deps/
> Removing src/python/interface/setup.py
> Removing src/python/native/ext_modules.py
> Removing src/python/native/setup.py
> Removing src/python/setup.py
> Removing src/sched/.deps/
> Removing src/scheduler/.deps/
> Removing src/slave/.deps/
> Removing src/slave/containerizer/.deps/
> Removing src/slave/containerizer/isolators/cgroups/.deps/
> Removing src/slave/containerizer/isolators/filesystem/.deps/
> Removing src/slave/containerizer/isolators/namespaces/.deps/
> Removing src/slave/containerizer/isolators/network/.deps/
> Removing src/slave/containerizer/isolators/posix/.deps/
> Removing src/slave/containerizer/mesos/.deps/
> Removing src/slave/resource_estimators/.deps/
> Removing src/state/.deps/
> Removing src/tests/.deps/
> Removing src/tests/common/.deps/
> Removing src/usage/.deps/
> Removing src/watcher/.deps/
> Removing src/zookeeper/.deps/
> + git reset --hard HEAD
> HEAD is now at a7de651 Replaced tabs with spaces and fixed line length.
> + date
> Mon Jul 20 19:46:53 UTC 2015
> + set +x
> git rev-parse HEAD
> Checking if review: 34142 needs verification
> Skipping blocking review 34142
> Checking if review: 36586 needs verification
> Latest diff timestamp: 2015-07-17 23:07:29
> Latest review timestamp: 2015-07-18 00:00:12
> Checking if review: 34140 needs verification
> Skipping blocking review 34140
> Checking if review: 36318 needs verification
> Latest diff timestamp: 2015-07-15 04:39:31
> Latest review timestamp: 2015-07-15 05:30:02
> Checking if review: 36185 needs verification
> Latest diff timestamp: 2015-07-11 08:45:01
> Latest review timestamp: 2015-07-11 09:38:12
> Checking if review: 35797 needs verification
> Latest diff timestamp: 2015-07-18 14:22:16
> Latest review timestamp: 2015-07-18 15:35:06
> Checking if review: 36574 needs verification
> Skipping blocking review 36574
> Checking if review: 36575 needs verification
> Skipping blocking review 36575
> Checking if review: 36596 needs verification
> Skipping blocking review 36596
> Checking if review: 36585 needs verification
> Latest diff timestamp: 2015-07-19 00:32:55
> Latest review timestamp: 2015-07-19 00:57:58
> Checking if review: 36580 needs verification
> Skipping blocking review 36580
> Checking if review: 36603 needs verification
> Latest diff timestamp: 2015-07-19 17:39:17
> Traceback (most recent call last):
>   File "./support/verify_reviews.py", line 193, in <module>
>     needs_verification(review_request):
>   File "./support/verify_reviews.py", line 171, in needs_verification
>     changes = api(changes_url)
>   File "./support/verify_reviews.py", line 61, in api
>     return json.loads(urllib2.urlopen(url, data=data).read())
>   File "/usr/lib/python2.7/urllib2.py", line 127, in urlopen
>     return _opener.open(url, data, timeout)
>   File "/usr/lib/python2.7/urllib2.py", line 410, in open
>     response = meth(req, response)
>   File "/usr/lib/python2.7/urllib2.py", line 523, in http_response
>     'http', request, response, code, msg, hdrs)
>   File "/usr/lib/python2.7/urllib2.py", line 448, in error
>     return self._call_chain(*args)
>   File "/usr/lib/python2.7/urllib2.py", line 382, in _call_chain
>     result = func(*args)
>   File "/usr/lib/python2.7/urllib2.py", line 531, in http_error_default
>     raise HTTPError(req.get_full_url(), code, msg, hdrs, fp)
> urllib2.HTTPError: HTTP Error 500: INTERNAL SERVER ERROR
> git clean -fd
> git reset --hard a7de6513cd2ff431a541e93c01858a0330584015
>
> Build step 'Execute shell' marked build as failure
>

Build failed in Jenkins: mesos-reviewbot #7157

Posted by Apache Jenkins Server <je...@builds.apache.org>.
See <https://builds.apache.org/job/mesos-reviewbot/7157/changes>

Changes:

[benjamin.mahler] Replaced tabs with spaces and fixed line length.

------------------------------------------
[...truncated 6246 lines...]
rm -rf slave/containerizer/isolators/network/.libs slave/containerizer/isolators/network/_libs
rm -rf slave/containerizer/isolators/posix/.libs slave/containerizer/isolators/posix/_libs
rm -rf slave/containerizer/mesos/.libs slave/containerizer/mesos/_libs
rm -rf slave/resource_estimators/.libs slave/resource_estimators/_libs
rm -rf state/.libs state/_libs
rm -rf usage/.libs usage/_libs
rm -rf watcher/.libs watcher/_libs
rm -rf zookeeper/.libs zookeeper/_libs
rm -rf ./.deps authentication/.deps authentication/cram_md5/.deps authorizer/.deps cli/.deps common/.deps containerizer/.deps docker/.deps examples/.deps exec/.deps executor/.deps fetcher/.deps files/.deps health-check/.deps hook/.deps java/jni/.deps jvm/.deps jvm/org/apache/.deps launcher/.deps linux/.deps linux/routing/.deps linux/routing/diagnosis/.deps linux/routing/filter/.deps linux/routing/link/.deps linux/routing/queueing/.deps local/.deps log/.deps log/tool/.deps logging/.deps master/.deps master/allocator/.deps master/allocator/sorter/drf/.deps messages/.deps module/.deps sched/.deps scheduler/.deps slave/.deps slave/containerizer/.deps slave/containerizer/isolators/cgroups/.deps slave/containerizer/isolators/filesystem/.deps slave/containerizer/isolators/namespaces/.deps slave/containerizer/isolators/network/.deps slave/containerizer/isolators/posix/.deps slave/containerizer/mesos/.deps slave/resource_estimators/.deps state/.deps tests/.deps tests/common/.deps usage/.deps watcher/.deps zookeeper/.deps
rm -f Makefile
make[2]: Leaving directory `<https://builds.apache.org/job/mesos-reviewbot/ws/mesos-0.24.0/_build/src'>
rm -f config.status config.cache config.log configure.lineno config.status.lineno
rm -f Makefile
make[1]: Leaving directory `<https://builds.apache.org/job/mesos-reviewbot/ws/mesos-0.24.0/_build'>
if test -d "mesos-0.24.0"; then find "mesos-0.24.0" -type d ! -perm -200 -exec chmod u+w {} ';' && rm -rf "mesos-0.24.0" || { sleep 5 && rm -rf "mesos-0.24.0"; }; else :; fi
==============================================
mesos-0.24.0 archives ready for distribution: 
mesos-0.24.0.tar.gz
==============================================

real	13m41.243s
user	74m31.396s
sys	5m56.444s
+ chmod -R +w 3rdparty aclocal.m4 ar-lib autom4te.cache bin bootstrap CHANGELOG compile config.guess config.log config.lt config.status config.sub configure configure.ac depcomp Dockerfile docs Doxyfile include install-sh libtool LICENSE ltmain.sh m4 Makefile Makefile.am Makefile.in mesos-0.24.0.tar.gz mesos.pc mesos.pc.in missing mpi NOTICE README.md src support
+ git clean -fdx
Removing .clang-format
Removing .gitignore
Removing .libs/
Removing .reviewboardrc
Removing 3rdparty/Makefile
Removing 3rdparty/Makefile.in
Removing 3rdparty/libprocess/.deps/
Removing 3rdparty/libprocess/3rdparty/.deps/
Removing 3rdparty/libprocess/3rdparty/Makefile
Removing 3rdparty/libprocess/3rdparty/Makefile.in
Removing 3rdparty/libprocess/3rdparty/gmock_sources.cc
Removing 3rdparty/libprocess/3rdparty/stout/Makefile
Removing 3rdparty/libprocess/3rdparty/stout/Makefile.in
Removing 3rdparty/libprocess/3rdparty/stout/aclocal.m4
Removing 3rdparty/libprocess/3rdparty/stout/autom4te.cache/
Removing 3rdparty/libprocess/3rdparty/stout/config.log
Removing 3rdparty/libprocess/3rdparty/stout/config.status
Removing 3rdparty/libprocess/3rdparty/stout/configure
Removing 3rdparty/libprocess/3rdparty/stout/include/Makefile
Removing 3rdparty/libprocess/3rdparty/stout/include/Makefile.in
Removing 3rdparty/libprocess/3rdparty/stout/missing
Removing 3rdparty/libprocess/Makefile
Removing 3rdparty/libprocess/Makefile.in
Removing 3rdparty/libprocess/aclocal.m4
Removing 3rdparty/libprocess/ar-lib
Removing 3rdparty/libprocess/autom4te.cache/
Removing 3rdparty/libprocess/compile
Removing 3rdparty/libprocess/config.guess
Removing 3rdparty/libprocess/config.log
Removing 3rdparty/libprocess/config.lt
Removing 3rdparty/libprocess/config.status
Removing 3rdparty/libprocess/config.sub
Removing 3rdparty/libprocess/configure
Removing 3rdparty/libprocess/depcomp
Removing 3rdparty/libprocess/include/Makefile
Removing 3rdparty/libprocess/include/Makefile.in
Removing 3rdparty/libprocess/libtool
Removing 3rdparty/libprocess/ltmain.sh
Removing 3rdparty/libprocess/m4/libtool.m4
Removing 3rdparty/libprocess/m4/ltoptions.m4
Removing 3rdparty/libprocess/m4/ltsugar.m4
Removing 3rdparty/libprocess/m4/ltversion.m4
Removing 3rdparty/libprocess/m4/lt~obsolete.m4
Removing 3rdparty/libprocess/missing
Removing Makefile
Removing Makefile.in
Removing aclocal.m4
Removing ar-lib
Removing autom4te.cache/
Removing bin/gdb-mesos-local.sh
Removing bin/gdb-mesos-master.sh
Removing bin/gdb-mesos-slave.sh
Removing bin/gdb-mesos-tests.sh
Removing bin/lldb-mesos-local.sh
Removing bin/lldb-mesos-master.sh
Removing bin/lldb-mesos-slave.sh
Removing bin/lldb-mesos-tests.sh
Removing bin/mesos-local-flags.sh
Removing bin/mesos-local.sh
Removing bin/mesos-master-flags.sh
Removing bin/mesos-master.sh
Removing bin/mesos-slave-flags.sh
Removing bin/mesos-slave.sh
Removing bin/mesos-tests-flags.sh
Removing bin/mesos-tests.sh
Removing bin/mesos.sh
Removing bin/valgrind-mesos-local.sh
Removing bin/valgrind-mesos-master.sh
Removing bin/valgrind-mesos-slave.sh
Removing bin/valgrind-mesos-tests.sh
Removing compile
Removing config.guess
Removing config.log
Removing config.lt
Removing config.status
Removing config.sub
Removing configure
Removing depcomp
Removing include/mesos/version.hpp
Removing install-sh
Removing libtool
Removing ltmain.sh
Removing m4/libtool.m4
Removing m4/ltoptions.m4
Removing m4/ltsugar.m4
Removing m4/ltversion.m4
Removing m4/lt~obsolete.m4
Removing mesos-0.24.0.tar.gz
Removing mesos.pc
Removing missing
Removing mpi/mpiexec-mesos
Removing src/.deps/
Removing src/Makefile
Removing src/Makefile.in
Removing src/authentication/.deps/
Removing src/authentication/cram_md5/.deps/
Removing src/authorizer/.deps/
Removing src/cli/.deps/
Removing src/common/.deps/
Removing src/containerizer/
Removing src/deploy/mesos-daemon.sh
Removing src/deploy/mesos-start-cluster.sh
Removing src/deploy/mesos-start-masters.sh
Removing src/deploy/mesos-start-slaves.sh
Removing src/deploy/mesos-stop-cluster.sh
Removing src/deploy/mesos-stop-masters.sh
Removing src/deploy/mesos-stop-slaves.sh
Removing src/docker/.deps/
Removing src/examples/.deps/
Removing src/examples/java/test-exception-framework
Removing src/examples/java/test-executor
Removing src/examples/java/test-framework
Removing src/examples/java/test-log
Removing src/examples/java/test-multiple-executors-framework
Removing src/examples/python/test-containerizer
Removing src/examples/python/test-executor
Removing src/examples/python/test-framework
Removing src/exec/.deps/
Removing src/executor/
Removing src/fetcher/
Removing src/files/.deps/
Removing src/health-check/.deps/
Removing src/hook/.deps/
Removing src/java/generated/org/apache/mesos/MesosNativeLibrary.java
Removing src/java/jni/.deps/
Removing src/java/mesos.pom
Removing src/jvm/.deps/
Removing src/jvm/org/apache/.deps/
Removing src/launcher/.deps/
Removing src/linux/.deps/
Removing src/linux/routing/.deps/
Removing src/linux/routing/diagnosis/.deps/
Removing src/linux/routing/filter/.deps/
Removing src/linux/routing/link/.deps/
Removing src/linux/routing/queueing/.deps/
Removing src/local/.deps/
Removing src/log/.deps/
Removing src/log/tool/.deps/
Removing src/logging/.deps/
Removing src/master/.deps/
Removing src/master/allocator/.deps/
Removing src/master/allocator/sorter/drf/.deps/
Removing src/messages/.deps/
Removing src/module/.deps/
Removing src/python/interface/setup.py
Removing src/python/native/ext_modules.py
Removing src/python/native/setup.py
Removing src/python/setup.py
Removing src/sched/.deps/
Removing src/scheduler/.deps/
Removing src/slave/.deps/
Removing src/slave/containerizer/.deps/
Removing src/slave/containerizer/isolators/cgroups/.deps/
Removing src/slave/containerizer/isolators/filesystem/.deps/
Removing src/slave/containerizer/isolators/namespaces/.deps/
Removing src/slave/containerizer/isolators/network/.deps/
Removing src/slave/containerizer/isolators/posix/.deps/
Removing src/slave/containerizer/mesos/.deps/
Removing src/slave/resource_estimators/.deps/
Removing src/state/.deps/
Removing src/tests/.deps/
Removing src/tests/common/.deps/
Removing src/usage/.deps/
Removing src/watcher/.deps/
Removing src/zookeeper/.deps/
+ git reset --hard HEAD
HEAD is now at a7de651 Replaced tabs with spaces and fixed line length.
+ date
Mon Jul 20 19:46:53 UTC 2015
+ set +x
git rev-parse HEAD
Checking if review: 34142 needs verification
Skipping blocking review 34142
Checking if review: 36586 needs verification
Latest diff timestamp: 2015-07-17 23:07:29
Latest review timestamp: 2015-07-18 00:00:12
Checking if review: 34140 needs verification
Skipping blocking review 34140
Checking if review: 36318 needs verification
Latest diff timestamp: 2015-07-15 04:39:31
Latest review timestamp: 2015-07-15 05:30:02
Checking if review: 36185 needs verification
Latest diff timestamp: 2015-07-11 08:45:01
Latest review timestamp: 2015-07-11 09:38:12
Checking if review: 35797 needs verification
Latest diff timestamp: 2015-07-18 14:22:16
Latest review timestamp: 2015-07-18 15:35:06
Checking if review: 36574 needs verification
Skipping blocking review 36574
Checking if review: 36575 needs verification
Skipping blocking review 36575
Checking if review: 36596 needs verification
Skipping blocking review 36596
Checking if review: 36585 needs verification
Latest diff timestamp: 2015-07-19 00:32:55
Latest review timestamp: 2015-07-19 00:57:58
Checking if review: 36580 needs verification
Skipping blocking review 36580
Checking if review: 36603 needs verification
Latest diff timestamp: 2015-07-19 17:39:17
Traceback (most recent call last):
  File "./support/verify_reviews.py", line 193, in <module>
    needs_verification(review_request):
  File "./support/verify_reviews.py", line 171, in needs_verification
    changes = api(changes_url)
  File "./support/verify_reviews.py", line 61, in api
    return json.loads(urllib2.urlopen(url, data=data).read())
  File "/usr/lib/python2.7/urllib2.py", line 127, in urlopen
    return _opener.open(url, data, timeout)
  File "/usr/lib/python2.7/urllib2.py", line 410, in open
    response = meth(req, response)
  File "/usr/lib/python2.7/urllib2.py", line 523, in http_response
    'http', request, response, code, msg, hdrs)
  File "/usr/lib/python2.7/urllib2.py", line 448, in error
    return self._call_chain(*args)
  File "/usr/lib/python2.7/urllib2.py", line 382, in _call_chain
    result = func(*args)
  File "/usr/lib/python2.7/urllib2.py", line 531, in http_error_default
    raise HTTPError(req.get_full_url(), code, msg, hdrs, fp)
urllib2.HTTPError: HTTP Error 500: INTERNAL SERVER ERROR
git clean -fd
git reset --hard a7de6513cd2ff431a541e93c01858a0330584015

Build step 'Execute shell' marked build as failure