You are viewing a plain text version of this content. The canonical link for it is here.
Posted to notifications@maven.apache.org by Apache Jenkins Server <je...@builds.apache.org> on 2021/08/08 05:18:07 UTC

Build failed in Jenkins: Maven » Maven TLP » maven-invoker-plugin » master #65

See https://ci-maven.apache.org/job/Maven/job/maven-box/job/maven-invoker-plugin/job/master/65/

Changes:

* Bump doxiaSitetoolsVersion from 1.9.2 to 1.10 (#48)

All tests passed

Build log:
[...truncated 4579 lines...]
[INFO] 
[INFO] --- maven-checkstyle-plugin:3.0.0:check (checkstyle-check) @ maven-invoker-plugin ---
[INFO] There are 4 errors reported by Checkstyle 6.18 with config/maven_checks.xml ruleset.
[INFO] Ignored 4 errors, 0 violation remaining.
[INFO] 
[INFO] --- maven-invoker-plugin:3.2.2:verify (integration-test) @ maven-invoker-plugin ---
[INFO] -------------------------------------------------
[INFO] Build Summary:
[INFO]   Passed: 74, Failed: 0, Errors: 0, Skipped: 2
[INFO] -------------------------------------------------
[ERROR] The following builds was skipped:
[ERROR] *  spaces-should-work_windows/pom.xml
[ERROR] *  settings-merge/pom.xml
[INFO] -------------------------------------------------
[INFO] ------------------------------------------------------------------------
[INFO] BUILD SUCCESS
[INFO] ------------------------------------------------------------------------
[INFO] Total time:  10:06 min
[INFO] Finished at: 2021-08-08T05:17:16Z
[INFO] ------------------------------------------------------------------------
[INFO] [jenkins-event-spy] Generated /home/jenkins/h49-shared/82467a7c/workspace/_box_maven-invoker-plugin_master@2@2@tmp/withMavenb1049dbc/maven-spy-20210808-050709-8753076109468001477262.log
[Pipeline] }
[Pipeline] // dir
[Pipeline] }
[withMaven] artifactsPublisher - Archive artifact linux-jdk11-m3.6.x_build/pom.xml under org/apache/maven/plugins/maven-invoker-plugin/3.2.3-SNAPSHOT/maven-invoker-plugin-3.2.3-SNAPSHOT.pom
[withMaven] artifactsPublisher - Archive artifact linux-jdk11-m3.6.x_build/target/maven-invoker-plugin-3.2.3-SNAPSHOT.jar under org/apache/maven/plugins/maven-invoker-plugin/3.2.3-SNAPSHOT/maven-invoker-plugin-3.2.3-SNAPSHOT.jar
[withMaven] junitPublisher - Archive test results for Maven artifact org.apache.maven.plugins:maven-invoker-plugin:maven-plugin:3.2.3-SNAPSHOT generated by maven-surefire-plugin:test (default-test): linux-jdk11-m3.6.x_build/target/surefire-reports/*.xml
Recording test results
[INFO] run post-build script verify.bsh
[INFO]           invocation-spaces/pom.xml ........................ SUCCESS (5.8 s)
[INFO] Building: fail-run-postbuild/pom.xml
[withMaven] Jenkins Task Scanner Plugin not found, don't display results of source code scanning for 'TODO' and 'FIXME' in pipeline screen.
[INFO] run post-build script verify.bsh
[INFO]           invocation-spaces/pom.xml ........................ SUCCESS (9.8 s)
[INFO] Building: fail-run-postbuild/pom.xml
[withMaven] invokerPublisher - Archive invoker results for Maven artifact MavenArtifact{org.apache.maven.plugins:maven-invoker-plugin:maven-plugin:3.2.3-SNAPSHOT(version: 3.2.3-SNAPSHOT, snapshot:false) } generated by PluginInvocation{org.apache.maven.plugins:maven-invoker-plugin:3.2.2@integration-test  integration-test}: linux-jdk11-m3.6.x_build/target/invoker-reports/*.xml
ERROR: [withMaven] invokerPublisher - Silently ignore exception archiving Invoker runs for Maven artifact MavenArtifact{org.apache.maven.plugins:maven-invoker-plugin:maven-plugin:3.2.3-SNAPSHOT(version: 3.2.3-SNAPSHOT, snapshot:false) } generated by PluginInvocation{org.apache.maven.plugins:maven-invoker-plugin:3.2.2@integration-test  integration-test}: java.io.IOException: Unknown attribute 'buildlog' for tag 'build-job' (position: START_TAG seen ...k11-m3.6.x_build/target/it/MINVOKER-190-logDirectory/build.log" />... @2:288) 
[withMaven] Publishers: Generated Artifacts Publisher: 530 ms, Junit Publisher: 1321 ms, Open Task Scanner Publisher: 1 ms, Invoker Publisher: 388 ms
[Pipeline] // withMaven
[Pipeline] cleanWs
[WS-CLEANUP] Deleting project workspace...
[WS-CLEANUP] Deferred wipeout is used...
[WS-CLEANUP] done
[Pipeline] }
[Pipeline] // stage
[Pipeline] }
[Pipeline] // ws
[Pipeline] }
[Pipeline] // node
[Pipeline] }
[INFO] run post-build script verify.bsh
[INFO]           invocation-spaces/pom.xml ........................ SUCCESS (10.8 s)
[INFO] Building: fail-run-postbuild/pom.xml
[INFO] run post-build script verify.bsh
[INFO]           fail-run-postbuild/pom.xml ....................... SUCCESS (4.9 s)
[INFO] Building: project-cloning/pom.xml
[INFO] run pre-build script setup.bsh
[INFO] run post-build script verify.bsh
[INFO]           fail-run-postbuild/pom.xml ....................... SUCCESS (8.8 s)
[INFO] Building: project-cloning/pom.xml
[INFO] run pre-build script setup.bsh
[INFO] run post-build script verify.bsh
[INFO]           fail-run-postbuild/pom.xml ....................... SUCCESS (8.3 s)
[INFO] Building: project-cloning/pom.xml
[INFO] run pre-build script setup.bsh
[INFO] run post-build script verify.bsh
[INFO]           project-cloning/pom.xml .......................... SUCCESS (6.3 s)
[INFO] Building: settings-inherit/pom.xml
[INFO]           settings-inherit/pom.xml ......................... SUCCESS (4.1 s)
[INFO] Building: script-context/pom.xml
[INFO] run post-build script verify.bsh
[INFO]           project-cloning/pom.xml .......................... SUCCESS (10.7 s)
[INFO] Building: settings-inherit/pom.xml
[INFO] run post-build script verify.bsh
[INFO]           script-context/pom.xml ........................... SUCCESS (6.4 s)
[INFO] 
[INFO] --- maven-checkstyle-plugin:3.0.0:check (checkstyle-check) @ maven-invoker-plugin ---
[INFO] run post-build script verify.bsh
[INFO]           project-cloning/pom.xml .......................... SUCCESS (10.3 s)
[INFO] Building: settings-inherit/pom.xml
[INFO] There are 4 errors reported by Checkstyle 6.18 with config/maven_checks.xml ruleset.
[INFO] Ignored 4 errors, 0 violation remaining.
[INFO] 
[INFO] --- maven-invoker-plugin:3.2.2:verify (integration-test) @ maven-invoker-plugin ---
[INFO] -------------------------------------------------
[INFO] Build Summary:
[INFO]   Passed: 74, Failed: 0, Errors: 0, Skipped: 2
[INFO] -------------------------------------------------
[ERROR] The following builds was skipped:
[ERROR] *  settings-merge/pom.xml
[ERROR] *  spaces-should-work_windows/pom.xml
[INFO] -------------------------------------------------
[INFO] ------------------------------------------------------------------------
[INFO] BUILD SUCCESS
[INFO] ------------------------------------------------------------------------
[INFO] Total time:  10:51 min
[INFO] Finished at: 2021-08-08T05:17:44Z
[INFO] ------------------------------------------------------------------------
[INFO] [jenkins-event-spy] Generated /home/jenkins/jenkins-home/workspace/_box_maven-invoker-plugin_master@2@2@tmp/withMaven9f5887ec/maven-spy-20210808-050652-6078564055672779296337.log
[Pipeline] }
[Pipeline] // dir
[Pipeline] }
[withMaven] artifactsPublisher - Archive artifact linux-jdk17-m3.6.x_build/pom.xml under org/apache/maven/plugins/maven-invoker-plugin/3.2.3-SNAPSHOT/maven-invoker-plugin-3.2.3-SNAPSHOT.pom
[withMaven] artifactsPublisher - Archive artifact linux-jdk17-m3.6.x_build/target/maven-invoker-plugin-3.2.3-SNAPSHOT.jar under org/apache/maven/plugins/maven-invoker-plugin/3.2.3-SNAPSHOT/maven-invoker-plugin-3.2.3-SNAPSHOT.jar
[withMaven] junitPublisher - Archive test results for Maven artifact org.apache.maven.plugins:maven-invoker-plugin:maven-plugin:3.2.3-SNAPSHOT generated by maven-surefire-plugin:test (default-test): linux-jdk17-m3.6.x_build/target/surefire-reports/*.xml
Recording test results
[withMaven] Jenkins Task Scanner Plugin not found, don't display results of source code scanning for 'TODO' and 'FIXME' in pipeline screen.
[withMaven] invokerPublisher - Archive invoker results for Maven artifact MavenArtifact{org.apache.maven.plugins:maven-invoker-plugin:maven-plugin:3.2.3-SNAPSHOT(version: 3.2.3-SNAPSHOT, snapshot:false) } generated by PluginInvocation{org.apache.maven.plugins:maven-invoker-plugin:3.2.2@integration-test  integration-test}: linux-jdk17-m3.6.x_build/target/invoker-reports/*.xml
ERROR: [withMaven] invokerPublisher - Silently ignore exception archiving Invoker runs for Maven artifact MavenArtifact{org.apache.maven.plugins:maven-invoker-plugin:maven-plugin:3.2.3-SNAPSHOT(version: 3.2.3-SNAPSHOT, snapshot:false) } generated by PluginInvocation{org.apache.maven.plugins:maven-invoker-plugin:3.2.2@integration-test  integration-test}: java.io.IOException: Unknown attribute 'buildlog' for tag 'build-job' (position: START_TAG seen ...k17-m3.6.x_build/target/it/MINVOKER-190-logDirectory/build.log" />... @2:280) 
[withMaven] Publishers: Generated Artifacts Publisher: 91 ms, Junit Publisher: 71 ms, Open Task Scanner Publisher: 1 ms, Invoker Publisher: 143 ms
[Pipeline] // withMaven
[Pipeline] cleanWs
[WS-CLEANUP] Deleting project workspace...
[WS-CLEANUP] Deferred wipeout is used...
[WS-CLEANUP] done
[Pipeline] }
[Pipeline] // stage
[Pipeline] }
[Pipeline] // ws
[Pipeline] }
[Pipeline] // node
[Pipeline] }
[INFO]           settings-inherit/pom.xml ......................... SUCCESS (7.4 s)
[INFO] Building: script-context/pom.xml
[INFO]           settings-inherit/pom.xml ......................... SUCCESS (7.7 s)
[INFO] Building: script-context/pom.xml
[INFO] run post-build script verify.bsh
[INFO]           script-context/pom.xml ........................... SUCCESS (10.6 s)
[INFO] 
[INFO] --- maven-checkstyle-plugin:3.0.0:check (checkstyle-check) @ maven-invoker-plugin ---
[INFO] run post-build script verify.bsh
[INFO]           script-context/pom.xml ........................... SUCCESS (11.3 s)
[INFO] 
[INFO] --- maven-checkstyle-plugin:3.0.0:check (checkstyle-check) @ maven-invoker-plugin ---
[INFO] There are 4 errors reported by Checkstyle 6.18 with config/maven_checks.xml ruleset.
[INFO] Ignored 4 errors, 0 violation remaining.
[INFO] 
[INFO] --- maven-invoker-plugin:3.2.2:verify (integration-test) @ maven-invoker-plugin ---
[INFO] -------------------------------------------------
[INFO] Build Summary:
[INFO]   Passed: 75, Failed: 0, Errors: 0, Skipped: 1
[INFO] -------------------------------------------------
[ERROR] The following builds was skipped:
[ERROR] *  spaces-should-work_windows/pom.xml
[INFO] -------------------------------------------------
[INFO] ------------------------------------------------------------------------
[INFO] BUILD SUCCESS
[INFO] ------------------------------------------------------------------------
[INFO] Total time: 11:42 min
[INFO] Finished at: 2021-08-08T05:18:00Z
[INFO] ------------------------------------------------------------------------
[INFO] [jenkins-event-spy] Generated /home/jenkins/jenkins-home/workspace/_box_maven-invoker-plugin_master@3@tmp/withMavene941ed4c/maven-spy-20210808-050617-1631749401438148482781.log
[Pipeline] }
[Pipeline] // dir
[Pipeline] }
[withMaven] artifactsPublisher - Archive artifact linux-jdk8-m3.5.x_build/pom.xml under org/apache/maven/plugins/maven-invoker-plugin/3.2.3-SNAPSHOT/maven-invoker-plugin-3.2.3-SNAPSHOT.pom
[withMaven] artifactsPublisher - Archive artifact linux-jdk8-m3.5.x_build/target/maven-invoker-plugin-3.2.3-SNAPSHOT.jar under org/apache/maven/plugins/maven-invoker-plugin/3.2.3-SNAPSHOT/maven-invoker-plugin-3.2.3-SNAPSHOT.jar
[withMaven] junitPublisher - Archive test results for Maven artifact org.apache.maven.plugins:maven-invoker-plugin:maven-plugin:3.2.3-SNAPSHOT generated by maven-surefire-plugin:test (default-test): linux-jdk8-m3.5.x_build/target/surefire-reports/*.xml
Recording test results
[withMaven] Jenkins Task Scanner Plugin not found, don't display results of source code scanning for 'TODO' and 'FIXME' in pipeline screen.
[withMaven] invokerPublisher - Archive invoker results for Maven artifact MavenArtifact{org.apache.maven.plugins:maven-invoker-plugin:maven-plugin:3.2.3-SNAPSHOT(version: 3.2.3-SNAPSHOT, snapshot:false) } generated by PluginInvocation{org.apache.maven.plugins:maven-invoker-plugin:3.2.2@integration-test  integration-test}: linux-jdk8-m3.5.x_build/target/invoker-reports/*.xml
ERROR: [withMaven] invokerPublisher - Silently ignore exception archiving Invoker runs for Maven artifact MavenArtifact{org.apache.maven.plugins:maven-invoker-plugin:maven-plugin:3.2.3-SNAPSHOT(version: 3.2.3-SNAPSHOT, snapshot:false) } generated by PluginInvocation{org.apache.maven.plugins:maven-invoker-plugin:3.2.2@integration-test  integration-test}: java.io.IOException: Unknown attribute 'buildlog' for tag 'build-job' (position: START_TAG seen ...dk8-m3.5.x_build/target/it/MINVOKER-190-logDirectory/build.log" />... @2:278) 
[withMaven] Publishers: Generated Artifacts Publisher: 132 ms, Junit Publisher: 153 ms, Open Task Scanner Publisher: 1 ms, Invoker Publisher: 190 ms
[Pipeline] // withMaven
[Pipeline] cleanWs
[WS-CLEANUP] Deleting project workspace...
[WS-CLEANUP] Deferred wipeout is used...
[WS-CLEANUP] done
[Pipeline] }
[Pipeline] // stage
[Pipeline] }
[Pipeline] // ws
[Pipeline] }
[Pipeline] // node
[Pipeline] }
[INFO] There are 4 errors reported by Checkstyle 6.18 with config/maven_checks.xml ruleset.
[INFO] Ignored 4 errors, 0 violation remaining.
[INFO] 
[INFO] --- maven-invoker-plugin:3.2.2:verify (integration-test) @ maven-invoker-plugin ---
[INFO] -------------------------------------------------
[INFO] Build Summary:
[INFO]   Passed: 75, Failed: 0, Errors: 0, Skipped: 1
[INFO] -------------------------------------------------
[ERROR] The following builds was skipped:
[ERROR] *  spaces-should-work_windows/pom.xml
[INFO] -------------------------------------------------
[INFO] 
[INFO] --- maven-install-plugin:2.5.2:install (default-install) @ maven-invoker-plugin ---
[INFO] Installing /home/jenkins/jenkins-home/workspace/_box_maven-invoker-plugin_master@2@2/linux-jdk8-m3.6.x_build/target/maven-invoker-plugin-3.2.3-SNAPSHOT.jar to /home/jenkins/jenkins-home/workspace/.maven_repositories/1/org/apache/maven/plugins/maven-invoker-plugin/3.2.3-SNAPSHOT/maven-invoker-plugin-3.2.3-SNAPSHOT.jar
[INFO] Installing /home/jenkins/jenkins-home/workspace/_box_maven-invoker-plugin_master@2@2/linux-jdk8-m3.6.x_build/pom.xml to /home/jenkins/jenkins-home/workspace/.maven_repositories/1/org/apache/maven/plugins/maven-invoker-plugin/3.2.3-SNAPSHOT/maven-invoker-plugin-3.2.3-SNAPSHOT.pom
[INFO] 
[INFO] --- maven-deploy-plugin:2.8.2:deploy (default-deploy) @ maven-invoker-plugin ---
[INFO] Downloading from apache.snapshots.https: https://repository.apache.org/content/repositories/snapshots/org/apache/maven/plugins/maven-invoker-plugin/3.2.3-SNAPSHOT/maven-metadata.xml
[INFO] Downloaded from apache.snapshots.https: https://repository.apache.org/content/repositories/snapshots/org/apache/maven/plugins/maven-invoker-plugin/3.2.3-SNAPSHOT/maven-metadata.xml (797 B at 1.1 kB/s)
[INFO] Uploading to apache.snapshots.https: https://repository.apache.org/content/repositories/snapshots/org/apache/maven/plugins/maven-invoker-plugin/3.2.3-SNAPSHOT/maven-invoker-plugin-3.2.3-20210808.051803-36.jar
[INFO] Uploaded to apache.snapshots.https: https://repository.apache.org/content/repositories/snapshots/org/apache/maven/plugins/maven-invoker-plugin/3.2.3-SNAPSHOT/maven-invoker-plugin-3.2.3-20210808.051803-36.jar (129 kB at 145 kB/s)
[INFO] Uploading to apache.snapshots.https: https://repository.apache.org/content/repositories/snapshots/org/apache/maven/plugins/maven-invoker-plugin/3.2.3-SNAPSHOT/maven-invoker-plugin-3.2.3-20210808.051803-36.pom
[INFO] Uploaded to apache.snapshots.https: https://repository.apache.org/content/repositories/snapshots/org/apache/maven/plugins/maven-invoker-plugin/3.2.3-SNAPSHOT/maven-invoker-plugin-3.2.3-20210808.051803-36.pom (17 kB at 27 kB/s)
[INFO] Downloading from apache.snapshots.https: https://repository.apache.org/content/repositories/snapshots/org/apache/maven/plugins/maven-invoker-plugin/maven-metadata.xml
[INFO] Downloaded from apache.snapshots.https: https://repository.apache.org/content/repositories/snapshots/org/apache/maven/plugins/maven-invoker-plugin/maven-metadata.xml (444 B at 2.2 kB/s)
[INFO] Downloading from apache.snapshots.https: https://repository.apache.org/content/repositories/snapshots/org/apache/maven/plugins/maven-metadata.xml
[INFO] Downloaded from apache.snapshots.https: https://repository.apache.org/content/repositories/snapshots/org/apache/maven/plugins/maven-metadata.xml (8.5 kB at 41 kB/s)
[INFO] Uploading to apache.snapshots.https: https://repository.apache.org/content/repositories/snapshots/org/apache/maven/plugins/maven-invoker-plugin/3.2.3-SNAPSHOT/maven-metadata.xml
[INFO] Uploaded to apache.snapshots.https: https://repository.apache.org/content/repositories/snapshots/org/apache/maven/plugins/maven-invoker-plugin/3.2.3-SNAPSHOT/maven-metadata.xml (797 B at 1.4 kB/s)
[INFO] Uploading to apache.snapshots.https: https://repository.apache.org/content/repositories/snapshots/org/apache/maven/plugins/maven-invoker-plugin/maven-metadata.xml
[INFO] Uploaded to apache.snapshots.https: https://repository.apache.org/content/repositories/snapshots/org/apache/maven/plugins/maven-invoker-plugin/maven-metadata.xml (444 B at 757 B/s)
[INFO] Uploading to apache.snapshots.https: https://repository.apache.org/content/repositories/snapshots/org/apache/maven/plugins/maven-metadata.xml
[INFO] Uploaded to apache.snapshots.https: https://repository.apache.org/content/repositories/snapshots/org/apache/maven/plugins/maven-metadata.xml (8.5 kB at 14 kB/s)
[INFO] ------------------------------------------------------------------------
[INFO] BUILD SUCCESS
[INFO] ------------------------------------------------------------------------
[INFO] Total time:  11:38 min
[INFO] Finished at: 2021-08-08T05:18:06Z
[INFO] ------------------------------------------------------------------------
[INFO] [jenkins-event-spy] Generated /home/jenkins/jenkins-home/workspace/_box_maven-invoker-plugin_master@2@2@tmp/withMavene8261630/maven-spy-20210808-050628-4297798369553957781636.log
[Pipeline] }
[Pipeline] // dir
[Pipeline] }
[withMaven] artifactsPublisher - Archive artifact linux-jdk8-m3.6.x_build/pom.xml under org/apache/maven/plugins/maven-invoker-plugin/3.2.3-SNAPSHOT/maven-invoker-plugin-3.2.3-SNAPSHOT.pom
[withMaven] artifactsPublisher - Archive artifact linux-jdk8-m3.6.x_build/target/maven-invoker-plugin-3.2.3-SNAPSHOT.jar under org/apache/maven/plugins/maven-invoker-plugin/3.2.3-SNAPSHOT/maven-invoker-plugin-3.2.3-SNAPSHOT.jar
[withMaven] junitPublisher - Archive test results for Maven artifact org.apache.maven.plugins:maven-invoker-plugin:maven-plugin:3.2.3-SNAPSHOT generated by maven-surefire-plugin:test (default-test): linux-jdk8-m3.6.x_build/target/surefire-reports/*.xml
Recording test results
[withMaven] Jenkins Task Scanner Plugin not found, don't display results of source code scanning for 'TODO' and 'FIXME' in pipeline screen.
[withMaven] invokerPublisher - Archive invoker results for Maven artifact MavenArtifact{org.apache.maven.plugins:maven-invoker-plugin:maven-plugin:3.2.3-SNAPSHOT(version: 3.2.3-SNAPSHOT, snapshot:false) } generated by PluginInvocation{org.apache.maven.plugins:maven-invoker-plugin:3.2.2@integration-test  integration-test}: linux-jdk8-m3.6.x_build/target/invoker-reports/*.xml
ERROR: [withMaven] invokerPublisher - Silently ignore exception archiving Invoker runs for Maven artifact MavenArtifact{org.apache.maven.plugins:maven-invoker-plugin:maven-plugin:3.2.3-SNAPSHOT(version: 3.2.3-SNAPSHOT, snapshot:false) } generated by PluginInvocation{org.apache.maven.plugins:maven-invoker-plugin:3.2.2@integration-test  integration-test}: java.io.IOException: Unknown attribute 'buildlog' for tag 'build-job' (position: START_TAG seen ...dk8-m3.6.x_build/target/it/MINVOKER-190-logDirectory/build.log" />... @2:280) 
[withMaven] Publishers: Generated Artifacts Publisher: 60 ms, Junit Publisher: 71 ms, Open Task Scanner Publisher: 1 ms, Invoker Publisher: 139 ms
[Pipeline] // withMaven
[Pipeline] cleanWs
[WS-CLEANUP] Deleting project workspace...
[WS-CLEANUP] Deferred wipeout is used...
[WS-CLEANUP] done
[Pipeline] }
[Pipeline] // stage
[Pipeline] }
[Pipeline] // ws
[Pipeline] }
[Pipeline] // node
[Pipeline] }
[Pipeline] // parallel
[Pipeline] stage
[Pipeline] { (Notifications)
[Pipeline] echo
Build result: FAILURE
[Pipeline] jiraIssueSelector
[Pipeline] echo
The authors of changes [noreply].
[Pipeline] echo
Sending email ...
[Pipeline] emailext

Build failed in Jenkins: Maven » Maven TLP » maven-invoker-plugin » master #69

Posted by Apache Jenkins Server <je...@builds.apache.org>.
See https://ci-maven.apache.org/job/Maven/job/maven-box/job/maven-invoker-plugin/job/master/69/

Changes:

* Bump actions/setup-java from 2.1.0 to 2.2.0 (#63)

All tests passed

Build log:
[...truncated 6282 lines...]
[WS-CLEANUP] Deferred wipeout is used...
[WS-CLEANUP] done
[Pipeline] }
[Pipeline] // stage
[Pipeline] }
[Pipeline] // ws
[Pipeline] }
[Pipeline] // node
[Pipeline] }
[INFO]           script-class-loading/pom.xml ..................... SUCCESS (16.8 s)
[INFO] Building: local-repo-isolated/pom.xml
[INFO] run post-build script verify.bsh
[INFO]           script-context/pom.xml ........................... SUCCESS (7.2 s)
[INFO] 
[INFO] --- maven-checkstyle-plugin:3.0.0:check (checkstyle-check) @ maven-invoker-plugin ---
[INFO] There are 4 errors reported by Checkstyle 6.18 with config/maven_checks.xml ruleset.
[INFO] Ignored 4 errors, 0 violation remaining.
[INFO] 
[INFO] --- maven-invoker-plugin:3.2.2:verify (integration-test) @ maven-invoker-plugin ---
[INFO] -------------------------------------------------
[INFO] Build Summary:
[INFO]   Passed: 74, Failed: 0, Errors: 0, Skipped: 2
[INFO] -------------------------------------------------
[ERROR] The following builds was skipped:
[ERROR] *  settings-merge/pom.xml
[ERROR] *  spaces-should-work_windows/pom.xml
[INFO] -------------------------------------------------
[INFO] ------------------------------------------------------------------------
[INFO] BUILD SUCCESS
[INFO] ------------------------------------------------------------------------
[INFO] Total time:  11:55 min
[INFO] Finished at: 2021-08-10T05:25:36Z
[INFO] ------------------------------------------------------------------------
[INFO] [jenkins-event-spy] Generated /home/jenkins/jenkins-home/workspace/_box_maven-invoker-plugin_master@2@2@tmp/withMaven87ca4152/maven-spy-20210810-051340-63010284947838291827677.log
[Pipeline] }
[Pipeline] // dir
[Pipeline] }
[withMaven] artifactsPublisher - Archive artifact linux-jdk11-m3.6.x_build/pom.xml under org/apache/maven/plugins/maven-invoker-plugin/3.3.0-SNAPSHOT/maven-invoker-plugin-3.3.0-SNAPSHOT.pom
[withMaven] artifactsPublisher - Archive artifact linux-jdk11-m3.6.x_build/target/maven-invoker-plugin-3.3.0-SNAPSHOT.jar under org/apache/maven/plugins/maven-invoker-plugin/3.3.0-SNAPSHOT/maven-invoker-plugin-3.3.0-SNAPSHOT.jar
[withMaven] junitPublisher - Archive test results for Maven artifact org.apache.maven.plugins:maven-invoker-plugin:maven-plugin:3.3.0-SNAPSHOT generated by maven-surefire-plugin:test (default-test): linux-jdk11-m3.6.x_build/target/surefire-reports/*.xml
Recording test results
[withMaven] Jenkins Task Scanner Plugin not found, don't display results of source code scanning for 'TODO' and 'FIXME' in pipeline screen.
[withMaven] invokerPublisher - Archive invoker results for Maven artifact MavenArtifact{org.apache.maven.plugins:maven-invoker-plugin:maven-plugin:3.3.0-SNAPSHOT(version: 3.3.0-SNAPSHOT, snapshot:false) } generated by PluginInvocation{org.apache.maven.plugins:maven-invoker-plugin:3.2.2@integration-test  integration-test}: linux-jdk11-m3.6.x_build/target/invoker-reports/*.xml
ERROR: [withMaven] invokerPublisher - Silently ignore exception archiving Invoker runs for Maven artifact MavenArtifact{org.apache.maven.plugins:maven-invoker-plugin:maven-plugin:3.3.0-SNAPSHOT(version: 3.3.0-SNAPSHOT, snapshot:false) } generated by PluginInvocation{org.apache.maven.plugins:maven-invoker-plugin:3.2.2@integration-test  integration-test}: java.io.IOException: Unknown attribute 'buildlog' for tag 'build-job' (position: START_TAG seen ...k11-m3.6.x_build/target/it/MINVOKER-190-logDirectory/build.log" />... @2:281) 
[withMaven] Publishers: Generated Artifacts Publisher: 98 ms, Junit Publisher: 108 ms, Open Task Scanner Publisher: 1 ms, Invoker Publisher: 139 ms
[Pipeline] // withMaven
[Pipeline] cleanWs
[WS-CLEANUP] Deleting project workspace...
[WS-CLEANUP] Deferred wipeout is used...
[WS-CLEANUP] done
[Pipeline] }
[Pipeline] // stage
[Pipeline] }
[Pipeline] // ws
[Pipeline] }
[Pipeline] // node
[Pipeline] }
[INFO] run post-build script verify.bsh
[INFO]           local-repo-isolated/pom.xml ...................... SUCCESS (10.3 s)
[INFO] Building: invocation-offline/pom.xml
[INFO]           script-class-loading/pom.xml ..................... SUCCESS (17.5 s)
[INFO] Building: local-repo-isolated/pom.xml
[INFO] run post-build script verify.bsh
[INFO]           local-repo-isolated/pom.xml ...................... SUCCESS (9.3 s)
[INFO] Building: invocation-offline/pom.xml
[INFO] run post-build script verify.bsh
[INFO]           invocation-offline/pom.xml ....................... SUCCESS (11.1 s)
[INFO] Building: selector-scripts/pom.xml
[INFO] run pre-build script setup.groovy
[INFO] run post-build script verify.bsh
[INFO]           selector-scripts/pom.xml ......................... SUCCESS (11.2 s)
[INFO] Building: script-additional-vars/pom.xml
[INFO] run post-build script verify.bsh
[INFO]           invocation-offline/pom.xml ....................... SUCCESS (11.8 s)
[INFO] Building: selector-scripts/pom.xml
[INFO] run pre-build script setup.groovy
[INFO] run post-build script verify.bsh
[INFO]           selector-scripts/pom.xml ......................... SUCCESS (11.6 s)
[INFO] Building: script-additional-vars/pom.xml
[INFO]           script-additional-vars/pom.xml ................... SUCCESS (13.4 s)
[INFO] Building: invocation-emptyproperty/pom.xml
[INFO]           invocation-emptyproperty/pom.xml ................. SUCCESS (8.6 s)
[INFO] Building: wrongPropertyInterpolation/pom.xml
[INFO]           script-additional-vars/pom.xml ................... SUCCESS (14.0 s)
[INFO] Building: invocation-emptyproperty/pom.xml
[INFO]           invocation-emptyproperty/pom.xml ................. SUCCESS (9.9 s)
[INFO] Building: wrongPropertyInterpolation/pom.xml
[INFO]           wrongPropertyInterpolation/pom.xml ............... SUCCESS (16.8 s)
[INFO] Building: invocation-project/pom.xml
[INFO] run post-build script verify.bsh
[INFO]           invocation-project/pom.xml ....................... SUCCESS (12.5 s)
[INFO] Building: MINVOKER-191/pom.xml
[INFO]           wrongPropertyInterpolation/pom.xml ............... SUCCESS (17.7 s)
[INFO] Building: invocation-project/pom.xml
[INFO]           MINVOKER-191/pom.xml ............................. SUCCESS (13.5 s)
[INFO] Building: invocation-spaces/pom.xml
[INFO] run post-build script verify.bsh
[INFO]           invocation-project/pom.xml ....................... SUCCESS (13.2 s)
[INFO] Building: MINVOKER-191/pom.xml
[INFO] run post-build script verify.bsh
[INFO]           invocation-spaces/pom.xml ........................ SUCCESS (14.2 s)
[INFO] Building: fail-run-postbuild/pom.xml
[INFO]           MINVOKER-191/pom.xml ............................. SUCCESS (13.5 s)
[INFO] Building: invocation-spaces/pom.xml
[INFO] run post-build script verify.bsh
[INFO]           fail-run-postbuild/pom.xml ....................... SUCCESS (10.3 s)
[INFO] Building: project-cloning/pom.xml
[INFO] run pre-build script setup.bsh
[INFO] run post-build script verify.bsh
[INFO]           invocation-spaces/pom.xml ........................ SUCCESS (14.4 s)
[INFO] Building: fail-run-postbuild/pom.xml
[INFO] run post-build script verify.bsh
[INFO]           project-cloning/pom.xml .......................... SUCCESS (14.9 s)
[INFO] Building: settings-inherit/pom.xml
[INFO] run post-build script verify.bsh
[INFO]           fail-run-postbuild/pom.xml ....................... SUCCESS (9.8 s)
[INFO] Building: project-cloning/pom.xml
[INFO] run pre-build script setup.bsh
[INFO]           settings-inherit/pom.xml ......................... SUCCESS (9.1 s)
[INFO] Building: script-context/pom.xml
[INFO] run post-build script verify.bsh
[INFO]           project-cloning/pom.xml .......................... SUCCESS (14.0 s)
[INFO] Building: settings-inherit/pom.xml
[INFO] run post-build script verify.bsh
[INFO]           script-context/pom.xml ........................... SUCCESS (13.4 s)
[INFO] 
[INFO] --- maven-checkstyle-plugin:3.0.0:check (checkstyle-check) @ maven-invoker-plugin ---
[INFO]           settings-inherit/pom.xml ......................... SUCCESS (8.5 s)
[INFO] Building: script-context/pom.xml
[INFO] There are 4 errors reported by Checkstyle 6.18 with config/maven_checks.xml ruleset.
[INFO] Ignored 4 errors, 0 violation remaining.
[INFO] 
[INFO] --- maven-invoker-plugin:3.2.2:verify (integration-test) @ maven-invoker-plugin ---
[INFO] -------------------------------------------------
[INFO] Build Summary:
[INFO]   Passed: 74, Failed: 0, Errors: 0, Skipped: 2
[INFO] -------------------------------------------------
[ERROR] The following builds was skipped:
[ERROR] *  settings-merge/pom.xml
[ERROR] *  spaces-should-work_windows/pom.xml
[INFO] -------------------------------------------------
[INFO] ------------------------------------------------------------------------
[INFO] BUILD SUCCESS
[INFO] ------------------------------------------------------------------------
[INFO] Total time:  14:33 min
[INFO] Finished at: 2021-08-10T05:28:15Z
[INFO] ------------------------------------------------------------------------
[INFO] [jenkins-event-spy] Generated /home/jenkins/jenkins-home/workspace/_box_maven-invoker-plugin_master@2@2@tmp/withMavenaf54bfaa/maven-spy-20210810-051341-2473370146962232376207.log
[Pipeline] }
[Pipeline] // dir
[Pipeline] }
[withMaven] artifactsPublisher - Archive artifact linux-jdk16-m3.6.x_build/pom.xml under org/apache/maven/plugins/maven-invoker-plugin/3.3.0-SNAPSHOT/maven-invoker-plugin-3.3.0-SNAPSHOT.pom
[withMaven] artifactsPublisher - Archive artifact linux-jdk16-m3.6.x_build/target/maven-invoker-plugin-3.3.0-SNAPSHOT.jar under org/apache/maven/plugins/maven-invoker-plugin/3.3.0-SNAPSHOT/maven-invoker-plugin-3.3.0-SNAPSHOT.jar
[withMaven] junitPublisher - Archive test results for Maven artifact org.apache.maven.plugins:maven-invoker-plugin:maven-plugin:3.3.0-SNAPSHOT generated by maven-surefire-plugin:test (default-test): linux-jdk16-m3.6.x_build/target/surefire-reports/*.xml
Recording test results
[withMaven] Jenkins Task Scanner Plugin not found, don't display results of source code scanning for 'TODO' and 'FIXME' in pipeline screen.
[withMaven] invokerPublisher - Archive invoker results for Maven artifact MavenArtifact{org.apache.maven.plugins:maven-invoker-plugin:maven-plugin:3.3.0-SNAPSHOT(version: 3.3.0-SNAPSHOT, snapshot:false) } generated by PluginInvocation{org.apache.maven.plugins:maven-invoker-plugin:3.2.2@integration-test  integration-test}: linux-jdk16-m3.6.x_build/target/invoker-reports/*.xml
ERROR: [withMaven] invokerPublisher - Silently ignore exception archiving Invoker runs for Maven artifact MavenArtifact{org.apache.maven.plugins:maven-invoker-plugin:maven-plugin:3.3.0-SNAPSHOT(version: 3.3.0-SNAPSHOT, snapshot:false) } generated by PluginInvocation{org.apache.maven.plugins:maven-invoker-plugin:3.2.2@integration-test  integration-test}: java.io.IOException: Unknown attribute 'buildlog' for tag 'build-job' (position: START_TAG seen ...k16-m3.6.x_build/target/it/MINVOKER-190-logDirectory/build.log" />... @2:281) 
[withMaven] Publishers: Generated Artifacts Publisher: 83 ms, Junit Publisher: 104 ms, Open Task Scanner Publisher: 1 ms, Invoker Publisher: 301 ms, Pipeline Graph Publisher: 2 ms
[Pipeline] // withMaven
[Pipeline] cleanWs
[WS-CLEANUP] Deleting project workspace...
[WS-CLEANUP] Deferred wipeout is used...
[WS-CLEANUP] done
[Pipeline] }
[Pipeline] // stage
[Pipeline] }
[Pipeline] // ws
[Pipeline] }
[Pipeline] // node
[Pipeline] }
[INFO] run post-build script verify.bsh
[INFO]           script-context/pom.xml ........................... SUCCESS (9.5 s)
[INFO] 
[INFO] --- maven-checkstyle-plugin:3.0.0:check (checkstyle-check) @ maven-invoker-plugin ---
[INFO] There are 4 errors reported by Checkstyle 6.18 with config/maven_checks.xml ruleset.
[INFO] Ignored 4 errors, 0 violation remaining.
[INFO] 
[INFO] --- maven-invoker-plugin:3.2.2:verify (integration-test) @ maven-invoker-plugin ---
[INFO] -------------------------------------------------
[INFO] Build Summary:
[INFO]   Passed: 75, Failed: 0, Errors: 0, Skipped: 1
[INFO] -------------------------------------------------
[ERROR] The following builds was skipped:
[ERROR] *  spaces-should-work_windows/pom.xml
[INFO] -------------------------------------------------
[INFO] 
[INFO] --- maven-install-plugin:2.5.2:install (default-install) @ maven-invoker-plugin ---
[INFO] Installing /home/jenkins/jenkins-home/workspace/_box_maven-invoker-plugin_master@3/linux-jdk8-m3.6.x_build/target/maven-invoker-plugin-3.3.0-SNAPSHOT.jar to /home/jenkins/jenkins-home/workspace/.maven_repositories/1/org/apache/maven/plugins/maven-invoker-plugin/3.3.0-SNAPSHOT/maven-invoker-plugin-3.3.0-SNAPSHOT.jar
[INFO] Installing /home/jenkins/jenkins-home/workspace/_box_maven-invoker-plugin_master@3/linux-jdk8-m3.6.x_build/pom.xml to /home/jenkins/jenkins-home/workspace/.maven_repositories/1/org/apache/maven/plugins/maven-invoker-plugin/3.3.0-SNAPSHOT/maven-invoker-plugin-3.3.0-SNAPSHOT.pom
[INFO] 
[INFO] --- maven-deploy-plugin:2.8.2:deploy (default-deploy) @ maven-invoker-plugin ---
[INFO] Downloading from apache.snapshots.https: https://repository.apache.org/content/repositories/snapshots/org/apache/maven/plugins/maven-invoker-plugin/3.3.0-SNAPSHOT/maven-metadata.xml
[INFO] Downloaded from apache.snapshots.https: https://repository.apache.org/content/repositories/snapshots/org/apache/maven/plugins/maven-invoker-plugin/3.3.0-SNAPSHOT/maven-metadata.xml (794 B at 955 B/s)
[INFO] Uploading to apache.snapshots.https: https://repository.apache.org/content/repositories/snapshots/org/apache/maven/plugins/maven-invoker-plugin/3.3.0-SNAPSHOT/maven-invoker-plugin-3.3.0-20210810.052825-3.jar
[INFO] Uploaded to apache.snapshots.https: https://repository.apache.org/content/repositories/snapshots/org/apache/maven/plugins/maven-invoker-plugin/3.3.0-SNAPSHOT/maven-invoker-plugin-3.3.0-20210810.052825-3.jar (129 kB at 145 kB/s)
[INFO] Uploading to apache.snapshots.https: https://repository.apache.org/content/repositories/snapshots/org/apache/maven/plugins/maven-invoker-plugin/3.3.0-SNAPSHOT/maven-invoker-plugin-3.3.0-20210810.052825-3.pom
[INFO] Uploaded to apache.snapshots.https: https://repository.apache.org/content/repositories/snapshots/org/apache/maven/plugins/maven-invoker-plugin/3.3.0-SNAPSHOT/maven-invoker-plugin-3.3.0-20210810.052825-3.pom (14 kB at 24 kB/s)
[INFO] Downloading from apache.snapshots.https: https://repository.apache.org/content/repositories/snapshots/org/apache/maven/plugins/maven-invoker-plugin/maven-metadata.xml
[INFO] Downloaded from apache.snapshots.https: https://repository.apache.org/content/repositories/snapshots/org/apache/maven/plugins/maven-invoker-plugin/maven-metadata.xml (484 B at 2.1 kB/s)
[INFO] Downloading from apache.snapshots.https: https://repository.apache.org/content/repositories/snapshots/org/apache/maven/plugins/maven-metadata.xml
[INFO] Downloaded from apache.snapshots.https: https://repository.apache.org/content/repositories/snapshots/org/apache/maven/plugins/maven-metadata.xml (8.5 kB at 43 kB/s)
[INFO] Uploading to apache.snapshots.https: https://repository.apache.org/content/repositories/snapshots/org/apache/maven/plugins/maven-invoker-plugin/3.3.0-SNAPSHOT/maven-metadata.xml
[INFO] Uploaded to apache.snapshots.https: https://repository.apache.org/content/repositories/snapshots/org/apache/maven/plugins/maven-invoker-plugin/3.3.0-SNAPSHOT/maven-metadata.xml (794 B at 1.3 kB/s)
[INFO] Uploading to apache.snapshots.https: https://repository.apache.org/content/repositories/snapshots/org/apache/maven/plugins/maven-invoker-plugin/maven-metadata.xml
[INFO] Uploaded to apache.snapshots.https: https://repository.apache.org/content/repositories/snapshots/org/apache/maven/plugins/maven-invoker-plugin/maven-metadata.xml (484 B at 744 B/s)
[INFO] Uploading to apache.snapshots.https: https://repository.apache.org/content/repositories/snapshots/org/apache/maven/plugins/maven-metadata.xml
[INFO] Uploaded to apache.snapshots.https: https://repository.apache.org/content/repositories/snapshots/org/apache/maven/plugins/maven-metadata.xml (8.5 kB at 14 kB/s)
[INFO] ------------------------------------------------------------------------
[INFO] BUILD SUCCESS
[INFO] ------------------------------------------------------------------------
[INFO] Total time:  14:48 min
[INFO] Finished at: 2021-08-10T05:28:29Z
[INFO] ------------------------------------------------------------------------
[INFO] [jenkins-event-spy] Generated /home/jenkins/jenkins-home/workspace/_box_maven-invoker-plugin_master@3@tmp/withMaven898dfce0/maven-spy-20210810-051340-7204439088978956111632.log
[Pipeline] }
[Pipeline] // dir
[Pipeline] }
[withMaven] artifactsPublisher - Archive artifact linux-jdk8-m3.6.x_build/pom.xml under org/apache/maven/plugins/maven-invoker-plugin/3.3.0-SNAPSHOT/maven-invoker-plugin-3.3.0-SNAPSHOT.pom
[withMaven] artifactsPublisher - Archive artifact linux-jdk8-m3.6.x_build/target/maven-invoker-plugin-3.3.0-SNAPSHOT.jar under org/apache/maven/plugins/maven-invoker-plugin/3.3.0-SNAPSHOT/maven-invoker-plugin-3.3.0-SNAPSHOT.jar
[withMaven] junitPublisher - Archive test results for Maven artifact org.apache.maven.plugins:maven-invoker-plugin:maven-plugin:3.3.0-SNAPSHOT generated by maven-surefire-plugin:test (default-test): linux-jdk8-m3.6.x_build/target/surefire-reports/*.xml
Recording test results
[withMaven] Jenkins Task Scanner Plugin not found, don't display results of source code scanning for 'TODO' and 'FIXME' in pipeline screen.
[withMaven] invokerPublisher - Archive invoker results for Maven artifact MavenArtifact{org.apache.maven.plugins:maven-invoker-plugin:maven-plugin:3.3.0-SNAPSHOT(version: 3.3.0-SNAPSHOT, snapshot:false) } generated by PluginInvocation{org.apache.maven.plugins:maven-invoker-plugin:3.2.2@integration-test  integration-test}: linux-jdk8-m3.6.x_build/target/invoker-reports/*.xml
ERROR: [withMaven] invokerPublisher - Silently ignore exception archiving Invoker runs for Maven artifact MavenArtifact{org.apache.maven.plugins:maven-invoker-plugin:maven-plugin:3.3.0-SNAPSHOT(version: 3.3.0-SNAPSHOT, snapshot:false) } generated by PluginInvocation{org.apache.maven.plugins:maven-invoker-plugin:3.2.2@integration-test  integration-test}: java.io.IOException: Unknown attribute 'buildlog' for tag 'build-job' (position: START_TAG seen ...dk8-m3.6.x_build/target/it/MINVOKER-190-logDirectory/build.log" />... @2:278) 
[withMaven] Publishers: Generated Artifacts Publisher: 75 ms, Junit Publisher: 78 ms, Open Task Scanner Publisher: 1 ms, Invoker Publisher: 163 ms
[Pipeline] // withMaven
[Pipeline] cleanWs
[WS-CLEANUP] Deleting project workspace...
[WS-CLEANUP] Deferred wipeout is used...
[WS-CLEANUP] done
[Pipeline] }
[Pipeline] // stage
[Pipeline] }
[Pipeline] // ws
[Pipeline] }
[Pipeline] // node
[Pipeline] }
[Pipeline] // parallel
[Pipeline] stage
[Pipeline] { (Notifications)
[Pipeline] echo
Build result: FAILURE
[Pipeline] jiraIssueSelector
[Pipeline] echo
The authors of changes [noreply].
[Pipeline] echo
Sending email ...
[Pipeline] emailext

Build failed in Jenkins: Maven » Maven TLP » maven-invoker-plugin » master #68

Posted by Apache Jenkins Server <je...@builds.apache.org>.
See https://ci-maven.apache.org/job/Maven/job/maven-box/job/maven-invoker-plugin/job/master/68/

Changes:

* Bump plexus-utils from 3.1.0 to 3.4.0 (#55)

All tests passed

Build log:
[...truncated 4391 lines...]
[INFO]           invocation-cmdline-exclude/pom.xml ............... SUCCESS (2.8 s)
[INFO] Building: script-class-loading/pom.xml
[INFO]           invocation-cmdline-exclude/pom.xml ............... SUCCESS (4.6 s)
[INFO] Building: script-class-loading/pom.xml
[INFO] run post-build script verify.bsh
[INFO]           project-cloning/pom.xml .......................... SUCCESS (11.5 s)
[INFO] Building: settings-inherit/pom.xml
[INFO]           script-class-loading/pom.xml ..................... SUCCESS (8.8 s)
[INFO] Building: local-repo-isolated/pom.xml
[INFO] run post-build script verify.bsh
[INFO]           local-repo-isolated/pom.xml ...................... SUCCESS (5.2 s)
[INFO] Building: invocation-offline/pom.xml
[INFO]           settings-inherit/pom.xml ......................... SUCCESS (8.0 s)
[INFO] Building: script-context/pom.xml
[INFO]           script-class-loading/pom.xml ..................... SUCCESS (13.1 s)
[INFO] Building: local-repo-isolated/pom.xml
[INFO] run post-build script verify.bsh
[INFO]           invocation-offline/pom.xml ....................... SUCCESS (6.4 s)
[INFO] Building: selector-scripts/pom.xml
[INFO] run pre-build script setup.groovy
[INFO] run post-build script verify.bsh
[INFO]           local-repo-isolated/pom.xml ...................... SUCCESS (7.4 s)
[INFO] Building: invocation-offline/pom.xml
[INFO] run post-build script verify.bsh
[INFO]           selector-scripts/pom.xml ......................... SUCCESS (6.1 s)
[INFO] Building: script-additional-vars/pom.xml
[INFO] run post-build script verify.bsh
[INFO]           script-context/pom.xml ........................... SUCCESS (11.7 s)
[INFO] 
[INFO] --- maven-checkstyle-plugin:3.0.0:check (checkstyle-check) @ maven-invoker-plugin ---
[INFO] There are 4 errors reported by Checkstyle 6.18 with config/maven_checks.xml ruleset.
[INFO] Ignored 4 errors, 0 violation remaining.
[INFO] 
[INFO] --- maven-invoker-plugin:3.2.2:verify (integration-test) @ maven-invoker-plugin ---
[INFO] -------------------------------------------------
[INFO] Build Summary:
[INFO]   Passed: 75, Failed: 0, Errors: 0, Skipped: 1
[INFO] -------------------------------------------------
[ERROR] The following builds was skipped:
[ERROR] *  spaces-should-work_windows/pom.xml
[INFO] -------------------------------------------------
[INFO] 
[INFO] --- maven-install-plugin:2.5.2:install (default-install) @ maven-invoker-plugin ---
[INFO] Installing /home/jenkins/jenkins-home/workspace/_box_maven-invoker-plugin_master@2/linux-jdk8-m3.6.x_build/target/maven-invoker-plugin-3.3.0-SNAPSHOT.jar to /home/jenkins/jenkins-home/workspace/.maven_repositories/1/org/apache/maven/plugins/maven-invoker-plugin/3.3.0-SNAPSHOT/maven-invoker-plugin-3.3.0-SNAPSHOT.jar
[INFO] Installing /home/jenkins/jenkins-home/workspace/_box_maven-invoker-plugin_master@2/linux-jdk8-m3.6.x_build/pom.xml to /home/jenkins/jenkins-home/workspace/.maven_repositories/1/org/apache/maven/plugins/maven-invoker-plugin/3.3.0-SNAPSHOT/maven-invoker-plugin-3.3.0-SNAPSHOT.pom
[INFO] 
[INFO] --- maven-deploy-plugin:2.8.2:deploy (default-deploy) @ maven-invoker-plugin ---
[INFO] Downloading from apache.snapshots.https: https://repository.apache.org/content/repositories/snapshots/org/apache/maven/plugins/maven-invoker-plugin/3.3.0-SNAPSHOT/maven-metadata.xml
[INFO] Downloaded from apache.snapshots.https: https://repository.apache.org/content/repositories/snapshots/org/apache/maven/plugins/maven-invoker-plugin/3.3.0-SNAPSHOT/maven-metadata.xml (794 B at 869 B/s)
[INFO] Uploading to apache.snapshots.https: https://repository.apache.org/content/repositories/snapshots/org/apache/maven/plugins/maven-invoker-plugin/3.3.0-SNAPSHOT/maven-invoker-plugin-3.3.0-20210809.102658-2.jar
[INFO] Uploaded to apache.snapshots.https: https://repository.apache.org/content/repositories/snapshots/org/apache/maven/plugins/maven-invoker-plugin/3.3.0-SNAPSHOT/maven-invoker-plugin-3.3.0-20210809.102658-2.jar (129 kB at 138 kB/s)
[INFO] Uploading to apache.snapshots.https: https://repository.apache.org/content/repositories/snapshots/org/apache/maven/plugins/maven-invoker-plugin/3.3.0-SNAPSHOT/maven-invoker-plugin-3.3.0-20210809.102658-2.pom
[INFO] run post-build script verify.bsh
[INFO]           invocation-offline/pom.xml ....................... SUCCESS (10.0 s)
[INFO] Building: selector-scripts/pom.xml
[INFO] run pre-build script setup.groovy
[INFO] Uploaded to apache.snapshots.https: https://repository.apache.org/content/repositories/snapshots/org/apache/maven/plugins/maven-invoker-plugin/3.3.0-SNAPSHOT/maven-invoker-plugin-3.3.0-20210809.102658-2.pom (14 kB at 5.6 kB/s)
[INFO] Downloading from apache.snapshots.https: https://repository.apache.org/content/repositories/snapshots/org/apache/maven/plugins/maven-invoker-plugin/maven-metadata.xml
[INFO] Downloaded from apache.snapshots.https: https://repository.apache.org/content/repositories/snapshots/org/apache/maven/plugins/maven-invoker-plugin/maven-metadata.xml (484 B at 2.4 kB/s)
[INFO] Downloading from apache.snapshots.https: https://repository.apache.org/content/repositories/snapshots/org/apache/maven/plugins/maven-metadata.xml
[INFO] Downloaded from apache.snapshots.https: https://repository.apache.org/content/repositories/snapshots/org/apache/maven/plugins/maven-metadata.xml (8.5 kB at 42 kB/s)
[INFO] Uploading to apache.snapshots.https: https://repository.apache.org/content/repositories/snapshots/org/apache/maven/plugins/maven-invoker-plugin/3.3.0-SNAPSHOT/maven-metadata.xml
[INFO] Uploaded to apache.snapshots.https: https://repository.apache.org/content/repositories/snapshots/org/apache/maven/plugins/maven-invoker-plugin/3.3.0-SNAPSHOT/maven-metadata.xml (794 B at 1.4 kB/s)
[INFO] Uploading to apache.snapshots.https: https://repository.apache.org/content/repositories/snapshots/org/apache/maven/plugins/maven-invoker-plugin/maven-metadata.xml
[INFO]           script-additional-vars/pom.xml ................... SUCCESS (7.6 s)
[INFO] Building: invocation-emptyproperty/pom.xml
[INFO] Uploaded to apache.snapshots.https: https://repository.apache.org/content/repositories/snapshots/org/apache/maven/plugins/maven-invoker-plugin/maven-metadata.xml (484 B at 821 B/s)
[INFO] Uploading to apache.snapshots.https: https://repository.apache.org/content/repositories/snapshots/org/apache/maven/plugins/maven-metadata.xml
[INFO] Uploaded to apache.snapshots.https: https://repository.apache.org/content/repositories/snapshots/org/apache/maven/plugins/maven-metadata.xml (8.5 kB at 14 kB/s)
[INFO] ------------------------------------------------------------------------
[INFO] BUILD SUCCESS
[INFO] ------------------------------------------------------------------------
[INFO] Total time:  12:07 min
[INFO] Finished at: 2021-08-09T10:27:03Z
[INFO] ------------------------------------------------------------------------
[INFO] [jenkins-event-spy] Generated /home/jenkins/jenkins-home/workspace/_box_maven-invoker-plugin_master@2@tmp/withMaven7cb2c912/maven-spy-20210809-101456-3323413279515951847918.log
[Pipeline] }
[Pipeline] // dir
[Pipeline] }
[withMaven] artifactsPublisher - Archive artifact linux-jdk8-m3.6.x_build/pom.xml under org/apache/maven/plugins/maven-invoker-plugin/3.3.0-SNAPSHOT/maven-invoker-plugin-3.3.0-SNAPSHOT.pom
[withMaven] artifactsPublisher - Archive artifact linux-jdk8-m3.6.x_build/target/maven-invoker-plugin-3.3.0-SNAPSHOT.jar under org/apache/maven/plugins/maven-invoker-plugin/3.3.0-SNAPSHOT/maven-invoker-plugin-3.3.0-SNAPSHOT.jar
[withMaven] junitPublisher - Archive test results for Maven artifact org.apache.maven.plugins:maven-invoker-plugin:maven-plugin:3.3.0-SNAPSHOT generated by maven-surefire-plugin:test (default-test): linux-jdk8-m3.6.x_build/target/surefire-reports/*.xml
Recording test results
[withMaven] Jenkins Task Scanner Plugin not found, don't display results of source code scanning for 'TODO' and 'FIXME' in pipeline screen.
[withMaven] invokerPublisher - Archive invoker results for Maven artifact MavenArtifact{org.apache.maven.plugins:maven-invoker-plugin:maven-plugin:3.3.0-SNAPSHOT(version: 3.3.0-SNAPSHOT, snapshot:false) } generated by PluginInvocation{org.apache.maven.plugins:maven-invoker-plugin:3.2.2@integration-test  integration-test}: linux-jdk8-m3.6.x_build/target/invoker-reports/*.xml
ERROR: [withMaven] invokerPublisher - Silently ignore exception archiving Invoker runs for Maven artifact MavenArtifact{org.apache.maven.plugins:maven-invoker-plugin:maven-plugin:3.3.0-SNAPSHOT(version: 3.3.0-SNAPSHOT, snapshot:false) } generated by PluginInvocation{org.apache.maven.plugins:maven-invoker-plugin:3.2.2@integration-test  integration-test}: java.io.IOException: Unknown attribute 'buildlog' for tag 'build-job' (position: START_TAG seen ...dk8-m3.6.x_build/target/it/MINVOKER-190-logDirectory/build.log" />... @2:278) 
[withMaven] Publishers: Generated Artifacts Publisher: 142 ms, Junit Publisher: 126 ms, Open Task Scanner Publisher: 1 ms, Invoker Publisher: 200 ms
[Pipeline] // withMaven
[Pipeline] cleanWs
[WS-CLEANUP] Deleting project workspace...
[WS-CLEANUP] Deferred wipeout is used...
[WS-CLEANUP] done
[Pipeline] }
[Pipeline] // stage
[Pipeline] }
[Pipeline] // ws
[Pipeline] }
[Pipeline] // node
[Pipeline] }
[INFO] run post-build script verify.bsh
[INFO]           selector-scripts/pom.xml ......................... SUCCESS (5.9 s)
[INFO] Building: script-additional-vars/pom.xml
[INFO]           invocation-emptyproperty/pom.xml ................. SUCCESS (5.0 s)
[INFO] Building: wrongPropertyInterpolation/pom.xml
[INFO]           script-additional-vars/pom.xml ................... SUCCESS (7.0 s)
[INFO] Building: invocation-emptyproperty/pom.xml
[INFO]           wrongPropertyInterpolation/pom.xml ............... SUCCESS (9.6 s)
[INFO] Building: invocation-project/pom.xml
[INFO]           invocation-emptyproperty/pom.xml ................. SUCCESS (4.6 s)
[INFO] Building: wrongPropertyInterpolation/pom.xml
[INFO] run post-build script verify.bsh
[INFO]           invocation-project/pom.xml ....................... SUCCESS (6.6 s)
[INFO] Building: MINVOKER-191/pom.xml
[INFO]           wrongPropertyInterpolation/pom.xml ............... SUCCESS (8.7 s)
[INFO] Building: invocation-project/pom.xml
[INFO] run post-build script verify.bsh
[INFO]           invocation-project/pom.xml ....................... SUCCESS (5.9 s)
[INFO] Building: MINVOKER-191/pom.xml
[INFO]           MINVOKER-191/pom.xml ............................. SUCCESS (8.9 s)
[INFO] Building: invocation-spaces/pom.xml
[INFO] run post-build script verify.bsh
[INFO]           invocation-spaces/pom.xml ........................ SUCCESS (6.8 s)
[INFO] Building: fail-run-postbuild/pom.xml
[INFO]           MINVOKER-191/pom.xml ............................. SUCCESS (8.5 s)
[INFO] Building: invocation-spaces/pom.xml
[INFO] run post-build script verify.bsh
[INFO]           fail-run-postbuild/pom.xml ....................... SUCCESS (6.0 s)
[INFO] Building: project-cloning/pom.xml
[INFO] run pre-build script setup.bsh
[INFO] run post-build script verify.bsh
[INFO]           invocation-spaces/pom.xml ........................ SUCCESS (6.3 s)
[INFO] Building: fail-run-postbuild/pom.xml
[INFO] run post-build script verify.bsh
[INFO]           fail-run-postbuild/pom.xml ....................... SUCCESS (5.4 s)
[INFO] Building: project-cloning/pom.xml
[INFO] run pre-build script setup.bsh
[INFO] run post-build script verify.bsh
[INFO]           project-cloning/pom.xml .......................... SUCCESS (8.4 s)
[INFO] Building: settings-inherit/pom.xml
[INFO] run post-build script verify.bsh
[INFO]           project-cloning/pom.xml .......................... SUCCESS (6.9 s)
[INFO] Building: settings-inherit/pom.xml
[INFO]           settings-inherit/pom.xml ......................... SUCCESS (6.1 s)
[INFO] Building: script-context/pom.xml
[INFO]           settings-inherit/pom.xml ......................... SUCCESS (4.3 s)
[INFO] Building: script-context/pom.xml
[INFO] run post-build script verify.bsh
[INFO]           script-context/pom.xml ........................... SUCCESS (8.7 s)
[INFO] 
[INFO] --- maven-checkstyle-plugin:3.0.0:check (checkstyle-check) @ maven-invoker-plugin ---
[INFO] There are 4 errors reported by Checkstyle 6.18 with config/maven_checks.xml ruleset.
[INFO] Ignored 4 errors, 0 violation remaining.
[INFO] 
[INFO] --- maven-invoker-plugin:3.2.2:verify (integration-test) @ maven-invoker-plugin ---
[INFO] -------------------------------------------------
[INFO] Build Summary:
[INFO]   Passed: 74, Failed: 0, Errors: 0, Skipped: 2
[INFO] -------------------------------------------------
[ERROR] The following builds was skipped:
[ERROR] *  settings-merge/pom.xml
[ERROR] *  spaces-should-work_windows/pom.xml
[INFO] -------------------------------------------------
[INFO] ------------------------------------------------------------------------
[INFO] BUILD SUCCESS
[INFO] ------------------------------------------------------------------------
[INFO] Total time:  11:48 min
[INFO] Finished at: 2021-08-09T10:28:10Z
[INFO] ------------------------------------------------------------------------
[INFO] [jenkins-event-spy] Generated /home/jenkins/jenkins-home/workspace/_box_maven-invoker-plugin_master@3@2@tmp/withMavenc45bc4a2/maven-spy-20210809-101621-2912403478904434376223.log
[Pipeline] }
[Pipeline] // dir
[Pipeline] }
[withMaven] artifactsPublisher - Archive artifact linux-jdk11-m3.6.x_build/pom.xml under org/apache/maven/plugins/maven-invoker-plugin/3.3.0-SNAPSHOT/maven-invoker-plugin-3.3.0-SNAPSHOT.pom
[withMaven] artifactsPublisher - Archive artifact linux-jdk11-m3.6.x_build/target/maven-invoker-plugin-3.3.0-SNAPSHOT.jar under org/apache/maven/plugins/maven-invoker-plugin/3.3.0-SNAPSHOT/maven-invoker-plugin-3.3.0-SNAPSHOT.jar
[withMaven] junitPublisher - Archive test results for Maven artifact org.apache.maven.plugins:maven-invoker-plugin:maven-plugin:3.3.0-SNAPSHOT generated by maven-surefire-plugin:test (default-test): linux-jdk11-m3.6.x_build/target/surefire-reports/*.xml
Recording test results
[withMaven] Jenkins Task Scanner Plugin not found, don't display results of source code scanning for 'TODO' and 'FIXME' in pipeline screen.
[withMaven] invokerPublisher - Archive invoker results for Maven artifact MavenArtifact{org.apache.maven.plugins:maven-invoker-plugin:maven-plugin:3.3.0-SNAPSHOT(version: 3.3.0-SNAPSHOT, snapshot:false) } generated by PluginInvocation{org.apache.maven.plugins:maven-invoker-plugin:3.2.2@integration-test  integration-test}: linux-jdk11-m3.6.x_build/target/invoker-reports/*.xml
ERROR: [withMaven] invokerPublisher - Silently ignore exception archiving Invoker runs for Maven artifact MavenArtifact{org.apache.maven.plugins:maven-invoker-plugin:maven-plugin:3.3.0-SNAPSHOT(version: 3.3.0-SNAPSHOT, snapshot:false) } generated by PluginInvocation{org.apache.maven.plugins:maven-invoker-plugin:3.2.2@integration-test  integration-test}: java.io.IOException: Unknown attribute 'buildlog' for tag 'build-job' (position: START_TAG seen ...k11-m3.6.x_build/target/it/MINVOKER-190-logDirectory/build.log" />... @2:281) 
[withMaven] Publishers: Generated Artifacts Publisher: 62 ms, Junit Publisher: 226 ms, Open Task Scanner Publisher: 1 ms, Invoker Publisher: 139 ms
[Pipeline] // withMaven
[Pipeline] cleanWs
[WS-CLEANUP] Deleting project workspace...
[WS-CLEANUP] Deferred wipeout is used...
[WS-CLEANUP] done
[Pipeline] }
[Pipeline] // stage
[Pipeline] }
[Pipeline] // ws
[Pipeline] }
[Pipeline] // node
[Pipeline] }
[INFO] run post-build script verify.bsh
[INFO]           script-context/pom.xml ........................... SUCCESS (7.1 s)
[INFO] 
[INFO] --- maven-checkstyle-plugin:3.0.0:check (checkstyle-check) @ maven-invoker-plugin ---
[INFO] There are 4 errors reported by Checkstyle 6.18 with config/maven_checks.xml ruleset.
[INFO] Ignored 4 errors, 0 violation remaining.
[INFO] 
[INFO] --- maven-invoker-plugin:3.2.2:verify (integration-test) @ maven-invoker-plugin ---
[INFO] -------------------------------------------------
[INFO] Build Summary:
[INFO]   Passed: 74, Failed: 0, Errors: 0, Skipped: 2
[INFO] -------------------------------------------------
[ERROR] The following builds was skipped:
[ERROR] *  settings-merge/pom.xml
[ERROR] *  spaces-should-work_windows/pom.xml
[INFO] -------------------------------------------------
[INFO] ------------------------------------------------------------------------
[INFO] BUILD SUCCESS
[INFO] ------------------------------------------------------------------------
[INFO] Total time:  11:00 min
[INFO] Finished at: 2021-08-09T10:28:11Z
[INFO] ------------------------------------------------------------------------
[INFO] [jenkins-event-spy] Generated /home/jenkins/jenkins-home/workspace/_box_maven-invoker-plugin_master@3@2@tmp/withMaven3e7aa9b2/maven-spy-20210809-101710-247156566940138000062.log
[Pipeline] }
[Pipeline] // dir
[Pipeline] }
[withMaven] artifactsPublisher - Archive artifact linux-jdk16-m3.6.x_build/pom.xml under org/apache/maven/plugins/maven-invoker-plugin/3.3.0-SNAPSHOT/maven-invoker-plugin-3.3.0-SNAPSHOT.pom
[withMaven] artifactsPublisher - Archive artifact linux-jdk16-m3.6.x_build/target/maven-invoker-plugin-3.3.0-SNAPSHOT.jar under org/apache/maven/plugins/maven-invoker-plugin/3.3.0-SNAPSHOT/maven-invoker-plugin-3.3.0-SNAPSHOT.jar
[withMaven] junitPublisher - Archive test results for Maven artifact org.apache.maven.plugins:maven-invoker-plugin:maven-plugin:3.3.0-SNAPSHOT generated by maven-surefire-plugin:test (default-test): linux-jdk16-m3.6.x_build/target/surefire-reports/*.xml
Recording test results
[withMaven] Jenkins Task Scanner Plugin not found, don't display results of source code scanning for 'TODO' and 'FIXME' in pipeline screen.
[withMaven] invokerPublisher - Archive invoker results for Maven artifact MavenArtifact{org.apache.maven.plugins:maven-invoker-plugin:maven-plugin:3.3.0-SNAPSHOT(version: 3.3.0-SNAPSHOT, snapshot:false) } generated by PluginInvocation{org.apache.maven.plugins:maven-invoker-plugin:3.2.2@integration-test  integration-test}: linux-jdk16-m3.6.x_build/target/invoker-reports/*.xml
ERROR: [withMaven] invokerPublisher - Silently ignore exception archiving Invoker runs for Maven artifact MavenArtifact{org.apache.maven.plugins:maven-invoker-plugin:maven-plugin:3.3.0-SNAPSHOT(version: 3.3.0-SNAPSHOT, snapshot:false) } generated by PluginInvocation{org.apache.maven.plugins:maven-invoker-plugin:3.2.2@integration-test  integration-test}: java.io.IOException: Unknown attribute 'buildlog' for tag 'build-job' (position: START_TAG seen ...k16-m3.6.x_build/target/it/MINVOKER-190-logDirectory/build.log" />... @2:281) 
[withMaven] Publishers: Generated Artifacts Publisher: 94 ms, Junit Publisher: 70 ms, Open Task Scanner Publisher: 1 ms, Invoker Publisher: 139 ms
[Pipeline] // withMaven
[Pipeline] cleanWs
[WS-CLEANUP] Deleting project workspace...
[WS-CLEANUP] Deferred wipeout is used...
[WS-CLEANUP] done
[Pipeline] }
[Pipeline] // stage
[Pipeline] }
[Pipeline] // ws
[Pipeline] }
[Pipeline] // node
[Pipeline] }
[Pipeline] // parallel
[Pipeline] stage
[Pipeline] { (Notifications)
[Pipeline] echo
Build result: FAILURE
[Pipeline] jiraIssueSelector
[Pipeline] echo
The authors of changes [noreply].
[Pipeline] echo
Sending email ...
[Pipeline] emailext

Build failed in Jenkins: Maven » Maven TLP » maven-invoker-plugin » master #67

Posted by Apache Jenkins Server <je...@builds.apache.org>.
See https://ci-maven.apache.org/job/Maven/job/maven-box/job/maven-invoker-plugin/job/master/67/

Changes:

* bump version to 3.3.0-SNAPSHOT

All tests passed

Build log:
[...truncated 4937 lines...]
[INFO] Building: invocation-emptyproperty/pom.xml
[INFO] run post-build script verify.bsh
[INFO]           invocation-spaces/pom.xml ........................ SUCCESS (6.0 s)
[INFO] Building: fail-run-postbuild/pom.xml
[INFO]           spaces-should-work_non-windows/pom.xml ........... SUCCESS (10.9 s)
[INFO] Building: spaces-should-work_windows/pom.xml
[INFO]           spaces-should-work_windows/pom.xml ............... SKIPPED due to OS
[INFO] Building: settings-merge/pom.xml
[INFO]           settings-merge/pom.xml ........................... SKIPPED due to JRE version
[INFO] Building: fail-prebuild/pom.xml
[INFO] run post-build script verify.bsh
[INFO]           fail-run-postbuild/pom.xml ....................... SUCCESS (5.4 s)
[INFO] Building: project-cloning/pom.xml
[INFO] run pre-build script setup.bsh
[INFO] run post-build script verify.bsh
[INFO]           fail-prebuild/pom.xml ............................ SUCCESS (5.3 s)
[INFO] Building: invocation-cmdline-exclude/pom.xml
[INFO]           invocation-emptyproperty/pom.xml ................. SUCCESS (7.7 s)
[INFO] Building: wrongPropertyInterpolation/pom.xml
[INFO]           invocation-cmdline-exclude/pom.xml ............... SUCCESS (5.2 s)
[INFO] Building: script-class-loading/pom.xml
[INFO] run post-build script verify.bsh
[INFO]           project-cloning/pom.xml .......................... SUCCESS (7.1 s)
[INFO] Building: settings-inherit/pom.xml
[INFO]           settings-inherit/pom.xml ......................... SUCCESS (4.5 s)
[INFO] Building: script-context/pom.xml
[INFO]           wrongPropertyInterpolation/pom.xml ............... SUCCESS (15.3 s)
[INFO] Building: invocation-project/pom.xml
[INFO] run post-build script verify.bsh
[INFO]           script-context/pom.xml ........................... SUCCESS (7.3 s)
[INFO] 
[INFO] --- maven-checkstyle-plugin:3.0.0:check (checkstyle-check) @ maven-invoker-plugin ---
[INFO] There are 4 errors reported by Checkstyle 6.18 with config/maven_checks.xml ruleset.
[INFO] Ignored 4 errors, 0 violation remaining.
[INFO] 
[INFO] --- maven-invoker-plugin:3.2.2:verify (integration-test) @ maven-invoker-plugin ---
[INFO] -------------------------------------------------
[INFO] Build Summary:
[INFO]   Passed: 74, Failed: 0, Errors: 0, Skipped: 2
[INFO] -------------------------------------------------
[ERROR] The following builds was skipped:
[ERROR] *  settings-merge/pom.xml
[ERROR] *  spaces-should-work_windows/pom.xml
[INFO] -------------------------------------------------
[INFO] ------------------------------------------------------------------------
[INFO] BUILD SUCCESS
[INFO] ------------------------------------------------------------------------
[INFO] Total time:  10:51 min
[INFO] Finished at: 2021-08-09T10:20:05Z
[INFO] ------------------------------------------------------------------------
[INFO] [jenkins-event-spy] Generated /home/jenkins/jenkins-home/workspace/_box_maven-invoker-plugin_master@3@2@tmp/withMavendd06c905/maven-spy-20210809-100913-5524003200828788894315.log
[Pipeline] }
[Pipeline] // dir
[Pipeline] }
[withMaven] artifactsPublisher - Archive artifact linux-jdk16-m3.6.x_build/pom.xml under org/apache/maven/plugins/maven-invoker-plugin/3.3.0-SNAPSHOT/maven-invoker-plugin-3.3.0-SNAPSHOT.pom
[withMaven] artifactsPublisher - Archive artifact linux-jdk16-m3.6.x_build/target/maven-invoker-plugin-3.3.0-SNAPSHOT.jar under org/apache/maven/plugins/maven-invoker-plugin/3.3.0-SNAPSHOT/maven-invoker-plugin-3.3.0-SNAPSHOT.jar
[withMaven] junitPublisher - Archive test results for Maven artifact org.apache.maven.plugins:maven-invoker-plugin:maven-plugin:3.3.0-SNAPSHOT generated by maven-surefire-plugin:test (default-test): linux-jdk16-m3.6.x_build/target/surefire-reports/*.xml
Recording test results
[withMaven] Jenkins Task Scanner Plugin not found, don't display results of source code scanning for 'TODO' and 'FIXME' in pipeline screen.
[withMaven] invokerPublisher - Archive invoker results for Maven artifact MavenArtifact{org.apache.maven.plugins:maven-invoker-plugin:maven-plugin:3.3.0-SNAPSHOT(version: 3.3.0-SNAPSHOT, snapshot:false) } generated by PluginInvocation{org.apache.maven.plugins:maven-invoker-plugin:3.2.2@integration-test  integration-test}: linux-jdk16-m3.6.x_build/target/invoker-reports/*.xml
ERROR: [withMaven] invokerPublisher - Silently ignore exception archiving Invoker runs for Maven artifact MavenArtifact{org.apache.maven.plugins:maven-invoker-plugin:maven-plugin:3.3.0-SNAPSHOT(version: 3.3.0-SNAPSHOT, snapshot:false) } generated by PluginInvocation{org.apache.maven.plugins:maven-invoker-plugin:3.2.2@integration-test  integration-test}: java.io.IOException: Unknown attribute 'buildlog' for tag 'build-job' (position: START_TAG seen ...k16-m3.6.x_build/target/it/MINVOKER-190-logDirectory/build.log" />... @2:281) 
[withMaven] Publishers: Generated Artifacts Publisher: 53 ms, Junit Publisher: 146 ms, Open Task Scanner Publisher: 1 ms, Invoker Publisher: 142 ms
[Pipeline] // withMaven
[Pipeline] cleanWs
[WS-CLEANUP] Deleting project workspace...
[WS-CLEANUP] Deferred wipeout is used...
[WS-CLEANUP] done
[Pipeline] }
[Pipeline] // stage
[Pipeline] }
[Pipeline] // ws
[Pipeline] }
[Pipeline] // node
[Pipeline] }
[INFO]           script-class-loading/pom.xml ..................... SUCCESS (15.6 s)
[INFO] Building: local-repo-isolated/pom.xml
[INFO] run post-build script verify.bsh
[INFO]           invocation-project/pom.xml ....................... SUCCESS (10.2 s)
[INFO] Building: MINVOKER-191/pom.xml
[INFO] run post-build script verify.bsh
[INFO]           local-repo-isolated/pom.xml ...................... SUCCESS (8.5 s)
[INFO] Building: invocation-offline/pom.xml
[INFO]           MINVOKER-191/pom.xml ............................. SUCCESS (11.6 s)
[INFO] Building: invocation-spaces/pom.xml
[INFO] run post-build script verify.bsh
[INFO]           invocation-offline/pom.xml ....................... SUCCESS (12.3 s)
[INFO] Building: selector-scripts/pom.xml
[INFO] run pre-build script setup.groovy
[INFO] run post-build script verify.bsh
[INFO]           invocation-spaces/pom.xml ........................ SUCCESS (11.1 s)
[INFO] Building: fail-run-postbuild/pom.xml
[INFO] run post-build script verify.bsh
[INFO]           selector-scripts/pom.xml ......................... SUCCESS (11.3 s)
[INFO] Building: script-additional-vars/pom.xml
[INFO] run post-build script verify.bsh
[INFO]           fail-run-postbuild/pom.xml ....................... SUCCESS (8.6 s)
[INFO] Building: project-cloning/pom.xml
[INFO] run pre-build script setup.bsh
[INFO]           script-additional-vars/pom.xml ................... SUCCESS (13.9 s)
[INFO] Building: invocation-emptyproperty/pom.xml
[INFO] run post-build script verify.bsh
[INFO]           project-cloning/pom.xml .......................... SUCCESS (10.6 s)
[INFO] Building: settings-inherit/pom.xml
[INFO]           invocation-emptyproperty/pom.xml ................. SUCCESS (8.2 s)
[INFO] Building: wrongPropertyInterpolation/pom.xml
[INFO]           settings-inherit/pom.xml ......................... SUCCESS (7.5 s)
[INFO] Building: script-context/pom.xml
[INFO] run post-build script verify.bsh
[INFO]           script-context/pom.xml ........................... SUCCESS (11.7 s)
[INFO] 
[INFO] --- maven-checkstyle-plugin:3.0.0:check (checkstyle-check) @ maven-invoker-plugin ---
[INFO] There are 4 errors reported by Checkstyle 6.18 with config/maven_checks.xml ruleset.
[INFO] Ignored 4 errors, 0 violation remaining.
[INFO] 
[INFO] --- maven-invoker-plugin:3.2.2:verify (integration-test) @ maven-invoker-plugin ---
[INFO] -------------------------------------------------
[INFO] Build Summary:
[INFO]   Passed: 75, Failed: 0, Errors: 0, Skipped: 1
[INFO] -------------------------------------------------
[ERROR] The following builds was skipped:
[ERROR] *  spaces-should-work_windows/pom.xml
[INFO] -------------------------------------------------
[INFO] 
[INFO] --- maven-install-plugin:2.5.2:install (default-install) @ maven-invoker-plugin ---
[INFO] Installing /home/jenkins/jenkins-home/workspace/_box_maven-invoker-plugin_master@2/linux-jdk8-m3.6.x_build/target/maven-invoker-plugin-3.3.0-SNAPSHOT.jar to /home/jenkins/jenkins-home/workspace/.maven_repositories/0/org/apache/maven/plugins/maven-invoker-plugin/3.3.0-SNAPSHOT/maven-invoker-plugin-3.3.0-SNAPSHOT.jar
[INFO] Installing /home/jenkins/jenkins-home/workspace/_box_maven-invoker-plugin_master@2/linux-jdk8-m3.6.x_build/pom.xml to /home/jenkins/jenkins-home/workspace/.maven_repositories/0/org/apache/maven/plugins/maven-invoker-plugin/3.3.0-SNAPSHOT/maven-invoker-plugin-3.3.0-SNAPSHOT.pom
[INFO] 
[INFO] --- maven-deploy-plugin:2.8.2:deploy (default-deploy) @ maven-invoker-plugin ---
[INFO] Downloading from apache.snapshots.https: https://repository.apache.org/content/repositories/snapshots/org/apache/maven/plugins/maven-invoker-plugin/3.3.0-SNAPSHOT/maven-metadata.xml
[INFO] Uploading to apache.snapshots.https: https://repository.apache.org/content/repositories/snapshots/org/apache/maven/plugins/maven-invoker-plugin/3.3.0-SNAPSHOT/maven-invoker-plugin-3.3.0-20210809.102116-1.jar
[INFO] Uploaded to apache.snapshots.https: https://repository.apache.org/content/repositories/snapshots/org/apache/maven/plugins/maven-invoker-plugin/3.3.0-SNAPSHOT/maven-invoker-plugin-3.3.0-20210809.102116-1.jar (129 kB at 110 kB/s)
[INFO] Uploading to apache.snapshots.https: https://repository.apache.org/content/repositories/snapshots/org/apache/maven/plugins/maven-invoker-plugin/3.3.0-SNAPSHOT/maven-invoker-plugin-3.3.0-20210809.102116-1.pom
[INFO] Uploaded to apache.snapshots.https: https://repository.apache.org/content/repositories/snapshots/org/apache/maven/plugins/maven-invoker-plugin/3.3.0-SNAPSHOT/maven-invoker-plugin-3.3.0-20210809.102116-1.pom (14 kB at 24 kB/s)
[INFO] Downloading from apache.snapshots.https: https://repository.apache.org/content/repositories/snapshots/org/apache/maven/plugins/maven-invoker-plugin/maven-metadata.xml
[INFO] Downloaded from apache.snapshots.https: https://repository.apache.org/content/repositories/snapshots/org/apache/maven/plugins/maven-invoker-plugin/maven-metadata.xml (444 B at 2.1 kB/s)
[INFO] Downloading from apache.snapshots.https: https://repository.apache.org/content/repositories/snapshots/org/apache/maven/plugins/maven-metadata.xml
[INFO] Downloaded from apache.snapshots.https: https://repository.apache.org/content/repositories/snapshots/org/apache/maven/plugins/maven-metadata.xml (8.5 kB at 42 kB/s)
[INFO] Uploading to apache.snapshots.https: https://repository.apache.org/content/repositories/snapshots/org/apache/maven/plugins/maven-invoker-plugin/3.3.0-SNAPSHOT/maven-metadata.xml
[INFO]           wrongPropertyInterpolation/pom.xml ............... SUCCESS (16.4 s)
[INFO] Building: invocation-project/pom.xml
[INFO] Uploaded to apache.snapshots.https: https://repository.apache.org/content/repositories/snapshots/org/apache/maven/plugins/maven-invoker-plugin/3.3.0-SNAPSHOT/maven-metadata.xml (794 B at 1.3 kB/s)
[INFO] Uploading to apache.snapshots.https: https://repository.apache.org/content/repositories/snapshots/org/apache/maven/plugins/maven-invoker-plugin/maven-metadata.xml
[INFO] Uploaded to apache.snapshots.https: https://repository.apache.org/content/repositories/snapshots/org/apache/maven/plugins/maven-invoker-plugin/maven-metadata.xml (484 B at 138 B/s)
[INFO] Uploading to apache.snapshots.https: https://repository.apache.org/content/repositories/snapshots/org/apache/maven/plugins/maven-metadata.xml
[INFO] Uploaded to apache.snapshots.https: https://repository.apache.org/content/repositories/snapshots/org/apache/maven/plugins/maven-metadata.xml (8.5 kB at 15 kB/s)
[INFO] ------------------------------------------------------------------------
[INFO] BUILD SUCCESS
[INFO] ------------------------------------------------------------------------
[INFO] Total time:  12:32 min
[INFO] Finished at: 2021-08-09T10:21:23Z
[INFO] ------------------------------------------------------------------------
[INFO] [jenkins-event-spy] Generated /home/jenkins/jenkins-home/workspace/_box_maven-invoker-plugin_master@2@tmp/withMaven3dada9c0/maven-spy-20210809-100851-4816688220319321568770.log
[Pipeline] }
[Pipeline] // dir
[Pipeline] }
[withMaven] artifactsPublisher - Archive artifact linux-jdk8-m3.6.x_build/pom.xml under org/apache/maven/plugins/maven-invoker-plugin/3.3.0-SNAPSHOT/maven-invoker-plugin-3.3.0-SNAPSHOT.pom
[withMaven] artifactsPublisher - Archive artifact linux-jdk8-m3.6.x_build/target/maven-invoker-plugin-3.3.0-SNAPSHOT.jar under org/apache/maven/plugins/maven-invoker-plugin/3.3.0-SNAPSHOT/maven-invoker-plugin-3.3.0-SNAPSHOT.jar
[withMaven] junitPublisher - Archive test results for Maven artifact org.apache.maven.plugins:maven-invoker-plugin:maven-plugin:3.3.0-SNAPSHOT generated by maven-surefire-plugin:test (default-test): linux-jdk8-m3.6.x_build/target/surefire-reports/*.xml
Recording test results
[withMaven] Jenkins Task Scanner Plugin not found, don't display results of source code scanning for 'TODO' and 'FIXME' in pipeline screen.
[withMaven] invokerPublisher - Archive invoker results for Maven artifact MavenArtifact{org.apache.maven.plugins:maven-invoker-plugin:maven-plugin:3.3.0-SNAPSHOT(version: 3.3.0-SNAPSHOT, snapshot:false) } generated by PluginInvocation{org.apache.maven.plugins:maven-invoker-plugin:3.2.2@integration-test  integration-test}: linux-jdk8-m3.6.x_build/target/invoker-reports/*.xml
ERROR: [withMaven] invokerPublisher - Silently ignore exception archiving Invoker runs for Maven artifact MavenArtifact{org.apache.maven.plugins:maven-invoker-plugin:maven-plugin:3.3.0-SNAPSHOT(version: 3.3.0-SNAPSHOT, snapshot:false) } generated by PluginInvocation{org.apache.maven.plugins:maven-invoker-plugin:3.2.2@integration-test  integration-test}: java.io.IOException: Unknown attribute 'buildlog' for tag 'build-job' (position: START_TAG seen ...dk8-m3.6.x_build/target/it/MINVOKER-190-logDirectory/build.log" />... @2:278) 
[withMaven] Publishers: Generated Artifacts Publisher: 80 ms, Junit Publisher: 90 ms, Open Task Scanner Publisher: 18 ms, Invoker Publisher: 187 ms
[Pipeline] // withMaven
[Pipeline] cleanWs
[WS-CLEANUP] Deleting project workspace...
[WS-CLEANUP] Deferred wipeout is used...
[WS-CLEANUP] done
[Pipeline] }
[Pipeline] // stage
[Pipeline] }
[Pipeline] // ws
[Pipeline] }
[Pipeline] // node
[Pipeline] }
[INFO] run post-build script verify.bsh
[INFO]           invocation-project/pom.xml ....................... SUCCESS (6.6 s)
[INFO] Building: MINVOKER-191/pom.xml
[INFO]           MINVOKER-191/pom.xml ............................. SUCCESS (9.3 s)
[INFO] Building: invocation-spaces/pom.xml
[INFO] run post-build script verify.bsh
[INFO]           invocation-spaces/pom.xml ........................ SUCCESS (8.0 s)
[INFO] Building: fail-run-postbuild/pom.xml
[INFO] run post-build script verify.bsh
[INFO]           fail-run-postbuild/pom.xml ....................... SUCCESS (6.2 s)
[INFO] Building: project-cloning/pom.xml
[INFO] run pre-build script setup.bsh
[INFO] run post-build script verify.bsh
[INFO]           project-cloning/pom.xml .......................... SUCCESS (8.1 s)
[INFO] Building: settings-inherit/pom.xml
[INFO]           settings-inherit/pom.xml ......................... SUCCESS (5.6 s)
[INFO] Building: script-context/pom.xml
[INFO] run post-build script verify.bsh
[INFO]           script-context/pom.xml ........................... SUCCESS (8.8 s)
[INFO] 
[INFO] --- maven-checkstyle-plugin:3.0.0:check (checkstyle-check) @ maven-invoker-plugin ---
[INFO] There are 4 errors reported by Checkstyle 6.18 with config/maven_checks.xml ruleset.
[INFO] Ignored 4 errors, 0 violation remaining.
[INFO] 
[INFO] --- maven-invoker-plugin:3.2.2:verify (integration-test) @ maven-invoker-plugin ---
[INFO] -------------------------------------------------
[INFO] Build Summary:
[INFO]   Passed: 74, Failed: 0, Errors: 0, Skipped: 2
[INFO] -------------------------------------------------
[ERROR] The following builds was skipped:
[ERROR] *  settings-merge/pom.xml
[ERROR] *  spaces-should-work_windows/pom.xml
[INFO] -------------------------------------------------
[INFO] ------------------------------------------------------------------------
[INFO] BUILD SUCCESS
[INFO] ------------------------------------------------------------------------
[INFO] Total time:  13:11 min
[INFO] Finished at: 2021-08-09T10:22:11Z
[INFO] ------------------------------------------------------------------------
[INFO] [jenkins-event-spy] Generated /home/jenkins/jenkins-home/workspace/_box_maven-invoker-plugin_master@3@2@tmp/withMavenfa9b3e99/maven-spy-20210809-100900-57813791526312511010030.log
[Pipeline] }
[Pipeline] // dir
[Pipeline] }
[withMaven] artifactsPublisher - Archive artifact linux-jdk11-m3.6.x_build/pom.xml under org/apache/maven/plugins/maven-invoker-plugin/3.3.0-SNAPSHOT/maven-invoker-plugin-3.3.0-SNAPSHOT.pom
[withMaven] artifactsPublisher - Archive artifact linux-jdk11-m3.6.x_build/target/maven-invoker-plugin-3.3.0-SNAPSHOT.jar under org/apache/maven/plugins/maven-invoker-plugin/3.3.0-SNAPSHOT/maven-invoker-plugin-3.3.0-SNAPSHOT.jar
[withMaven] junitPublisher - Archive test results for Maven artifact org.apache.maven.plugins:maven-invoker-plugin:maven-plugin:3.3.0-SNAPSHOT generated by maven-surefire-plugin:test (default-test): linux-jdk11-m3.6.x_build/target/surefire-reports/*.xml
Recording test results
[withMaven] Jenkins Task Scanner Plugin not found, don't display results of source code scanning for 'TODO' and 'FIXME' in pipeline screen.
[withMaven] invokerPublisher - Archive invoker results for Maven artifact MavenArtifact{org.apache.maven.plugins:maven-invoker-plugin:maven-plugin:3.3.0-SNAPSHOT(version: 3.3.0-SNAPSHOT, snapshot:false) } generated by PluginInvocation{org.apache.maven.plugins:maven-invoker-plugin:3.2.2@integration-test  integration-test}: linux-jdk11-m3.6.x_build/target/invoker-reports/*.xml
ERROR: [withMaven] invokerPublisher - Silently ignore exception archiving Invoker runs for Maven artifact MavenArtifact{org.apache.maven.plugins:maven-invoker-plugin:maven-plugin:3.3.0-SNAPSHOT(version: 3.3.0-SNAPSHOT, snapshot:false) } generated by PluginInvocation{org.apache.maven.plugins:maven-invoker-plugin:3.2.2@integration-test  integration-test}: java.io.IOException: Unknown attribute 'buildlog' for tag 'build-job' (position: START_TAG seen ...k11-m3.6.x_build/target/it/MINVOKER-190-logDirectory/build.log" />... @2:281) 
[withMaven] Publishers: Generated Artifacts Publisher: 63 ms, Junit Publisher: 83 ms, Open Task Scanner Publisher: 14 ms, Invoker Publisher: 137 ms, Pipeline Graph Publisher: 7 ms
[Pipeline] // withMaven
[Pipeline] cleanWs
[WS-CLEANUP] Deleting project workspace...
[WS-CLEANUP] Deferred wipeout is used...
[WS-CLEANUP] done
[Pipeline] }
[Pipeline] // stage
[Pipeline] }
[Pipeline] // ws
[Pipeline] }
[Pipeline] // node
[Pipeline] }
[Pipeline] // parallel
[Pipeline] stage
[Pipeline] { (Notifications)
[Pipeline] echo
Build result: FAILURE
[Pipeline] jiraIssueSelector
[Pipeline] echo
The authors of changes [olamy].
[Pipeline] echo
Sending email ...
[Pipeline] emailext

Build failed in Jenkins: Maven » Maven TLP » maven-invoker-plugin » master #66

Posted by Apache Jenkins Server <je...@builds.apache.org>.
See https://ci-maven.apache.org/job/Maven/job/maven-box/job/maven-invoker-plugin/job/master/66/

Changes:

* Back to groovy all (#62)

All tests passed

Build log:
[...truncated 6888 lines...]
[withMaven] artifactsPublisher - Archive artifact windows-jdk11-m3.6.x_build\pom.xml under org\apache\maven\plugins\maven-invoker-plugin\3.2.3-SNAPSHOT\maven-invoker-plugin-3.2.3-SNAPSHOT.pom
[withMaven] artifactsPublisher - Archive artifact windows-jdk11-m3.6.x_build\target\maven-invoker-plugin-3.2.3-SNAPSHOT.jar under org\apache\maven\plugins\maven-invoker-plugin\3.2.3-SNAPSHOT\maven-invoker-plugin-3.2.3-SNAPSHOT.jar
[withMaven] junitPublisher - Archive test results for Maven artifact org.apache.maven.plugins:maven-invoker-plugin:maven-plugin:3.2.3-SNAPSHOT generated by maven-surefire-plugin:test (default-test): windows-jdk11-m3.6.x_build\target\surefire-reports\*.xml
Recording test results
[INFO] run post-build script verify.bsh
[INFO]           selector-scripts/pom.xml ......................... SUCCESS (11.0 s)
[INFO] Building: script-additional-vars/pom.xml
[INFO]           MINVOKER-191/pom.xml ............................. SUCCESS (10.7 s)
[INFO] Building: invocation-spaces/pom.xml
[INFO] run post-build script verify.bsh
[INFO]           selector-scripts\pom.xml ......................... SUCCESS (11.3 s)
[INFO] Building: settings-auto-exclude\pom.xml
[withMaven] Jenkins Task Scanner Plugin not found, don't display results of source code scanning for 'TODO' and 'FIXME' in pipeline screen.
[withMaven] invokerPublisher - Archive invoker results for Maven artifact MavenArtifact{org.apache.maven.plugins:maven-invoker-plugin:maven-plugin:3.2.3-SNAPSHOT(version: 3.2.3-SNAPSHOT, snapshot:false) } generated by PluginInvocation{org.apache.maven.plugins:maven-invoker-plugin:3.2.2@integration-test  integration-test}: windows-jdk11-m3.6.x_build\target\invoker-reports\*.xml
ERROR: [withMaven] invokerPublisher - Silently ignore exception archiving Invoker runs for Maven artifact MavenArtifact{org.apache.maven.plugins:maven-invoker-plugin:maven-plugin:3.2.3-SNAPSHOT(version: 3.2.3-SNAPSHOT, snapshot:false) } generated by PluginInvocation{org.apache.maven.plugins:maven-invoker-plugin:3.2.2@integration-test  integration-test}: java.io.IOException: Unknown attribute 'buildlog' for tag 'build-job' (position: START_TAG seen ...k11-m3.6.x_build\target\it\MINVOKER-190-logDirectory\build.log" />... @2:288) 
[withMaven] Publishers: Generated Artifacts Publisher: 4614 ms, Junit Publisher: 7147 ms, Open Task Scanner Publisher: 12 ms, Invoker Publisher: 893 ms, Pipeline Graph Publisher: 32 ms
[INFO]           settings-auto-exclude\pom.xml .................... SUCCESS (4.4 s)
[INFO] Building: settings-inherit\pom.xml
[Pipeline] // withMaven
[Pipeline] cleanWs
[WS-CLEANUP] Deleting project workspace...
[WS-CLEANUP] Deferred wipeout is used...
[WS-CLEANUP] done
[Pipeline] }
[Pipeline] // stage
[Pipeline] }
[Pipeline] // ws
[Pipeline] }
[Pipeline] // node
[Pipeline] }
[INFO]           script-additional-vars/pom.xml ................... SUCCESS (12.8 s)
[INFO] Building: invocation-emptyproperty/pom.xml
[INFO] run post-build script verify.bsh
[INFO]           invocation-spaces/pom.xml ........................ SUCCESS (10.4 s)
[INFO] Building: fail-run-postbuild/pom.xml
[INFO]           invocation-emptyproperty/pom.xml ................. SUCCESS (7.2 s)
[INFO] Building: wrongPropertyInterpolation/pom.xml
[INFO] run post-build script verify.bsh
[INFO]           fail-run-postbuild/pom.xml ....................... SUCCESS (8.8 s)
[INFO] Building: project-cloning/pom.xml
[INFO] run pre-build script setup.bsh
[INFO]           settings-inherit\pom.xml ......................... SUCCESS (15.6 s)
[INFO] Building: settings-merge\pom.xml
[INFO]           wrongPropertyInterpolation/pom.xml ............... SUCCESS (13.5 s)
[INFO] Building: invocation-project/pom.xml
[INFO] run post-build script verify.bsh
[INFO]           project-cloning/pom.xml .......................... SUCCESS (11.5 s)
[INFO] Building: settings-inherit/pom.xml
[INFO]           settings-inherit/pom.xml ......................... SUCCESS (7.2 s)
[INFO] Building: script-context/pom.xml
[INFO] run post-build script verify.bsh
[INFO]           invocation-project/pom.xml ....................... SUCCESS (10.2 s)
[INFO] Building: MINVOKER-191/pom.xml
[INFO]           settings-merge\pom.xml ........................... SUCCESS (21.4 s)
[INFO] Building: settings-merge-multiexecutions\pom.xml
[INFO]           MINVOKER-191/pom.xml ............................. SUCCESS (11.0 s)
[INFO] Building: invocation-spaces/pom.xml
[INFO] run post-build script verify.bsh
[INFO]           script-context/pom.xml ........................... SUCCESS (11.6 s)
[INFO] 
[INFO] --- maven-checkstyle-plugin:3.0.0:check (checkstyle-check) @ maven-invoker-plugin ---
[INFO] There are 4 errors reported by Checkstyle 6.18 with config/maven_checks.xml ruleset.
[INFO] Ignored 4 errors, 0 violation remaining.
[INFO] 
[INFO] --- maven-invoker-plugin:3.2.2:verify (integration-test) @ maven-invoker-plugin ---
[INFO] -------------------------------------------------
[INFO] Build Summary:
[INFO]   Passed: 74, Failed: 0, Errors: 0, Skipped: 2
[INFO] -------------------------------------------------
[ERROR] The following builds was skipped:
[ERROR] *  settings-merge/pom.xml
[ERROR] *  spaces-should-work_windows/pom.xml
[INFO] -------------------------------------------------
[INFO] ------------------------------------------------------------------------
[INFO] BUILD SUCCESS
[INFO] ------------------------------------------------------------------------
[INFO] Total time:  11:42 min
[INFO] Finished at: 2021-08-09T10:16:12Z
[INFO] ------------------------------------------------------------------------
[INFO] [jenkins-event-spy] Generated /home/jenkins/jenkins-home/workspace/_box_maven-invoker-plugin_master@3@2@tmp/withMaven8a195c5c/maven-spy-20210809-100428-986894267110906002804.log
[Pipeline] }
[Pipeline] // dir
[Pipeline] }
[withMaven] artifactsPublisher - Archive artifact linux-jdk16-m3.6.x_build/pom.xml under org/apache/maven/plugins/maven-invoker-plugin/3.2.3-SNAPSHOT/maven-invoker-plugin-3.2.3-SNAPSHOT.pom
[withMaven] artifactsPublisher - Archive artifact linux-jdk16-m3.6.x_build/target/maven-invoker-plugin-3.2.3-SNAPSHOT.jar under org/apache/maven/plugins/maven-invoker-plugin/3.2.3-SNAPSHOT/maven-invoker-plugin-3.2.3-SNAPSHOT.jar
[withMaven] junitPublisher - Archive test results for Maven artifact org.apache.maven.plugins:maven-invoker-plugin:maven-plugin:3.2.3-SNAPSHOT generated by maven-surefire-plugin:test (default-test): linux-jdk16-m3.6.x_build/target/surefire-reports/*.xml
Recording test results
[withMaven] Jenkins Task Scanner Plugin not found, don't display results of source code scanning for 'TODO' and 'FIXME' in pipeline screen.
[withMaven] invokerPublisher - Archive invoker results for Maven artifact MavenArtifact{org.apache.maven.plugins:maven-invoker-plugin:maven-plugin:3.2.3-SNAPSHOT(version: 3.2.3-SNAPSHOT, snapshot:false) } generated by PluginInvocation{org.apache.maven.plugins:maven-invoker-plugin:3.2.2@integration-test  integration-test}: linux-jdk16-m3.6.x_build/target/invoker-reports/*.xml
ERROR: [withMaven] invokerPublisher - Silently ignore exception archiving Invoker runs for Maven artifact MavenArtifact{org.apache.maven.plugins:maven-invoker-plugin:maven-plugin:3.2.3-SNAPSHOT(version: 3.2.3-SNAPSHOT, snapshot:false) } generated by PluginInvocation{org.apache.maven.plugins:maven-invoker-plugin:3.2.2@integration-test  integration-test}: java.io.IOException: Unknown attribute 'buildlog' for tag 'build-job' (position: START_TAG seen ...k16-m3.6.x_build/target/it/MINVOKER-190-logDirectory/build.log" />... @2:281) 
[withMaven] Publishers: Generated Artifacts Publisher: 97 ms, Junit Publisher: 171 ms, Open Task Scanner Publisher: 1 ms, Invoker Publisher: 253 ms
[Pipeline] // withMaven
[Pipeline] cleanWs
[WS-CLEANUP] Deleting project workspace...
[WS-CLEANUP] Deferred wipeout is used...
[WS-CLEANUP] done
[Pipeline] }
[Pipeline] // stage
[Pipeline] }
[Pipeline] // ws
[Pipeline] }
[Pipeline] // node
[Pipeline] }
[INFO]           settings-merge-multiexecutions\pom.xml ........... SUCCESS (12.7 s)
[INFO] Building: settings-merge_jdk9+\pom.xml
[INFO] run post-build script verify.bsh
[INFO]           invocation-spaces/pom.xml ........................ SUCCESS (10.4 s)
[INFO] Building: fail-run-postbuild/pom.xml
[INFO] run post-build script verify.bsh
[INFO]           fail-run-postbuild/pom.xml ....................... SUCCESS (8.7 s)
[INFO] Building: project-cloning/pom.xml
[INFO] run pre-build script setup.bsh
[INFO]           settings-merge_jdk9+\pom.xml ..................... SUCCESS (17.9 s)
[INFO] Building: settings-override\pom.xml
[INFO] run post-build script verify.bsh
[INFO]           project-cloning/pom.xml .......................... SUCCESS (11.8 s)
[INFO] Building: settings-inherit/pom.xml
[INFO]           settings-override\pom.xml ........................ SUCCESS (10.7 s)
[INFO] Building: skip-install\pom.xml
[INFO] run post-build script verify.bsh
[INFO]           skip-install\pom.xml ............................. SUCCESS (2.7 s)
[INFO] Building: skip-run\pom.xml
[INFO]           settings-inherit/pom.xml ......................... SUCCESS (7.4 s)
[INFO] Building: script-context/pom.xml
[INFO] run post-build script verify.bsh
[INFO]           skip-run\pom.xml ................................. SUCCESS (2.7 s)
[INFO] Building: spaces-should-work_non-windows\pom.xml
[INFO]           spaces-should-work_non-windows\pom.xml ........... SKIPPED due to OS
[INFO] Building: spaces-should-work_windows\pom.xml
[INFO] run pre-build script setup.groovy
[INFO] run post-build script verify.bsh
[INFO]           script-context/pom.xml ........................... SUCCESS (11.7 s)
[INFO] 
[INFO] --- maven-checkstyle-plugin:3.0.0:check (checkstyle-check) @ maven-invoker-plugin ---
[INFO]           spaces-should-work_windows\pom.xml ............... SUCCESS (10.7 s)
[INFO] Building: special-characters-should-work\pom.xml
[INFO] run pre-build script setup.groovy
[INFO] There are 4 errors reported by Checkstyle 6.18 with config/maven_checks.xml ruleset.
[INFO] Ignored 4 errors, 0 violation remaining.
[INFO] 
[INFO] --- maven-invoker-plugin:3.2.2:verify (integration-test) @ maven-invoker-plugin ---
[INFO] -------------------------------------------------
[INFO] Build Summary:
[INFO]   Passed: 74, Failed: 0, Errors: 0, Skipped: 2
[INFO] -------------------------------------------------
[ERROR] The following builds was skipped:
[ERROR] *  settings-merge/pom.xml
[ERROR] *  spaces-should-work_windows/pom.xml
[INFO] -------------------------------------------------
[INFO] ------------------------------------------------------------------------
[INFO] BUILD SUCCESS
[INFO] ------------------------------------------------------------------------
[INFO] Total time:  12:13 min
[INFO] Finished at: 2021-08-09T10:17:02Z
[INFO] ------------------------------------------------------------------------
[INFO] [jenkins-event-spy] Generated /home/jenkins/jenkins-home/workspace/_box_maven-invoker-plugin_master@3@2@tmp/withMavencbc17d8d/maven-spy-20210809-100448-6812758543163023243640.log
[Pipeline] }
[Pipeline] // dir
[Pipeline] }
[withMaven] artifactsPublisher - Archive artifact linux-jdk17-m3.6.x_build/pom.xml under org/apache/maven/plugins/maven-invoker-plugin/3.2.3-SNAPSHOT/maven-invoker-plugin-3.2.3-SNAPSHOT.pom
[withMaven] artifactsPublisher - Archive artifact linux-jdk17-m3.6.x_build/target/maven-invoker-plugin-3.2.3-SNAPSHOT.jar under org/apache/maven/plugins/maven-invoker-plugin/3.2.3-SNAPSHOT/maven-invoker-plugin-3.2.3-SNAPSHOT.jar
[withMaven] junitPublisher - Archive test results for Maven artifact org.apache.maven.plugins:maven-invoker-plugin:maven-plugin:3.2.3-SNAPSHOT generated by maven-surefire-plugin:test (default-test): linux-jdk17-m3.6.x_build/target/surefire-reports/*.xml
Recording test results
[withMaven] Jenkins Task Scanner Plugin not found, don't display results of source code scanning for 'TODO' and 'FIXME' in pipeline screen.
[withMaven] invokerPublisher - Archive invoker results for Maven artifact MavenArtifact{org.apache.maven.plugins:maven-invoker-plugin:maven-plugin:3.2.3-SNAPSHOT(version: 3.2.3-SNAPSHOT, snapshot:false) } generated by PluginInvocation{org.apache.maven.plugins:maven-invoker-plugin:3.2.2@integration-test  integration-test}: linux-jdk17-m3.6.x_build/target/invoker-reports/*.xml
ERROR: [withMaven] invokerPublisher - Silently ignore exception archiving Invoker runs for Maven artifact MavenArtifact{org.apache.maven.plugins:maven-invoker-plugin:maven-plugin:3.2.3-SNAPSHOT(version: 3.2.3-SNAPSHOT, snapshot:false) } generated by PluginInvocation{org.apache.maven.plugins:maven-invoker-plugin:3.2.2@integration-test  integration-test}: java.io.IOException: Unknown attribute 'buildlog' for tag 'build-job' (position: START_TAG seen ...k17-m3.6.x_build/target/it/MINVOKER-190-logDirectory/build.log" />... @2:281) 
[withMaven] Publishers: Generated Artifacts Publisher: 96 ms, Junit Publisher: 112 ms, Open Task Scanner Publisher: 1 ms, Invoker Publisher: 204 ms, Pipeline Graph Publisher: 2 ms
[Pipeline] // withMaven
[Pipeline] cleanWs
[WS-CLEANUP] Deleting project workspace...
[WS-CLEANUP] Deferred wipeout is used...
[WS-CLEANUP] done
[Pipeline] }
[Pipeline] // stage
[Pipeline] }
[Pipeline] // ws
[Pipeline] }
[Pipeline] // node
[Pipeline] }
[INFO]           special-characters-should-work\pom.xml ........... SUCCESS (10.7 s)
[INFO] Building: staging-dependencies\pom.xml
[INFO] run post-build script verify.bsh
[INFO]           staging-dependencies\pom.xml ..................... SUCCESS (10.5 s)
[INFO] Building: staging-pom\pom.xml
[INFO] run post-build script verify.bsh
[INFO]           staging-pom\pom.xml .............................. SUCCESS (2.7 s)
[INFO] Building: staging-reactor\pom.xml
[INFO] run post-build script verify.bsh
[INFO]           staging-reactor\pom.xml .......................... SUCCESS (9.9 s)
[INFO] Building: updateOnly\pom.xml
[INFO] run post-build script verify.bsh
[INFO]           updateOnly\pom.xml ............................... SUCCESS (10.1 s)
[INFO] Building: wrongPropertyInterpolation\pom.xml
[INFO]           wrongPropertyInterpolation\pom.xml ............... SUCCESS (25.9 s)
[INFO] 
[INFO] --- maven-checkstyle-plugin:3.0.0:check (checkstyle-check) @ maven-invoker-plugin ---
[INFO] There are 4 errors reported by Checkstyle 6.18 with config/maven_checks.xml ruleset.
[INFO] Ignored 4 errors, 0 violation remaining.
[INFO] 
[INFO] --- maven-invoker-plugin:3.2.2:verify (integration-test) @ maven-invoker-plugin ---
[INFO] -------------------------------------------------
[INFO] Build Summary:
[INFO]   Passed: 75, Failed: 0, Errors: 0, Skipped: 1
[INFO] -------------------------------------------------
[ERROR] The following builds was skipped:
[ERROR] *  spaces-should-work_non-windows\pom.xml
[INFO] -------------------------------------------------
[INFO] ------------------------------------------------------------------------
[INFO] BUILD SUCCESS
[INFO] ------------------------------------------------------------------------
[INFO] Total time: 15:14 min
[INFO] Finished at: 2021-08-09T10:18:10Z
[INFO] ------------------------------------------------------------------------
[INFO] [jenkins-event-spy] Generated F:\jenkins\jenkins-home\82467a7c\workspace\_box_maven-invoker-plugin_master@2@tmp\withMavenbd88204b\maven-spy-20210809-100250-3386635096238339043881.log
Picked up JAVA_TOOL_OPTIONS: -Dmaven.ext.class.path="f:\jenkins\jenkins-home\82467a7c\workspace\_box_maven-invoker-plugin_master@2@tmp\withMavenbd88204b\pipeline-maven-spy.jar" -Dorg.jenkinsci.plugins.pipeline.maven.reportsFolder="f:\jenkins\jenkins-home\82467a7c\workspace\_box_maven-invoker-plugin_master@2@tmp\withMavenbd88204b" 
[Pipeline] }
[Pipeline] // dir
[Pipeline] }
[withMaven] artifactsPublisher - Archive artifact windows-jdk8-m3.5.x_build\pom.xml under org\apache\maven\plugins\maven-invoker-plugin\3.2.3-SNAPSHOT\maven-invoker-plugin-3.2.3-SNAPSHOT.pom
[withMaven] artifactsPublisher - Archive artifact windows-jdk8-m3.5.x_build\target\maven-invoker-plugin-3.2.3-SNAPSHOT.jar under org\apache\maven\plugins\maven-invoker-plugin\3.2.3-SNAPSHOT\maven-invoker-plugin-3.2.3-SNAPSHOT.jar
[withMaven] junitPublisher - Archive test results for Maven artifact org.apache.maven.plugins:maven-invoker-plugin:maven-plugin:3.2.3-SNAPSHOT generated by maven-surefire-plugin:test (default-test): windows-jdk8-m3.5.x_build\target\surefire-reports\*.xml
Recording test results
[withMaven] Jenkins Task Scanner Plugin not found, don't display results of source code scanning for 'TODO' and 'FIXME' in pipeline screen.
[withMaven] invokerPublisher - Archive invoker results for Maven artifact MavenArtifact{org.apache.maven.plugins:maven-invoker-plugin:maven-plugin:3.2.3-SNAPSHOT(version: 3.2.3-SNAPSHOT, snapshot:false) } generated by PluginInvocation{org.apache.maven.plugins:maven-invoker-plugin:3.2.2@integration-test  integration-test}: windows-jdk8-m3.5.x_build\target\invoker-reports\*.xml
ERROR: [withMaven] invokerPublisher - Silently ignore exception archiving Invoker runs for Maven artifact MavenArtifact{org.apache.maven.plugins:maven-invoker-plugin:maven-plugin:3.2.3-SNAPSHOT(version: 3.2.3-SNAPSHOT, snapshot:false) } generated by PluginInvocation{org.apache.maven.plugins:maven-invoker-plugin:3.2.2@integration-test  integration-test}: java.io.IOException: Unknown attribute 'buildlog' for tag 'build-job' (position: START_TAG seen ...dk8-m3.5.x_build\target\it\MINVOKER-190-logDirectory\build.log" />... @2:286) 
[withMaven] Publishers: Generated Artifacts Publisher: 485 ms, Junit Publisher: 1203 ms, Open Task Scanner Publisher: 1 ms, Invoker Publisher: 436 ms
[Pipeline] // withMaven
[Pipeline] cleanWs
[WS-CLEANUP] Deleting project workspace...
[WS-CLEANUP] Deferred wipeout is used...
[WS-CLEANUP] done
[Pipeline] }
[Pipeline] // stage
[Pipeline] }
[Pipeline] // ws
[Pipeline] }
[Pipeline] // node
[Pipeline] }
[Pipeline] // parallel
[Pipeline] stage
[Pipeline] { (Notifications)
[Pipeline] echo
Build result: FAILURE
[Pipeline] jiraIssueSelector
[Pipeline] echo
The authors of changes [noreply].
[Pipeline] echo
Sending email ...
[Pipeline] emailext