You are viewing a plain text version of this content. The canonical link for it is here.
- Jenkins build is still unstable: Aries » Apache Aries Subsystem iTests #1656 - posted by Apache Jenkins Server <je...@builds.apache.org> on 2012/09/01 01:55:49 UTC, 1 replies.
- Jenkins build is still unstable: Aries #1656 - posted by Apache Jenkins Server <je...@builds.apache.org> on 2012/09/01 01:55:51 UTC, 0 replies.
- Re: Jenkins build is still unstable: Aries #1651 - posted by Holly Cummins <ho...@googlemail.com> on 2012/09/01 11:30:08 UTC, 0 replies.
- Subsystems proxy dependency version - posted by Holly Cummins <ho...@googlemail.com> on 2012/09/01 11:45:26 UTC, 5 replies.
- [jira] [Commented] (ARIES-910) Integrate Subsystems into the Aries build. - posted by "John Ross (JIRA)" <ji...@apache.org> on 2012/09/03 00:20:07 UTC, 3 replies.
- Jenkins build became unstable: Aries » Apache Aries JNDI iTests for jndi-url #1657 - posted by Apache Jenkins Server <je...@builds.apache.org> on 2012/09/03 02:47:56 UTC, 0 replies.
- Jenkins build is still unstable: AriesWithSnapshotDependencies #218 - posted by Apache Jenkins Server <je...@builds.apache.org> on 2012/09/03 04:33:06 UTC, 0 replies.
- Jenkins build is unstable: Aries » Apache Aries Subsystem iTests #1658 - posted by Apache Jenkins Server <je...@builds.apache.org> on 2012/09/03 05:17:11 UTC, 0 replies.
- Jenkins build is back to stable : Aries » Apache Aries JNDI iTests for jndi-url #1658 - posted by Apache Jenkins Server <je...@builds.apache.org> on 2012/09/03 05:17:11 UTC, 0 replies.
- Jenkins build is unstable: Aries #1658 - posted by Apache Jenkins Server <je...@builds.apache.org> on 2012/09/03 05:17:13 UTC, 0 replies.
- Jenkins build is still unstable: AriesWithSnapshotDependencies #219 - posted by Apache Jenkins Server <je...@builds.apache.org> on 2012/09/03 22:31:32 UTC, 0 replies.
- [jira] [Created] (ARIES-914) When using component-managed mode for managed-properties - posted by "Christoph Läubrich (JIRA)" <ji...@apache.org> on 2012/09/04 10:17:08 UTC, 0 replies.
- [jira] [Updated] (ARIES-914) When using component-managed mode for managed-properties the first time 'container-managed' mode is used - posted by "Christoph Läubrich (JIRA)" <ji...@apache.org> on 2012/09/04 10:19:07 UTC, 0 replies.
- [jira] [Updated] (ARIES-914) When using component-managed mode for managed-properties the first time - posted by "Christoph Läubrich (JIRA)" <ji...@apache.org> on 2012/09/04 10:19:07 UTC, 0 replies.
- [jira] [Created] (ARIES-915) The CM module for managed-service-factory does not perform the update correct with embedded managed-properties - posted by "Christoph Läubrich (JIRA)" <ji...@apache.org> on 2012/09/04 10:37:07 UTC, 0 replies.
- [jira] [Created] (ARIES-916) Lookup of System BundleContext via JNDI causes AccessControlException - posted by "David Bosschaert (JIRA)" <ji...@apache.org> on 2012/09/04 11:52:08 UTC, 0 replies.
- [jira] [Created] (ARIES-917) Exception when using JNDI without Blueprint bundle installed - posted by "David Bosschaert (JIRA)" <ji...@apache.org> on 2012/09/04 11:56:08 UTC, 0 replies.
- [jira] [Created] (ARIES-918) Start operations on the root subsystem should not affect its constituent bundles. - posted by "John Ross (JIRA)" <ji...@apache.org> on 2012/09/04 17:12:07 UTC, 0 replies.
- Jenkins build is unstable: Aries » Apache Aries Subsystem iTests #1660 - posted by Apache Jenkins Server <je...@builds.apache.org> on 2012/09/04 17:12:41 UTC, 0 replies.
- Jenkins build is unstable: Aries #1660 - posted by Apache Jenkins Server <je...@builds.apache.org> on 2012/09/04 17:13:22 UTC, 0 replies.
- Jenkins build is still unstable: AriesWithSnapshotDependencies #220 - posted by Apache Jenkins Server <je...@builds.apache.org> on 2012/09/04 17:42:42 UTC, 0 replies.
- Jenkins build is back to stable : Aries » Apache Aries Subsystem iTests #1662 - posted by Apache Jenkins Server <je...@builds.apache.org> on 2012/09/04 20:03:29 UTC, 0 replies.
- Jenkins build is back to normal : Aries #1662 - posted by Apache Jenkins Server <je...@builds.apache.org> on 2012/09/04 20:03:31 UTC, 0 replies.
- [jira] [Resolved] (ARIES-910) Integrate Subsystems into the Aries build. - posted by "John Ross (JIRA)" <ji...@apache.org> on 2012/09/04 20:11:10 UTC, 0 replies.
- Jenkins build is still unstable: AriesWithSnapshotDependencies #221 - posted by Apache Jenkins Server <je...@builds.apache.org> on 2012/09/04 21:24:56 UTC, 0 replies.
- Build failed in Jenkins: Aries #1665 - posted by Apache Jenkins Server <je...@builds.apache.org> on 2012/09/05 11:59:21 UTC, 0 replies.
- Jenkins build is back to normal : Aries #1666 - posted by Apache Jenkins Server <je...@builds.apache.org> on 2012/09/05 12:37:12 UTC, 0 replies.
- Jenkins build is unstable: AriesWithSnapshotDependencies #226 - posted by Apache Jenkins Server <je...@builds.apache.org> on 2012/09/05 12:45:08 UTC, 0 replies.
- [jira] [Created] (ARIES-919) Blueprint HelloWorld sample broken - posted by "Holly Cummins (JIRA)" <ji...@apache.org> on 2012/09/05 13:26:07 UTC, 0 replies.
- [jira] [Assigned] (ARIES-918) Start operations on the root subsystem should not affect its constituent bundles. - posted by "John Ross (JIRA)" <ji...@apache.org> on 2012/09/05 15:03:07 UTC, 0 replies.
- [jira] [Resolved] (ARIES-918) Start operations on the root subsystem should not affect its constituent bundles. - posted by "John Ross (JIRA)" <ji...@apache.org> on 2012/09/05 16:37:07 UTC, 0 replies.
- [jira] [Created] (ARIES-920) Subsystems fails OSGi secure CT. - posted by "John Ross (JIRA)" <ji...@apache.org> on 2012/09/05 17:25:07 UTC, 0 replies.
- [jira] [Resolved] (ARIES-920) Subsystems fails OSGi secure CT. - posted by "John Ross (JIRA)" <ji...@apache.org> on 2012/09/05 17:31:07 UTC, 0 replies.
- Jenkins build is back to normal : Aries #1668 - posted by Apache Jenkins Server <je...@builds.apache.org> on 2012/09/05 18:34:25 UTC, 0 replies.
- [jira] [Resolved] (ARIES-919) Blueprint HelloWorld sample broken - posted by "Holly Cummins (JIRA)" <ji...@apache.org> on 2012/09/05 19:03:07 UTC, 0 replies.
- Jenkins build is unstable: AriesWithSnapshotDependencies #229 - posted by Apache Jenkins Server <je...@builds.apache.org> on 2012/09/05 20:40:47 UTC, 0 replies.
- Jenkins build is back to stable : AriesWithSnapshotDependencies #230 - posted by Apache Jenkins Server <je...@builds.apache.org> on 2012/09/05 22:37:29 UTC, 0 replies.
- EJB org.apache.openwebbeans dependency version - posted by Holly Cummins <ho...@googlemail.com> on 2012/09/05 22:53:08 UTC, 0 replies.
- [VOTE] Samples and itests release candidate - posted by Holly Cummins <ho...@googlemail.com> on 2012/09/05 23:14:58 UTC, 8 replies.
- Aries Spi-Fly - posted by Charles Moulliard <ch...@gmail.com> on 2012/09/06 08:57:06 UTC, 1 replies.
- Jenkins build is back to normal : Aries #1672 - posted by Apache Jenkins Server <je...@builds.apache.org> on 2012/09/06 10:31:19 UTC, 0 replies.
- Releasing SPI Fly - posted by David Bosschaert <da...@gmail.com> on 2012/09/06 11:18:36 UTC, 0 replies.
- Jenkins build became unstable: Aries » Apache Aries Blog sample iTests #1673 - posted by Apache Jenkins Server <je...@builds.apache.org> on 2012/09/06 11:27:43 UTC, 0 replies.
- Jenkins build became unstable: Aries #1673 - posted by Apache Jenkins Server <je...@builds.apache.org> on 2012/09/06 11:27:46 UTC, 0 replies.
- Build failed in Jenkins: Aries #1674 - posted by Apache Jenkins Server <je...@builds.apache.org> on 2012/09/06 12:56:31 UTC, 0 replies.
- Jenkins build became unstable: Aries » Aries EJB Extender iTests #1675 - posted by Apache Jenkins Server <je...@builds.apache.org> on 2012/09/06 14:14:16 UTC, 0 replies.
- Jenkins build became unstable: Aries » Aries EJB Modelling iTests #1675 - posted by Apache Jenkins Server <je...@builds.apache.org> on 2012/09/06 14:14:50 UTC, 0 replies.
- Jenkins build became unstable: Aries » Apache Aries Web integration tests #1675 - posted by Apache Jenkins Server <je...@builds.apache.org> on 2012/09/06 14:14:50 UTC, 0 replies.
- Jenkins build is unstable: Aries #1675 - posted by Apache Jenkins Server <je...@builds.apache.org> on 2012/09/06 14:14:54 UTC, 7 replies.
- [jira] [Created] (ARIES-921) java.lang.IllegalStateException: Orphaned bundle revision detected: org.eclipse.osgi_3.8.0.v20120529-1548 - posted by "John Ross (JIRA)" <ji...@apache.org> on 2012/09/06 21:33:08 UTC, 0 replies.
- [jira] [Commented] (ARIES-921) java.lang.IllegalStateException: Orphaned bundle revision detected: org.eclipse.osgi_3.8.0.v20120529-1548 - posted by "John Ross (JIRA)" <ji...@apache.org> on 2012/09/06 21:35:08 UTC, 1 replies.
- [jira] [Resolved] (ARIES-921) java.lang.IllegalStateException: Orphaned bundle revision detected: org.eclipse.osgi_3.8.0.v20120529-1548 - posted by "John Ross (JIRA)" <ji...@apache.org> on 2012/09/06 21:51:07 UTC, 0 replies.
- Jenkins build is back to normal : AriesWithSnapshotDependencies #235 - posted by Apache Jenkins Server <je...@builds.apache.org> on 2012/09/06 22:36:55 UTC, 0 replies.
- Jenkins build is back to stable : Aries » Aries EJB Extender iTests #1676 - posted by Apache Jenkins Server <je...@builds.apache.org> on 2012/09/06 23:10:33 UTC, 0 replies.
- Jenkins build is back to stable : Aries » Apache Aries Web integration tests #1676 - posted by Apache Jenkins Server <je...@builds.apache.org> on 2012/09/06 23:10:34 UTC, 0 replies.
- Jenkins build is back to stable : Aries » Aries EJB Modelling iTests #1676 - posted by Apache Jenkins Server <je...@builds.apache.org> on 2012/09/06 23:10:34 UTC, 0 replies.
- Build failed in Jenkins: Aries #1676 - posted by Apache Jenkins Server <je...@builds.apache.org> on 2012/09/06 23:10:37 UTC, 3 replies.
- Jenkins build is back to stable : Aries » Apache Aries Blog sample iTests #1677 - posted by Apache Jenkins Server <je...@builds.apache.org> on 2012/09/07 16:04:12 UTC, 0 replies.
- Jenkins build is back to normal : Aries #1677 - posted by Apache Jenkins Server <je...@builds.apache.org> on 2012/09/07 16:04:20 UTC, 1 replies.
- [jira] [Created] (ARIES-922) NPE in SubsystemResource.findContent - posted by "John Ross (JIRA)" <ji...@apache.org> on 2012/09/07 16:54:07 UTC, 0 replies.
- [jira] [Commented] (ARIES-922) NPE in SubsystemResource.findContent - posted by "John Ross (JIRA)" <ji...@apache.org> on 2012/09/07 17:00:07 UTC, 0 replies.
- [jira] [Resolved] (ARIES-922) NPE in SubsystemResource.findContent - posted by "John Ross (JIRA)" <ji...@apache.org> on 2012/09/07 20:37:07 UTC, 0 replies.
- [jira] [Created] (ARIES-923) A service proxy obtained from a reference list can return a null service, leading to NPE - posted by "Guillaume Nodet (JIRA)" <ji...@apache.org> on 2012/09/10 10:14:08 UTC, 0 replies.
- [jira] [Created] (ARIES-924) Deadlock in transaction wrappers BundleActivator - posted by "Gavin Scott (JIRA)" <ji...@apache.org> on 2012/09/10 22:28:07 UTC, 0 replies.
- [jira] [Resolved] (ARIES-923) A service proxy obtained from a reference list can return a null service, leading to NPE - posted by "Guillaume Nodet (JIRA)" <ji...@apache.org> on 2012/09/11 09:55:08 UTC, 0 replies.
- Jenkins build became unstable: Aries » Apache Aries Blueprint sample iTests #1679 - posted by Apache Jenkins Server <je...@builds.apache.org> on 2012/09/11 11:29:30 UTC, 0 replies.
- Jenkins build became unstable: Aries » Apache Aries Application integration tests #1679 - posted by Apache Jenkins Server <je...@builds.apache.org> on 2012/09/11 11:29:30 UTC, 0 replies.
- Jenkins build became unstable: Aries » Apache Aries Subsystem iTests #1679 - posted by Apache Jenkins Server <je...@builds.apache.org> on 2012/09/11 11:29:30 UTC, 0 replies.
- Jenkins build became unstable: Aries #1679 - posted by Apache Jenkins Server <je...@builds.apache.org> on 2012/09/11 11:29:33 UTC, 0 replies.
- Jenkins build is unstable: AriesWithSnapshotDependencies #238 - posted by Apache Jenkins Server <je...@builds.apache.org> on 2012/09/11 11:57:06 UTC, 0 replies.
- Jenkins build is back to stable : Aries » Apache Aries Blueprint sample iTests #1680 - posted by Apache Jenkins Server <je...@builds.apache.org> on 2012/09/11 14:23:04 UTC, 0 replies.
- Jenkins build is back to stable : Aries » Apache Aries Subsystem iTests #1680 - posted by Apache Jenkins Server <je...@builds.apache.org> on 2012/09/11 14:23:04 UTC, 0 replies.
- Jenkins build is back to stable : Aries » Apache Aries Application integration tests #1680 - posted by Apache Jenkins Server <je...@builds.apache.org> on 2012/09/11 14:23:04 UTC, 0 replies.
- Jenkins build is back to stable : Aries #1680 - posted by Apache Jenkins Server <je...@builds.apache.org> on 2012/09/11 14:23:07 UTC, 0 replies.
- [jira] [Closed] (ARIES-497) Subsystem-scope: some prototype work for java security - posted by "John Ross (JIRA)" <ji...@apache.org> on 2012/09/13 13:46:07 UTC, 0 replies.
- [jira] [Resolved] (ARIES-448) Support absence of a version attribute on Subsystem content - posted by "John Ross (JIRA)" <ji...@apache.org> on 2012/09/13 13:48:07 UTC, 0 replies.
- [jira] [Updated] (ARIES-869) Add support for computing blueprint service dependencies. - posted by "John Ross (JIRA)" <ji...@apache.org> on 2012/09/13 13:54:07 UTC, 0 replies.
- [jira] [Assigned] (ARIES-869) Add support for computing blueprint service dependencies. - posted by "John Ross (JIRA)" <ji...@apache.org> on 2012/09/13 14:02:07 UTC, 0 replies.
- [jira] [Commented] (ARIES-869) Add support for computing blueprint service dependencies. - posted by "John Ross (JIRA)" <ji...@apache.org> on 2012/09/13 14:02:07 UTC, 1 replies.
- Jenkins build is back to stable : AriesWithSnapshotDependencies #239 - posted by Apache Jenkins Server <je...@builds.apache.org> on 2012/09/13 18:57:57 UTC, 0 replies.
- Jenkins build is unstable: Aries » Apache Aries Blueprint sample iTests #1682 - posted by Apache Jenkins Server <je...@builds.apache.org> on 2012/09/13 22:43:48 UTC, 0 replies.
- Jenkins build is unstable: Aries #1682 - posted by Apache Jenkins Server <je...@builds.apache.org> on 2012/09/13 22:43:50 UTC, 0 replies.
- [RESULT] [VOTE] Samples and itests release candidate - posted by Holly Cummins <ho...@googlemail.com> on 2012/09/14 11:53:58 UTC, 0 replies.
- Jenkins build is unstable: Aries » Apache Aries Subsystem iTests #1684 - posted by Apache Jenkins Server <je...@builds.apache.org> on 2012/09/14 13:39:43 UTC, 0 replies.
- Jenkins build became unstable: Aries » Apache Aries Blueprint iTests #1684 - posted by Apache Jenkins Server <je...@builds.apache.org> on 2012/09/14 13:39:43 UTC, 0 replies.
- Jenkins build is back to stable : Aries » Apache Aries Blueprint sample iTests #1684 - posted by Apache Jenkins Server <je...@builds.apache.org> on 2012/09/14 13:39:43 UTC, 0 replies.
- Jenkins build is unstable: Aries #1684 - posted by Apache Jenkins Server <je...@builds.apache.org> on 2012/09/14 13:39:46 UTC, 0 replies.
- Jenkins build became unstable: AriesWithSnapshotDependencies #242 - posted by Apache Jenkins Server <je...@builds.apache.org> on 2012/09/14 14:10:01 UTC, 0 replies.
- .asc.md5 & .asc.sha1 files - posted by Jeremy Hughes <hu...@apache.org> on 2012/09/17 16:43:45 UTC, 2 replies.
- Jenkins build is back to stable : Aries » Apache Aries Subsystem iTests #1685 - posted by Apache Jenkins Server <je...@builds.apache.org> on 2012/09/17 21:01:04 UTC, 0 replies.
- Jenkins build is back to stable : Aries » Apache Aries Blueprint iTests #1685 - posted by Apache Jenkins Server <je...@builds.apache.org> on 2012/09/17 21:01:05 UTC, 0 replies.
- Build failed in Jenkins: Aries #1685 - posted by Apache Jenkins Server <je...@builds.apache.org> on 2012/09/17 21:01:16 UTC, 1 replies.
- Jenkins build is back to normal : Aries #1686 - posted by Apache Jenkins Server <je...@builds.apache.org> on 2012/09/17 23:17:14 UTC, 0 replies.
- Build failed in Jenkins: AriesWithSnapshotDependencies #244 - posted by Apache Jenkins Server <je...@builds.apache.org> on 2012/09/18 00:16:36 UTC, 3 replies.
- [jira] [Created] (ARIES-925) Out of memory error in Apache Aries build. - posted by "John Ross (JIRA)" <ji...@apache.org> on 2012/09/18 20:06:07 UTC, 0 replies.
- [jira] [Commented] (ARIES-925) Out of memory error in Apache Aries build. - posted by "John Ross (JIRA)" <ji...@apache.org> on 2012/09/18 20:28:08 UTC, 0 replies.
- Build failed in Jenkins: AriesWithSnapshotDependencies #245 - posted by Apache Jenkins Server <je...@builds.apache.org> on 2012/09/18 21:15:45 UTC, 1 replies.
- Jenkins build is back to normal : AriesWithSnapshotDependencies #246 - posted by Apache Jenkins Server <je...@builds.apache.org> on 2012/09/19 21:38:01 UTC, 0 replies.
- Build failed in Jenkins: AriesWithSnapshotDependencies #248 - posted by Apache Jenkins Server <je...@builds.apache.org> on 2012/09/21 12:53:44 UTC, 0 replies.
- [jira] [Assigned] (ARIES-908) Allow Blueprint Services registered with concrete classes with no zero arg constructors, to be proxied - posted by "Mark Nuttall (JIRA)" <ji...@apache.org> on 2012/09/21 15:07:10 UTC, 0 replies.
- [jira] [Resolved] (ARIES-908) Allow Blueprint Services registered with concrete classes with no zero arg constructors, to be proxied - posted by "Mark Nuttall (JIRA)" <ji...@apache.org> on 2012/09/21 15:11:07 UTC, 0 replies.
- JIRA versions for released bundles - posted by Holly Cummins <ho...@googlemail.com> on 2012/09/21 15:42:03 UTC, 0 replies.
- Jenkins build is unstable: AriesWithSnapshotDependencies #249 - posted by Apache Jenkins Server <je...@builds.apache.org> on 2012/09/21 17:03:50 UTC, 0 replies.
- [jira] [Resolved] (ARIES-640) application.utils imports aries.util version [0.4,1.0) but aries.util exports version 0.3.1 - posted by "Holly Cummins (JIRA)" <ji...@apache.org> on 2012/09/21 19:55:07 UTC, 0 replies.
- [jira] [Created] (ARIES-926) Application install doesn't notice applications already in load directory when framework starts - posted by "Holly Cummins (JIRA)" <ji...@apache.org> on 2012/09/21 19:57:07 UTC, 0 replies.
- Jenkins build is back to stable : AriesWithSnapshotDependencies #250 - posted by Apache Jenkins Server <je...@builds.apache.org> on 2012/09/23 22:42:47 UTC, 0 replies.
- [jira] [Resolved] (ARIES-899) Possible concurrent access to the namespace handler registry - posted by "Guillaume Nodet (JIRA)" <ji...@apache.org> on 2012/09/25 17:27:07 UTC, 0 replies.
- [VOTE] Release blueprint-core, jmx-core, transaction-manager and jpa-container-context 1.0.1 - posted by Guillaume Nodet <gn...@gmail.com> on 2012/09/25 17:35:32 UTC, 6 replies.
- [VOTE] Release transaction-jms and transaction-jdbc 1.0.0 - posted by Guillaume Nodet <gn...@gmail.com> on 2012/09/25 17:46:01 UTC, 8 replies.
- Jenkins build became unstable: Aries » Apache Aries Subsystem iTests #1694 - posted by Apache Jenkins Server <je...@builds.apache.org> on 2012/09/25 18:19:43 UTC, 0 replies.
- Jenkins build became unstable: Aries » Apache Aries Application integration tests #1694 - posted by Apache Jenkins Server <je...@builds.apache.org> on 2012/09/25 18:19:43 UTC, 0 replies.
- Jenkins build became unstable: Aries #1694 - posted by Apache Jenkins Server <je...@builds.apache.org> on 2012/09/25 18:19:46 UTC, 0 replies.
- Jenkins build became unstable: AriesWithSnapshotDependencies #251 - posted by Apache Jenkins Server <je...@builds.apache.org> on 2012/09/25 18:36:56 UTC, 0 replies.
- Jenkins build is back to stable : Aries » Apache Aries Subsystem iTests #1695 - posted by Apache Jenkins Server <je...@builds.apache.org> on 2012/09/26 01:34:30 UTC, 0 replies.
- Jenkins build is back to stable : Aries » Apache Aries Application integration tests #1695 - posted by Apache Jenkins Server <je...@builds.apache.org> on 2012/09/26 01:35:34 UTC, 0 replies.
- Jenkins build is back to stable : Aries #1695 - posted by Apache Jenkins Server <je...@builds.apache.org> on 2012/09/26 01:35:37 UTC, 0 replies.
- [jira] [Created] (ARIES-927) Imports org.osgi.service.framework package as optional but assumes it's there nevertheless. - posted by "John Ross (JIRA)" <ji...@apache.org> on 2012/09/26 01:52:08 UTC, 0 replies.
- [jira] [Updated] (ARIES-927) Imports org.osgi.service.framework package as optional but assumes it's there nevertheless. - posted by "John Ross (JIRA)" <ji...@apache.org> on 2012/09/26 01:58:10 UTC, 1 replies.
- [jira] [Commented] (ARIES-927) Imports org.osgi.service.framework package as optional but assumes it's there nevertheless. - posted by "David Jencks (JIRA)" <ji...@apache.org> on 2012/09/26 08:24:07 UTC, 2 replies.
- Jenkins build is back to stable : AriesWithSnapshotDependencies #253 - posted by Apache Jenkins Server <je...@builds.apache.org> on 2012/09/27 00:20:27 UTC, 0 replies.
- Jenkins build became unstable: Aries » Apache Aries JNDI iTests for jndi-url #1696 - posted by Apache Jenkins Server <je...@builds.apache.org> on 2012/09/27 00:20:33 UTC, 0 replies.
- [jira] [Created] (ARIES-928) Blueprint container hangs forever on shutdown from time to time "org.apache.aries.blueprint[org.apache.aries.blueprint.container.ServiceRecipe] : Calling listeners for service unregistration" - posted by "Oliver Lietz (JIRA)" <ji...@apache.org> on 2012/09/27 10:16:07 UTC, 0 replies.
- [jira] [Updated] (ARIES-928) Blueprint container hangs forever on shutdown from time to time "org.apache.aries.blueprint[org.apache.aries.blueprint.container.ServiceRecipe] : Calling listeners for service unregistration" - posted by "Oliver Lietz (JIRA)" <ji...@apache.org> on 2012/09/27 10:18:10 UTC, 2 replies.
- Jenkins build is back to stable : Aries » Apache Aries JNDI iTests for jndi-url #1697 - posted by Apache Jenkins Server <je...@builds.apache.org> on 2012/09/27 14:17:03 UTC, 0 replies.
- Jenkins build is back to normal : Aries #1697 - posted by Apache Jenkins Server <je...@builds.apache.org> on 2012/09/27 14:17:06 UTC, 0 replies.
- [jira] [Assigned] (ARIES-927) Imports org.osgi.service.framework package as optional but assumes it's there nevertheless. - posted by "John Ross (JIRA)" <ji...@apache.org> on 2012/09/27 22:53:07 UTC, 0 replies.
- [jira] [Resolved] (ARIES-927) Imports org.osgi.service.framework package as optional but assumes it's there nevertheless. - posted by "John Ross (JIRA)" <ji...@apache.org> on 2012/09/27 22:55:07 UTC, 0 replies.
- Jenkins build became unstable: Aries » Apache Aries Application integration tests #1698 - posted by Apache Jenkins Server <je...@builds.apache.org> on 2012/09/28 00:51:23 UTC, 2 replies.
- Jenkins build became unstable: Aries #1698 - posted by Apache Jenkins Server <je...@builds.apache.org> on 2012/09/28 00:51:26 UTC, 0 replies.
- Build failed in Jenkins: AriesWithSnapshotDependencies #254 - posted by Apache Jenkins Server <je...@builds.apache.org> on 2012/09/28 02:48:47 UTC, 1 replies.
- Jenkins build is back to stable : Aries » Apache Aries Application integration tests #1699 - posted by Apache Jenkins Server <je...@builds.apache.org> on 2012/09/28 15:00:03 UTC, 0 replies.
- Jenkins build is back to stable : Aries #1699 - posted by Apache Jenkins Server <je...@builds.apache.org> on 2012/09/28 15:00:05 UTC, 0 replies.
- [jira] [Created] (ARIES-929) install subsystems from IDirectory objects - posted by "Amardeep Bhattal (JIRA)" <ji...@apache.org> on 2012/09/28 16:47:07 UTC, 0 replies.
- [jira] [Updated] (ARIES-929) install subsystems from IDirectory objects - posted by "Amardeep Bhattal (JIRA)" <ji...@apache.org> on 2012/09/28 16:49:07 UTC, 1 replies.
- [jira] [Created] (ARIES-930) The abstract reference recipe may end up tracking the same reference multiple times - posted by "Guillaume Nodet (JIRA)" <ji...@apache.org> on 2012/09/28 17:43:07 UTC, 0 replies.
- [jira] [Commented] (ARIES-930) The abstract reference recipe may end up tracking the same reference multiple times - posted by "Guillaume Nodet (JIRA)" <ji...@apache.org> on 2012/09/28 17:51:07 UTC, 0 replies.
- [jira] [Resolved] (ARIES-930) The abstract reference recipe may end up tracking the same reference multiple times - posted by "Guillaume Nodet (JIRA)" <ji...@apache.org> on 2012/09/28 17:51:08 UTC, 0 replies.
- [jira] [Commented] (ARIES-929) install subsystems from IDirectory objects - posted by "Amardeep Bhattal (JIRA)" <ji...@apache.org> on 2012/09/28 18:17:07 UTC, 0 replies.
- [jira] [Comment Edited] (ARIES-929) install subsystems from IDirectory objects - posted by "Amardeep Bhattal (JIRA)" <ji...@apache.org> on 2012/09/28 18:23:07 UTC, 1 replies.
- Jenkins build is back to normal : AriesWithSnapshotDependencies #255 - posted by Apache Jenkins Server <je...@builds.apache.org> on 2012/09/28 18:40:09 UTC, 0 replies.