You are viewing a plain text version of this content. The canonical link for it is here.
- [continuum] BUILD SUCCESSFUL: Maven Integration Testing - Maven Integration Test Plugin :: Site - default maven2 buildDefinition - posted by "Continuum@vmbuild.apache.org" <co...@apache.org> on 2009/09/01 01:56:14 UTC, 0 replies.
- Build failed in Hudson: maven-core-integration-testing » 1.5,windows #417 - posted by Hudson <Hu...@sonatype.org> on 2009/09/01 03:04:07 UTC, 0 replies.
- Hudson build is back to normal: maven-core-integration-testing » 1.5,windows #418 - posted by Hudson <Hu...@sonatype.org> on 2009/09/01 11:38:00 UTC, 0 replies.
- Build failed in Hudson: maven-core-integration-testing » 1.5,windows #420 - posted by Hudson <Hu...@sonatype.org> on 2009/09/01 21:50:46 UTC, 0 replies.
- Build failed in Hudson: maven-core-integration-testing » 1.5,windows #421 - posted by Hudson <Hu...@sonatype.org> on 2009/09/01 21:57:41 UTC, 0 replies.
- [continuum] BUILD ERROR: Maven Integration Testing - Maven Integration Test Plugin :: Class Loader :: Dependency A - default maven2 buildDefinition - posted by "Continuum@vmbuild.apache.org" <co...@apache.org> on 2009/09/02 03:41:00 UTC, 0 replies.
- [continuum] BUILD SUCCESSFUL: Maven Integration Testing - Maven Integration Test Plugin :: Class Loader :: Dependency A - default maven2 buildDefinition - posted by "Continuum@vmbuild.apache.org" <co...@apache.org> on 2009/09/02 05:44:32 UTC, 0 replies.
- Build failed in Hudson: Maven-2.0.x-bootstrap » 1.4,windows #112 - posted by Hudson <Hu...@sonatype.org> on 2009/09/03 01:47:13 UTC, 0 replies.
- Build failed in Hudson: Maven-2.0.x » 1.4,windows #87 - posted by Hudson <Hu...@sonatype.org> on 2009/09/03 01:47:52 UTC, 0 replies.
- Build failed in Hudson: Maven-2.0.x-bootstrap » 1.4,ubuntu #112 - posted by Hudson <Hu...@sonatype.org> on 2009/09/03 02:26:14 UTC, 0 replies.
- Build failed in Hudson: Maven-2.0.x » 1.4,ubuntu #87 - posted by Hudson <Hu...@sonatype.org> on 2009/09/03 02:27:22 UTC, 0 replies.
- Build failed in Hudson: Maven-Assembly-Plugin-with-ITs » 1.5,ubuntu #36 - posted by Hudson <Hu...@sonatype.org> on 2009/09/03 02:58:32 UTC, 0 replies.
- Build failed in Hudson: Maven-Assembly-Plugin-with-ITs » 1.5,windows #36 - posted by Hudson <Hu...@sonatype.org> on 2009/09/03 03:28:48 UTC, 0 replies.
- Build failed in Hudson: wagon » 1.5,windows #33 - posted by Hudson <Hu...@sonatype.org> on 2009/09/03 07:28:26 UTC, 0 replies.
- Build failed in Hudson: ant-tasks » 1.5,windows #37 - posted by Hudson <Hu...@sonatype.org> on 2009/09/03 07:30:11 UTC, 0 replies.
- Build failed in Hudson: Maven-2.0.x-bootstrap » 1.4,windows #113 - posted by Hudson <Hu...@sonatype.org> on 2009/09/03 07:32:46 UTC, 0 replies.
- Build failed in Hudson: Maven-2.0.x » 1.4,windows #88 - posted by Hudson <Hu...@sonatype.org> on 2009/09/03 07:32:48 UTC, 0 replies.
- Build failed in Hudson: Maven-2.2.x » 1.5,windows #43 - posted by Hudson <Hu...@sonatype.org> on 2009/09/03 07:32:49 UTC, 0 replies.
- Build failed in Hudson: Maven-Assembly-Plugin-with-ITs » 1.5,windows #37 - posted by Hudson <Hu...@sonatype.org> on 2009/09/03 07:32:51 UTC, 0 replies.
- Build failed in Hudson: maven-core-integration-testing » windows #424 - posted by Hudson <Hu...@sonatype.org> on 2009/09/03 07:41:29 UTC, 0 replies.
- Build failed in Hudson: maven-plugin-tools » 1.5,windows #28 - posted by Hudson <Hu...@sonatype.org> on 2009/09/03 07:55:25 UTC, 0 replies.
- Build failed in Hudson: maven-shared » 1.5,windows #134 - posted by Hudson <Hu...@sonatype.org> on 2009/09/03 08:06:46 UTC, 0 replies.
- Build failed in Hudson: Maven-2.0.x-bootstrap » 1.4,ubuntu #113 - posted by Hudson <Hu...@sonatype.org> on 2009/09/03 08:07:05 UTC, 0 replies.
- Build failed in Hudson: Maven-2.0.x » 1.4,ubuntu #88 - posted by Hudson <Hu...@sonatype.org> on 2009/09/03 08:07:31 UTC, 0 replies.
- Build failed in Hudson: Maven-Assembly-Plugin-with-ITs » 1.5,ubuntu #37 - posted by Hudson <Hu...@sonatype.org> on 2009/09/03 08:31:24 UTC, 0 replies.
- Build failed in Hudson: ant-tasks » 1.5,windows #38 - posted by Hudson <Hu...@sonatype.org> on 2009/09/03 10:01:33 UTC, 0 replies.
- Build failed in Hudson: Maven-2.0.x » 1.4,windows #89 - posted by Hudson <Hu...@sonatype.org> on 2009/09/03 10:14:48 UTC, 0 replies.
- Build failed in Hudson: Maven-2.0.x-bootstrap » 1.4,windows #114 - posted by Hudson <Hu...@sonatype.org> on 2009/09/03 10:14:53 UTC, 0 replies.
- Build failed in Hudson: Maven-2.2.x » 1.5,windows #44 - posted by Hudson <Hu...@sonatype.org> on 2009/09/03 10:17:01 UTC, 0 replies.
- Build failed in Hudson: Maven-Assembly-Plugin-with-ITs » 1.5,windows #38 - posted by Hudson <Hu...@sonatype.org> on 2009/09/03 10:19:29 UTC, 0 replies.
- Build failed in Hudson: maven-core-integration-testing » windows #425 - posted by Hudson <Hu...@sonatype.org> on 2009/09/03 10:25:29 UTC, 0 replies.
- Build failed in Hudson: maven-plugin-tools » 1.5,windows #29 - posted by Hudson <Hu...@sonatype.org> on 2009/09/03 10:27:17 UTC, 0 replies.
- Build failed in Hudson: Maven-2.0.x » 1.4,ubuntu #89 - posted by Hudson <Hu...@sonatype.org> on 2009/09/03 10:27:48 UTC, 0 replies.
- Build failed in Hudson: Maven-2.0.x-bootstrap » 1.4,ubuntu #114 - posted by Hudson <Hu...@sonatype.org> on 2009/09/03 10:27:49 UTC, 0 replies.
- Build failed in Hudson: maven-shared » 1.5,windows #135 - posted by Hudson <Hu...@sonatype.org> on 2009/09/03 10:30:10 UTC, 0 replies.
- Build failed in Hudson: Maven-Assembly-Plugin-with-ITs » 1.5,ubuntu #38 - posted by Hudson <Hu...@sonatype.org> on 2009/09/03 11:00:22 UTC, 0 replies.
- Build failed in Hudson: surefire » 1.5,windows #19 - posted by Hudson <Hu...@sonatype.org> on 2009/09/03 11:10:18 UTC, 0 replies.
- Build failed in Hudson: wagon » 1.5,windows #34 - posted by Hudson <Hu...@sonatype.org> on 2009/09/03 11:10:47 UTC, 0 replies.
- Hudson build is back to normal: ant-tasks » 1.5,windows #39 - posted by Hudson <Hu...@sonatype.org> on 2009/09/03 13:03:04 UTC, 0 replies.
- Hudson build is back to normal: Maven-2.2.x-bootstrap » 1.5,windows #68 - posted by Hudson <Hu...@sonatype.org> on 2009/09/03 13:43:09 UTC, 0 replies.
- Build failed in Hudson: Maven-2.0.x » 1.4,ubuntu #90 - posted by Hudson <Hu...@sonatype.org> on 2009/09/03 13:57:43 UTC, 0 replies.
- Build failed in Hudson: Maven-2.0.x-bootstrap » 1.4,ubuntu #115 - posted by Hudson <Hu...@sonatype.org> on 2009/09/03 13:58:00 UTC, 0 replies.
- Build failed in Hudson: Maven-Assembly-Plugin-with-ITs » 1.5,ubuntu #39 - posted by Hudson <Hu...@sonatype.org> on 2009/09/03 14:26:45 UTC, 0 replies.
- Build failed in Hudson: Maven-2.0.x » 1.4,windows #90 - posted by Hudson <Hu...@sonatype.org> on 2009/09/03 14:33:40 UTC, 0 replies.
- Build failed in Hudson: Maven-2.0.x-bootstrap » 1.4,windows #115 - posted by Hudson <Hu...@sonatype.org> on 2009/09/03 14:34:36 UTC, 0 replies.
- Hudson build is back to normal: Maven-2.2.x » 1.5,windows #45 - posted by Hudson <Hu...@sonatype.org> on 2009/09/03 14:41:44 UTC, 0 replies.
- Hudson build is back to normal: maven-plugin-tools » 1.5,windows #30 - posted by Hudson <Hu...@sonatype.org> on 2009/09/03 15:00:11 UTC, 0 replies.
- Hudson build is back to normal: maven-core-integration-testing » windows #426 - posted by Hudson <Hu...@sonatype.org> on 2009/09/03 15:03:13 UTC, 0 replies.
- Hudson build is back to normal: maven-shared » 1.5,windows #136 - posted by Hudson <Hu...@sonatype.org> on 2009/09/03 15:29:21 UTC, 0 replies.
- Build failed in Hudson: Maven-Assembly-Plugin-with-ITs » 1.5,windows #39 - posted by Hudson <Hu...@sonatype.org> on 2009/09/03 15:40:52 UTC, 0 replies.
- Hudson build is back to normal: wagon » 1.5,windows #35 - posted by Hudson <Hu...@sonatype.org> on 2009/09/03 17:43:35 UTC, 0 replies.
- Hudson build is back to normal: surefire » 1.5,windows #20 - posted by Hudson <Hu...@sonatype.org> on 2009/09/03 18:09:22 UTC, 0 replies.
- Build failed in Hudson: ant-tasks » 1.5,windows #41 - posted by Hudson <Hu...@sonatype.org> on 2009/09/04 08:01:30 UTC, 0 replies.
- Build failed in Hudson: Maven-2.2.x-bootstrap » 1.5,windows #70 - posted by Hudson <Hu...@sonatype.org> on 2009/09/04 08:02:30 UTC, 0 replies.
- Build failed in Hudson: Maven-2.0.x » 1.4,windows #91 - posted by Hudson <Hu...@sonatype.org> on 2009/09/04 08:02:37 UTC, 0 replies.
- Build failed in Hudson: Maven-2.0.x-bootstrap » 1.4,windows #116 - posted by Hudson <Hu...@sonatype.org> on 2009/09/04 08:05:54 UTC, 0 replies.
- Build failed in Hudson: Maven-2.0.x » 1.4,ubuntu #91 - posted by Hudson <Hu...@sonatype.org> on 2009/09/04 08:20:51 UTC, 0 replies.
- Build failed in Hudson: Maven-2.0.x-bootstrap » 1.4,ubuntu #116 - posted by Hudson <Hu...@sonatype.org> on 2009/09/04 08:25:08 UTC, 0 replies.
- Build failed in Hudson: Maven-Assembly-Plugin-with-ITs » 1.5,windows #40 - posted by Hudson <Hu...@sonatype.org> on 2009/09/04 09:10:34 UTC, 0 replies.
- Build failed in Hudson: Maven-Assembly-Plugin-with-ITs » 1.5,ubuntu #40 - posted by Hudson <Hu...@sonatype.org> on 2009/09/04 09:14:16 UTC, 0 replies.
- Build failed in Hudson: wagon » 1.5,windows #36 - posted by Hudson <Hu...@sonatype.org> on 2009/09/04 09:56:12 UTC, 0 replies.
- Build failed in Hudson: maven-core-integration-testing » windows #428 - posted by Hudson <Hu...@sonatype.org> on 2009/09/04 16:06:36 UTC, 0 replies.
- Hudson build is back to normal: maven-core-integration-testing » windows #429 - posted by Hudson <Hu...@sonatype.org> on 2009/09/05 01:10:44 UTC, 0 replies.
- Build failed in Hudson: Maven-2.0.x » 1.4,ubuntu #92 - posted by Hudson <Hu...@sonatype.org> on 2009/09/05 06:59:56 UTC, 0 replies.
- Build failed in Hudson: Maven-2.0.x » 1.4,windows #92 - posted by Hudson <Hu...@sonatype.org> on 2009/09/05 07:59:20 UTC, 0 replies.
- Hudson build is back to normal: Maven-2.2.x » 1.5,windows #47 - posted by Hudson <Hu...@sonatype.org> on 2009/09/05 08:11:05 UTC, 0 replies.
- Hudson build is back to normal: ant-tasks » 1.5,windows #42 - posted by Hudson <Hu...@sonatype.org> on 2009/09/05 08:35:26 UTC, 0 replies.
- Hudson build is back to normal: wagon » 1.5,windows #37 - posted by Hudson <Hu...@sonatype.org> on 2009/09/05 09:30:04 UTC, 0 replies.
- Hudson build is back to normal: Maven-2.2.x-bootstrap » 1.5,windows #71 - posted by Hudson <Hu...@sonatype.org> on 2009/09/05 09:56:12 UTC, 0 replies.
- Build failed in Hudson: Maven-2.2.x-bootstrap » 1.5,windows #72 - posted by Hudson <Hu...@sonatype.org> on 2009/09/06 05:03:20 UTC, 0 replies.
- Build failed in Hudson: Maven-2.0.x » 1.4,windows #93 - posted by Hudson <Hu...@sonatype.org> on 2009/09/06 05:03:21 UTC, 0 replies.
- Build failed in Hudson: Maven-2.2.x » 1.5,windows #48 - posted by Hudson <Hu...@sonatype.org> on 2009/09/06 05:03:23 UTC, 0 replies.
- Build failed in Hudson: maven-core-integration-testing » windows #431 - posted by Hudson <Hu...@sonatype.org> on 2009/09/06 05:03:26 UTC, 0 replies.
- Build failed in Hudson: Maven-2.0.x » 1.4,ubuntu #93 - posted by Hudson <Hu...@sonatype.org> on 2009/09/06 05:05:43 UTC, 0 replies.
- Build failed in Hudson: surefire » 1.5,windows #23 - posted by Hudson <Hu...@sonatype.org> on 2009/09/06 05:06:20 UTC, 0 replies.
- Build failed in Hudson: ant-tasks » 1.5,windows #43 - posted by Hudson <Hu...@sonatype.org> on 2009/09/06 06:01:53 UTC, 0 replies.
- Build failed in Hudson: maven-plugin-tools » 1.5,windows #33 - posted by Hudson <Hu...@sonatype.org> on 2009/09/06 06:01:57 UTC, 0 replies.
- Build failed in Hudson: maven-shared » 1.5,windows #139 - posted by Hudson <Hu...@sonatype.org> on 2009/09/06 06:01:58 UTC, 0 replies.
- Build failed in Hudson: wagon » 1.5,windows #38 - posted by Hudson <Hu...@sonatype.org> on 2009/09/06 06:04:25 UTC, 0 replies.
- Build failed in Hudson: Maven-2.0.x-bootstrap » 1.4,windows #117 - posted by Hudson <Hu...@sonatype.org> on 2009/09/06 08:03:26 UTC, 0 replies.
- Build failed in Hudson: Maven-Assembly-Plugin-with-ITs » 1.5,windows #41 - posted by Hudson <Hu...@sonatype.org> on 2009/09/06 08:03:50 UTC, 0 replies.
- Build failed in Hudson: Maven-2.0.x-bootstrap » 1.4,ubuntu #117 - posted by Hudson <Hu...@sonatype.org> on 2009/09/06 08:11:11 UTC, 0 replies.
- Build failed in Hudson: Maven-Assembly-Plugin-with-ITs » 1.5,ubuntu #41 - posted by Hudson <Hu...@sonatype.org> on 2009/09/06 08:53:00 UTC, 0 replies.
- Hudson build is back to normal: ant-tasks » 1.5,windows #44 - posted by Hudson <Hu...@sonatype.org> on 2009/09/06 14:08:33 UTC, 0 replies.
- Hudson build is back to normal: maven-core-integration-testing » windows #432 - posted by Hudson <Hu...@sonatype.org> on 2009/09/06 14:28:40 UTC, 0 replies.
- Hudson build is back to normal: wagon » 1.5,windows #39 - posted by Hudson <Hu...@sonatype.org> on 2009/09/06 14:29:00 UTC, 0 replies.
- Hudson build is back to normal: surefire » 1.5,windows #24 - posted by Hudson <Hu...@sonatype.org> on 2009/09/06 14:55:25 UTC, 0 replies.
- Hudson build is back to normal: maven-plugin-tools » 1.5,windows #35 - posted by Hudson <Hu...@sonatype.org> on 2009/09/06 18:19:40 UTC, 0 replies.
- Hudson build is back to normal: maven-shared » 1.5,windows #141 - posted by Hudson <Hu...@sonatype.org> on 2009/09/06 19:09:28 UTC, 0 replies.
- Build failed in Hudson: Maven-2.2.x-bootstrap » 1.5,windows #73 - posted by Hudson <Hu...@sonatype.org> on 2009/09/07 05:03:20 UTC, 0 replies.
- Build failed in Hudson: Maven-2.0.x » 1.4,windows #94 - posted by Hudson <Hu...@sonatype.org> on 2009/09/07 05:03:32 UTC, 0 replies.
- Build failed in Hudson: Maven-2.2.x » 1.5,windows #49 - posted by Hudson <Hu...@sonatype.org> on 2009/09/07 05:03:44 UTC, 0 replies.
- Build failed in Hudson: maven-core-integration-testing » windows #433 - posted by Hudson <Hu...@sonatype.org> on 2009/09/07 05:04:36 UTC, 0 replies.
- Build failed in Hudson: Maven-2.0.x » 1.4,ubuntu #94 - posted by Hudson <Hu...@sonatype.org> on 2009/09/07 05:04:57 UTC, 0 replies.
- Build failed in Hudson: surefire » 1.5,windows #25 - posted by Hudson <Hu...@sonatype.org> on 2009/09/07 05:06:41 UTC, 0 replies.
- Build failed in Hudson: Maven-2.0.x-bootstrap » 1.4,ubuntu #118 - posted by Hudson <Hu...@sonatype.org> on 2009/09/07 08:14:24 UTC, 0 replies.
- Build failed in Hudson: Maven-Assembly-Plugin-with-ITs » 1.5,ubuntu #42 - posted by Hudson <Hu...@sonatype.org> on 2009/09/07 08:36:27 UTC, 0 replies.
- Build failed in Hudson: Maven-2.0.x-bootstrap » 1.4,windows #118 - posted by Hudson <Hu...@sonatype.org> on 2009/09/07 09:15:48 UTC, 0 replies.
- Build failed in Hudson: Maven-Assembly-Plugin-with-ITs » 1.5,windows #42 - posted by Hudson <Hu...@sonatype.org> on 2009/09/07 10:21:05 UTC, 0 replies.
- Hudson build is back to normal: maven-core-integration-testing » windows #434 - posted by Hudson <Hu...@sonatype.org> on 2009/09/07 19:27:15 UTC, 0 replies.
- Hudson build is back to normal: surefire » 1.5,windows #26 - posted by Hudson <Hu...@sonatype.org> on 2009/09/07 22:59:23 UTC, 0 replies.
- Hudson build is back to normal: Maven-2.2.x » 1.5,windows #50 - posted by Hudson <Hu...@sonatype.org> on 2009/09/07 23:58:09 UTC, 0 replies.
- [continuum] BUILD FAILURE: Maven 2.0.x Branch - Integration Test Executor - default maven2 buildDefinition - posted by "Continuum@vmbuild.apache.org" <co...@apache.org> on 2009/09/08 00:39:00 UTC, 0 replies.
- Build failed in Hudson: Maven-2.0.x » 1.4,ubuntu #95 - posted by Hudson <Hu...@sonatype.org> on 2009/09/08 05:08:46 UTC, 0 replies.
- Build failed in Hudson: Maven-2.0.x » 1.4,windows #95 - posted by Hudson <Hu...@sonatype.org> on 2009/09/08 05:12:52 UTC, 0 replies.
- Hudson build is back to normal: Maven-2.2.x-bootstrap » 1.5,windows #74 - posted by Hudson <Hu...@sonatype.org> on 2009/09/08 06:14:33 UTC, 0 replies.
- Build failed in Hudson: wagon » 1.5,windows #41 - posted by Hudson <Hu...@sonatype.org> on 2009/09/08 06:17:52 UTC, 0 replies.
- Build failed in Hudson: Maven-2.0.x-bootstrap » 1.4,windows #119 - posted by Hudson <Hu...@sonatype.org> on 2009/09/08 08:07:26 UTC, 0 replies.
- Build failed in Hudson: Maven-2.0.x-bootstrap » 1.4,ubuntu #119 - posted by Hudson <Hu...@sonatype.org> on 2009/09/08 08:18:03 UTC, 0 replies.
- Build failed in Hudson: Maven-Assembly-Plugin-with-ITs » 1.5,ubuntu #43 - posted by Hudson <Hu...@sonatype.org> on 2009/09/08 08:42:26 UTC, 0 replies.
- Build failed in Hudson: Maven-Assembly-Plugin-with-ITs » 1.5,windows #43 - posted by Hudson <Hu...@sonatype.org> on 2009/09/08 09:08:16 UTC, 0 replies.
- Hudson build is back to normal: wagon » 1.5,windows #42 - posted by Hudson <Hu...@sonatype.org> on 2009/09/08 10:45:54 UTC, 0 replies.
- [continuum] BUILD SUCCESSFUL: Maven 2.0.x Branch - Integration Test Executor - default maven2 buildDefinition - posted by "Continuum@vmbuild.apache.org" <co...@apache.org> on 2009/09/08 13:58:00 UTC, 4 replies.
- Hudson build is back to normal: Maven-2.0.x » 1.4,windows #96 - posted by Hudson <Hu...@sonatype.org> on 2009/09/08 18:45:52 UTC, 0 replies.
- Hudson build is back to normal: Maven-2.0.x » 1.4,ubuntu #96 - posted by Hudson <Hu...@sonatype.org> on 2009/09/08 18:46:27 UTC, 0 replies.
- Hudson build is back to normal: Maven-2.0.x-bootstrap » 1.4,ubuntu #120 - posted by Hudson <Hu...@sonatype.org> on 2009/09/08 19:21:28 UTC, 0 replies.
- Hudson build is back to normal: Maven-2.0.x-bootstrap » 1.4,windows #120 - posted by Hudson <Hu...@sonatype.org> on 2009/09/08 20:02:50 UTC, 0 replies.
- Build failed in Hudson: ant-tasks » 1.5,windows #47 - posted by Hudson <Hu...@sonatype.org> on 2009/09/09 06:29:34 UTC, 0 replies.
- Build failed in Hudson: maven-plugin-tools » 1.5,windows #38 - posted by Hudson <Hu...@sonatype.org> on 2009/09/09 06:29:38 UTC, 0 replies.
- Build failed in Hudson: maven-shared » 1.5,windows #144 - posted by Hudson <Hu...@sonatype.org> on 2009/09/09 06:29:39 UTC, 0 replies.
- Build failed in Hudson: wagon » 1.5,windows #43 - posted by Hudson <Hu...@sonatype.org> on 2009/09/09 06:30:10 UTC, 0 replies.
- Build failed in Hudson: Maven-2.0.x-bootstrap » 1.4,windows #121 - posted by Hudson <Hu...@sonatype.org> on 2009/09/09 08:02:42 UTC, 0 replies.
- Build failed in Hudson: Maven-Assembly-Plugin-with-ITs » 1.5,windows #44 - posted by Hudson <Hu...@sonatype.org> on 2009/09/09 08:02:42 UTC, 0 replies.
- Build failed in Hudson: Maven-Assembly-Plugin-with-ITs » 1.5,ubuntu #44 - posted by Hudson <Hu...@sonatype.org> on 2009/09/09 08:44:32 UTC, 0 replies.
- Hudson build is back to normal: ant-tasks » 1.5,windows #48 - posted by Hudson <Hu...@sonatype.org> on 2009/09/09 09:23:16 UTC, 0 replies.
- Hudson build is back to normal: maven-plugin-tools » 1.5,windows #39 - posted by Hudson <Hu...@sonatype.org> on 2009/09/09 09:40:02 UTC, 0 replies.
- Hudson build is back to normal: maven-shared » 1.5,windows #145 - posted by Hudson <Hu...@sonatype.org> on 2009/09/09 09:41:56 UTC, 0 replies.
- Hudson build is back to normal: wagon » 1.5,windows #44 - posted by Hudson <Hu...@sonatype.org> on 2009/09/09 09:47:58 UTC, 0 replies.
- Hudson build is back to normal: Maven-2.0.x-bootstrap » 1.4,windows #122 - posted by Hudson <Hu...@sonatype.org> on 2009/09/09 15:09:19 UTC, 0 replies.
- Build failed in Hudson: Maven-2.2.x » 1.5,windows #53 - posted by Hudson <Hu...@sonatype.org> on 2009/09/10 05:02:40 UTC, 0 replies.
- Build failed in Hudson: Maven-2.0.x » 1.4,windows #98 - posted by Hudson <Hu...@sonatype.org> on 2009/09/10 05:02:49 UTC, 0 replies.
- Build failed in Hudson: surefire » 1.5,windows #29 - posted by Hudson <Hu...@sonatype.org> on 2009/09/10 05:03:12 UTC, 0 replies.
- Build failed in Hudson: Maven-2.2.x-bootstrap » 1.5,windows #76 - posted by Hudson <Hu...@sonatype.org> on 2009/09/10 05:04:24 UTC, 0 replies.
- Build failed in Hudson: maven-plugin-tools » 1.5,windows #40 - posted by Hudson <Hu...@sonatype.org> on 2009/09/10 06:01:05 UTC, 0 replies.
- Build failed in Hudson: maven-shared » 1.5,windows #146 - posted by Hudson <Hu...@sonatype.org> on 2009/09/10 06:01:11 UTC, 0 replies.
- Build failed in Hudson: wagon » 1.5,windows #45 - posted by Hudson <Hu...@sonatype.org> on 2009/09/10 06:03:00 UTC, 0 replies.
- Build failed in Hudson: Maven-2.0.x-bootstrap » 1.4,windows #123 - posted by Hudson <Hu...@sonatype.org> on 2009/09/10 08:02:21 UTC, 0 replies.
- Build failed in Hudson: Maven-Assembly-Plugin-with-ITs » 1.5,windows #45 - posted by Hudson <Hu...@sonatype.org> on 2009/09/10 08:02:22 UTC, 0 replies.
- Build failed in Hudson: Maven-Assembly-Plugin-with-ITs » 1.5,ubuntu #45 - posted by Hudson <Hu...@sonatype.org> on 2009/09/10 08:38:34 UTC, 0 replies.
- Build failed in Hudson: ant-tasks » 1.5,windows #49 - posted by Hudson <Hu...@sonatype.org> on 2009/09/10 09:27:55 UTC, 0 replies.
- Hudson build is back to normal: Maven-2.2.x-bootstrap » 1.5,windows #77 - posted by Hudson <Hu...@sonatype.org> on 2009/09/10 12:48:15 UTC, 0 replies.
- Hudson build is back to normal: Maven-2.2.x » 1.5,windows #54 - posted by Hudson <Hu...@sonatype.org> on 2009/09/10 15:22:12 UTC, 0 replies.
- Hudson build is back to normal: ant-tasks » 1.5,windows #50 - posted by Hudson <Hu...@sonatype.org> on 2009/09/10 17:48:08 UTC, 0 replies.
- Build failed in Hudson: Maven-2.2.x-bootstrap » 1.5,windows #79 - posted by Hudson <Hu...@sonatype.org> on 2009/09/10 19:36:10 UTC, 0 replies.
- Hudson build is back to normal: surefire » 1.5,windows #30 - posted by Hudson <Hu...@sonatype.org> on 2009/09/11 00:25:04 UTC, 0 replies.
- Build failed in Hudson: Maven-2.2.x-bootstrap » 1.5,windows #80 - posted by Hudson <Hu...@sonatype.org> on 2009/09/11 01:50:01 UTC, 0 replies.
- Build failed in Hudson: Maven-2.2.x-bootstrap » 1.5,ubuntu #81 - posted by Hudson <Hu...@sonatype.org> on 2009/09/11 03:35:18 UTC, 0 replies.
- Build failed in Hudson: Maven-2.2.x-bootstrap » 1.5,windows #81 - posted by Hudson <Hu...@sonatype.org> on 2009/09/11 03:53:56 UTC, 0 replies.
- Build failed in Hudson: maven-shared » 1.5,windows #147 - posted by Hudson <Hu...@sonatype.org> on 2009/09/11 08:31:35 UTC, 0 replies.
- Hudson build is back to normal: maven-plugin-tools » 1.5,windows #41 - posted by Hudson <Hu...@sonatype.org> on 2009/09/11 09:30:35 UTC, 0 replies.
- Hudson build is back to normal: maven-shared » 1.5,windows #148 - posted by Hudson <Hu...@sonatype.org> on 2009/09/11 09:33:32 UTC, 0 replies.
- Hudson build is back to normal: wagon » 1.5,windows #46 - posted by Hudson <Hu...@sonatype.org> on 2009/09/11 09:37:30 UTC, 0 replies.
- Hudson build is back to normal: Maven-2.0.x » 1.4,windows #99 - posted by Hudson <Hu...@sonatype.org> on 2009/09/11 10:47:49 UTC, 0 replies.
- Build failed in Hudson: Maven-2.2.x-bootstrap » 1.5,ubuntu #82 - posted by Hudson <Hu...@sonatype.org> on 2009/09/11 11:38:12 UTC, 0 replies.
- Build failed in Hudson: Maven-2.2.x-bootstrap » 1.5,windows #82 - posted by Hudson <Hu...@sonatype.org> on 2009/09/11 12:07:44 UTC, 0 replies.
- Build failed in Hudson: Maven-2.2.x-bootstrap » 1.5,ubuntu #83 - posted by Hudson <Hu...@sonatype.org> on 2009/09/11 15:33:17 UTC, 0 replies.
- Build failed in Hudson: Maven-2.2.x-bootstrap » 1.5,windows #83 - posted by Hudson <Hu...@sonatype.org> on 2009/09/11 16:01:34 UTC, 0 replies.
- Build failed in Hudson: Maven-2.2.x-bootstrap » 1.5,ubuntu #84 - posted by Hudson <Hu...@sonatype.org> on 2009/09/11 16:08:55 UTC, 0 replies.
- Hudson build is back to normal: Maven-2.2.x-bootstrap » 1.5,ubuntu #85 - posted by Hudson <Hu...@sonatype.org> on 2009/09/11 16:35:25 UTC, 0 replies.
- Hudson build is back to normal: Maven-2.2.x-bootstrap » 1.5,windows #85 - posted by Hudson <Hu...@sonatype.org> on 2009/09/11 17:04:27 UTC, 0 replies.
- Hudson build is back to normal: Maven-2.0.x-bootstrap » 1.4,windows #124 - posted by Hudson <Hu...@sonatype.org> on 2009/09/12 10:13:53 UTC, 0 replies.
- Build failed in Hudson: maven-shared » 1.5,windows #149 - posted by Hudson <Hu...@sonatype.org> on 2009/09/13 08:30:47 UTC, 0 replies.
- Hudson build is back to normal: maven-shared » 1.5,windows #150 - posted by Hudson <Hu...@sonatype.org> on 2009/09/13 12:00:09 UTC, 0 replies.
- Build failed in Hudson: ant-tasks » 1.5,ubuntu #52 - posted by Hudson <Hu...@sonatype.org> on 2009/09/14 01:45:14 UTC, 0 replies.
- Build failed in Hudson: ant-tasks » 1.5,windows #52 - posted by Hudson <Hu...@sonatype.org> on 2009/09/14 01:45:15 UTC, 0 replies.
- Build failed in Hudson: ant-tasks » 1.5,ubuntu #53 - posted by Hudson <Hu...@sonatype.org> on 2009/09/14 01:46:50 UTC, 0 replies.
- Build failed in Hudson: ant-tasks » 1.5,windows #53 - posted by Hudson <Hu...@sonatype.org> on 2009/09/14 01:46:58 UTC, 0 replies.
- Hudson build is back to normal: ant-tasks » 1.5,ubuntu #54 - posted by Hudson <Hu...@sonatype.org> on 2009/09/14 01:49:45 UTC, 0 replies.
- Hudson build is back to normal: ant-tasks » 1.5,windows #54 - posted by Hudson <Hu...@sonatype.org> on 2009/09/14 01:49:54 UTC, 0 replies.
- Build failed in Hudson: Maven-2.2.x-bootstrap » 1.5,windows #86 - posted by Hudson <Hu...@sonatype.org> on 2009/09/14 11:28:52 UTC, 0 replies.
- [continuum] BUILD FAILURE: Maven Enforcer - Maven Enforcer Plugin - default maven2 buildDefinition - posted by "Continuum@vmbuild.apache.org" <co...@apache.org> on 2009/09/14 20:31:25 UTC, 1 replies.
- [continuum] BUILD ERROR: Maven Integration Testing - Maven Verifier Component - default maven2 buildDefinition - posted by "Continuum@vmbuild.apache.org" <co...@apache.org> on 2009/09/15 02:54:12 UTC, 3 replies.
- [continuum] BUILD FAILURE: Maven Integration Testing - Maven Verifier Component - default maven2 buildDefinition - posted by "Continuum@vmbuild.apache.org" <co...@apache.org> on 2009/09/15 04:48:18 UTC, 2 replies.
- [continuum] BUILD SUCCESSFUL: Maven Integration Testing - Maven Verifier Component - default maven2 buildDefinition - posted by "Continuum@vmbuild.apache.org" <co...@apache.org> on 2009/09/15 17:21:55 UTC, 0 replies.
- Build failed in Hudson: Maven-2.2.x-bootstrap » 1.5,windows #87 - posted by Hudson <Hu...@sonatype.org> on 2009/09/15 22:20:24 UTC, 0 replies.
- Build failed in Hudson: Maven-2.2.x-bootstrap » 1.5,windows #88 - posted by Hudson <Hu...@sonatype.org> on 2009/09/16 00:04:57 UTC, 0 replies.
- Hudson build is back to normal: Maven-2.2.x-bootstrap » 1.5,windows #89 - posted by Hudson <Hu...@sonatype.org> on 2009/09/16 10:42:59 UTC, 0 replies.
- Build failed in Hudson: Maven-Assembly-Plugin-with-ITs » 1.5,ubuntu #46 - posted by Hudson <Hu...@sonatype.org> on 2009/09/16 19:27:48 UTC, 0 replies.
- Build failed in Hudson: Maven-Assembly-Plugin-with-ITs » 1.5,windows #46 - posted by Hudson <Hu...@sonatype.org> on 2009/09/16 19:50:35 UTC, 0 replies.
- Build failed in Hudson: Maven-Assembly-Plugin-with-ITs » 1.5,ubuntu #47 - posted by Hudson <Hu...@sonatype.org> on 2009/09/17 01:23:50 UTC, 0 replies.
- Build failed in Hudson: Maven-Assembly-Plugin-with-ITs » 1.5,windows #47 - posted by Hudson <Hu...@sonatype.org> on 2009/09/17 01:43:24 UTC, 0 replies.
- Build failed in Hudson: maven-core-integration-testing » ubuntu #468 - posted by Hudson <Hu...@sonatype.org> on 2009/09/28 23:06:12 UTC, 0 replies.
- Hudson build is back to normal: maven-core-integration-testing » ubuntu #469 - posted by Hudson <Hu...@sonatype.org> on 2009/09/29 00:24:54 UTC, 0 replies.