You are viewing a plain text version of this content. The canonical link for it is here.
- [build-test alert] PASSED Linux x86_64: drlvm-test debug - posted by no...@intel.com on 2007/09/01 03:28:38 UTC, 5 replies.
- [build-test alert] PASSED Windows 2003 x86_64: jdktools-test debug - posted by no...@intel.com on 2007/09/01 10:31:00 UTC, 1 replies.
- [build-test alert] FAILED Linux x86: drlvm-test debug - posted by no...@intel.com on 2007/09/01 12:07:24 UTC, 8 replies.
- [build-test alert] FAILED Linux x86: ega . (Eclipse x 48h) - posted by no...@intel.com on 2007/09/01 17:28:14 UTC, 3 replies.
- [build-test alert] FAILED Linux x86_64: drlvm-test debug - posted by no...@intel.com on 2007/09/02 04:58:48 UTC, 3 replies.
- [build-test alert] PASSED Linux x86: drlvm-test debug - posted by no...@intel.com on 2007/09/02 08:42:15 UTC, 7 replies.
- [build-test alert] FAILED Windows 2003 x86: jdktools-test debug - posted by no...@intel.com on 2007/09/03 05:24:36 UTC, 1 replies.
- [build-test alert] PASSED Windows 2003 x86: tptp - posted by no...@intel.com on 2007/09/03 06:22:02 UTC, 2 replies.
- [build-test alert] PASSED Windows 2003 x86: jdktools-test debug - posted by no...@intel.com on 2007/09/03 09:40:06 UTC, 1 replies.
- [build-test alert] PASSED Linux x86: axis2_app - posted by no...@intel.com on 2007/09/03 09:55:23 UTC, 1 replies.
- [build-test alert] PASSED Linux x86: dacapo - posted by no...@intel.com on 2007/09/03 10:07:51 UTC, 1 replies.
- [build-test alert] FAILED Windows 2003 x86: drlvm-test debug - posted by no...@intel.com on 2007/09/03 21:18:52 UTC, 9 replies.
- [build-test alert] PASSED Windows 2003 x86: drlvm-test debug - posted by no...@intel.com on 2007/09/04 02:03:53 UTC, 8 replies.
- [build-test alert] PASSED Linux x86: scimark - posted by no...@intel.com on 2007/09/04 05:33:15 UTC, 0 replies.
- [build-test alert] FAILED Linux x86: ehwa-api debug - posted by no...@intel.com on 2007/09/04 12:28:11 UTC, 8 replies.
- [build-test alert] FAILED Windows 2003 x86: classlib-gui-test debug - posted by no...@intel.com on 2007/09/04 13:12:09 UTC, 3 replies.
- [build-test alert] PASSED Linux x86: ehwa-api debug - posted by no...@intel.com on 2007/09/04 13:13:06 UTC, 8 replies.
- [build-test alert] FAILED Linux ia64: classlib - posted by no...@intel.com on 2007/09/04 18:48:12 UTC, 1 replies.
- [build-test alert] PASSED Linux x86: drlvm-reg-test debug - posted by no...@intel.com on 2007/09/04 19:12:01 UTC, 2 replies.
- [build-test alert] PASSED Linux ia64: classlib - posted by no...@intel.com on 2007/09/04 19:46:21 UTC, 0 replies.
- [build-test alert] FAILED Windows 2003 x86: ega . (Eclipse x 48h) - posted by no...@intel.com on 2007/09/05 08:25:53 UTC, 0 replies.
- [build-test alert] PASSED Linux x86: jdktools-test debug - posted by no...@intel.com on 2007/09/05 09:56:23 UTC, 2 replies.
- [build-test alert] PASSED Linux x86_64: jdktools-test debug - posted by no...@intel.com on 2007/09/05 14:05:52 UTC, 4 replies.
- [build-test alert] FAILED Linux x86_64: jdktools-test debug - posted by no...@intel.com on 2007/09/05 19:22:33 UTC, 3 replies.
- [build-test alert] FAILED Windows 2003 x86_64: jdktools-test debug - posted by no...@intel.com on 2007/09/06 13:02:53 UTC, 0 replies.
- [build-test alert] FAILED Linux x86_64: drlvm-reg-test debug - posted by no...@intel.com on 2007/09/06 19:50:58 UTC, 0 replies.
- [build-test alert] FAILED Windows 2003 x86: drlvm-reg-test debug - posted by no...@intel.com on 2007/09/06 20:03:12 UTC, 2 replies.
- [build-test alert] FAILED Windows 2003 x86_64: drlvm-reg-test debug - posted by no...@intel.com on 2007/09/06 21:47:12 UTC, 1 replies.
- [build-test alert] FAILED Linux x86: drlvm-reg-test debug - posted by no...@intel.com on 2007/09/07 00:24:45 UTC, 1 replies.
- [build-test alert] FAILED Windows 2003 x86_64: hdk_by_hdk - posted by no...@intel.com on 2007/09/07 04:47:38 UTC, 0 replies.
- [build-test alert] PASSED Linux x86_64: classlib-test debug - posted by no...@intel.com on 2007/09/07 07:40:40 UTC, 2 replies.
- [build-test alert] PASSED Windows 2003 x86: classlib-test debug - posted by no...@intel.com on 2007/09/07 07:50:18 UTC, 1 replies.
- [build-test alert] PASSED Windows 2003 x86_64: classlib-test debug - posted by no...@intel.com on 2007/09/07 08:16:40 UTC, 2 replies.
- [build-test alert] BUILD FAILED Windows server 2003 x86_64: tomcat start - posted by no...@intel.com on 2007/09/07 11:13:21 UTC, 0 replies.
- [build-test alert] PASSED Windows 2003 x86: drlvm-reg-test debug - posted by no...@intel.com on 2007/09/07 13:13:16 UTC, 2 replies.
- [build-test alert] PASSED Linux x86_64: drlvm-reg-test debug - posted by no...@intel.com on 2007/09/07 13:34:42 UTC, 0 replies.
- [build-test alert] PASSED Windows 2003 x86_64: drlvm-reg-test debug - posted by no...@intel.com on 2007/09/07 15:30:50 UTC, 1 replies.
- [build-test alert] FAILED Linux x86: jdktools-test debug - posted by no...@intel.com on 2007/09/07 23:16:10 UTC, 2 replies.
- [build-test alert] FAILED Windows 2003 x86_64: drlvm-test debug - posted by no...@intel.com on 2007/09/08 02:23:43 UTC, 1 replies.
- [build-test alert] FAILED Linux x86: struts_test - posted by no...@intel.com on 2007/09/08 05:10:08 UTC, 1 replies.
- [build-test alert] FAILED Linux x86: tomcat-scenario - posted by no...@intel.com on 2007/09/08 05:15:16 UTC, 1 replies.
- [build-test alert] PASSED Windows 2003 x86_64: struts_test - posted by no...@intel.com on 2007/09/10 04:15:14 UTC, 0 replies.
- [build-test alert] PASSED Windows 2003 x86_64: classlib-test - posted by no...@intel.com on 2007/09/10 04:35:07 UTC, 0 replies.
- [build-test alert] PASSED Windows 2003 x86: classlib-test - posted by no...@intel.com on 2007/09/10 07:45:28 UTC, 0 replies.
- [build-test alert] FAILED Windows 2003 x86_64: hdk debug - posted by no...@intel.com on 2007/09/10 08:18:09 UTC, 0 replies.
- [build-test alert] PASSED Windows 2003 x86_64: hdk debug - posted by no...@intel.com on 2007/09/10 09:07:59 UTC, 0 replies.
- [build-test alert] FAILED Linux x86_64: classlib-test debug - posted by no...@intel.com on 2007/09/10 10:52:11 UTC, 1 replies.
- [build-test alert] FAILED Windows 2003 x86_64: classlib-test debug - posted by no...@intel.com on 2007/09/10 12:34:14 UTC, 2 replies.
- [build-test alert] FAILED Windows 2003 x86: classlib debug - posted by no...@intel.com on 2007/09/10 23:05:24 UTC, 0 replies.
- [build-test alert] FAILED Windows 2003 x86: hdk debug - posted by no...@intel.com on 2007/09/10 23:58:27 UTC, 0 replies.
- [build-test alert] PASSED Windows 2003 x86: classlib debug - posted by no...@intel.com on 2007/09/11 04:45:02 UTC, 0 replies.
- [build-test alert] PASSED Windows 2003 x86: hdk debug - posted by no...@intel.com on 2007/09/11 05:03:39 UTC, 0 replies.
- [build-test alert] FAILED Windows 2003 x86: struts_test - posted by no...@intel.com on 2007/09/11 05:47:44 UTC, 0 replies.
- [build-test alert] FAILED Windows 2003 x86_64: drlvm-test - posted by no...@intel.com on 2007/09/11 05:55:35 UTC, 0 replies.
- [build-test alert] FAILED Windows 2003 x86_64: drlvm-reg-test - posted by no...@intel.com on 2007/09/11 05:56:26 UTC, 0 replies.
- [build-test alert] FAILED Linux x86_64: drlvm-test - posted by no...@intel.com on 2007/09/11 07:08:47 UTC, 1 replies.
- [build-test alert] FAILED Linux x86_64: drlvm-reg-test - posted by no...@intel.com on 2007/09/11 07:10:21 UTC, 0 replies.
- [build-test alert] PASSED Windows 2003 x86_64: drlvm-test debug - posted by no...@intel.com on 2007/09/11 07:28:27 UTC, 1 replies.
- [build-test alert] FAILED Windows 2003 x86: drlvm-reg-test - posted by no...@intel.com on 2007/09/11 09:04:11 UTC, 1 replies.
- [build-test alert] FAILED Windows 2003 x86: drlvm-test - posted by no...@intel.com on 2007/09/11 09:04:57 UTC, 0 replies.
- [build-test alert] PASSED Linux x86: struts_test - posted by no...@intel.com on 2007/09/11 11:03:00 UTC, 1 replies.
- [build-test alert] PASSED Linux x86_64: struts_test - posted by no...@intel.com on 2007/09/11 11:08:38 UTC, 2 replies.
- [build-test alert] PASSED Windows 2003 x86: struts_test - posted by no...@intel.com on 2007/09/11 11:10:45 UTC, 0 replies.
- [build-test alert] FAILED Linux x86_64: struts_test - posted by no...@intel.com on 2007/09/11 13:13:59 UTC, 2 replies.
- [build-test alert] FAILED Linux x86_64: hdk_by_hdk - posted by no...@intel.com on 2007/09/11 16:36:21 UTC, 2 replies.
- [build-test alert] PASSED Windows 2003 x86: drlvm-reg-test - posted by no...@intel.com on 2007/09/11 17:39:59 UTC, 0 replies.
- [build-test alert] FAILED Linux x86: drlvm-test - posted by no...@intel.com on 2007/09/11 21:03:23 UTC, 1 replies.
- [build-test alert] PASSED Linux x86: drlvm-reg-test - posted by no...@intel.com on 2007/09/11 21:20:17 UTC, 0 replies.
- [build-test alert] FAILED Windows 2003 x86: classlib-test debug - posted by no...@intel.com on 2007/09/12 06:16:25 UTC, 1 replies.
- [build-test alert] PASSED Linux x86: tomcat-scenario - posted by no...@intel.com on 2007/09/12 06:43:23 UTC, 1 replies.
- [build-test alert] PASSED Linux x86_64: JettyScenario - posted by no...@intel.com on 2007/09/12 08:45:51 UTC, 3 replies.
- [build-test alert] PASSED Linux x86_64: classlib-test - posted by no...@intel.com on 2007/09/12 09:08:11 UTC, 1 replies.
- [build-test alert] PASSED Linux x86_64: drlvm-reg-test - posted by no...@intel.com on 2007/09/12 09:34:47 UTC, 0 replies.
- [build-test alert] PASSED Windows 2003 x86_64: drlvm-reg-test - posted by no...@intel.com on 2007/09/12 15:39:28 UTC, 0 replies.
- [build-test alert] PASSED Linux x86_64: hdk_by_hdk - posted by no...@intel.com on 2007/09/12 17:17:17 UTC, 1 replies.
- [build-test alert] PASSED Linux ia64: classlib debug - posted by no...@intel.com on 2007/09/13 08:37:03 UTC, 8 replies.
- [build-test alert] FAILED Linux ia64: classlib debug - posted by no...@intel.com on 2007/09/13 16:04:23 UTC, 7 replies.
- [build-test alert] FAILED Linux x86: axis2_app - posted by no...@intel.com on 2007/09/14 06:31:25 UTC, 0 replies.
- [build-test alert] PASSED Linux x86: classlib-test - posted by no...@intel.com on 2007/09/14 06:35:17 UTC, 0 replies.
- [build-test alert] FAILED Linux x86: dacapo - posted by no...@intel.com on 2007/09/14 06:35:24 UTC, 0 replies.
- [build-test alert] FAILED Linux x86: classlib-test - posted by no...@intel.com on 2007/09/14 08:54:41 UTC, 0 replies.
- [build-test alert] FAILED Windows 2003 x86: classlib-test - posted by no...@intel.com on 2007/09/14 08:56:27 UTC, 0 replies.
- [build-test alert] FAILED Linux x86_64: dacapo - posted by no...@intel.com on 2007/09/14 10:24:14 UTC, 0 replies.
- [build-test alert] FAILED Windows 2003 x86_64: jdktools-test - posted by no...@intel.com on 2007/09/14 11:11:41 UTC, 1 replies.
- [build-test alert] FAILED Linux x86_64: classlib-test - posted by no...@intel.com on 2007/09/14 11:51:46 UTC, 0 replies.
- [build-test alert] FAILED Linux x86_64: JettyScenario - posted by no...@intel.com on 2007/09/14 12:21:51 UTC, 2 replies.
- [build-test alert] FAILED Windows 2003 x86_64: classlib-test - posted by no...@intel.com on 2007/09/14 18:47:42 UTC, 1 replies.
- [build-test alert] FAILED Linux x86_64: tomcat-scenario - posted by no...@intel.com on 2007/09/14 19:38:30 UTC, 1 replies.
- [build-test alert] PASSED Linux x86_64: jdktools-test - posted by no...@intel.com on 2007/09/14 19:55:59 UTC, 1 replies.
- [build-test alert] PASSED Linux x86_64: tomcat-scenario - posted by no...@intel.com on 2007/09/16 18:11:36 UTC, 1 replies.
- [build-test alert] PASSED Windows 2003 x86_64: jdktools-test - posted by no...@intel.com on 2007/09/16 18:48:05 UTC, 1 replies.
- [build-test alert] FAILED Windows 2003 x86: tptp - posted by no...@intel.com on 2007/09/17 06:36:57 UTC, 1 replies.
- [build-test alert] FAILED Windows 2003 x86: dacapo - posted by no...@intel.com on 2007/09/17 07:40:46 UTC, 0 replies.
- [build-test alert] PASSED Linux x86: drlvm-test - posted by no...@intel.com on 2007/09/17 08:14:51 UTC, 1 replies.
- [build-test alert] PASSED Windows 2003 x86: classlib-gui-test debug - posted by no...@intel.com on 2007/09/18 11:07:49 UTC, 3 replies.
- [build-test alert] PASSED Windows 2003 x86: dacapo - posted by no...@intel.com on 2007/09/18 12:01:45 UTC, 0 replies.
- [build-test alert] PASSED Linux x86_64: drlvm-test - posted by no...@intel.com on 2007/09/18 13:21:41 UTC, 1 replies.
- [build-test alert] FAILED Linux x86_64: jdktools-test - posted by no...@intel.com on 2007/09/18 16:16:59 UTC, 1 replies.
- [build-test alert] PASSED Windows 2003 x86: vtsvm - posted by no...@intel.com on 2007/09/19 05:32:30 UTC, 0 replies.
- [build-test alert] PASSED Linux x86: tptp - posted by no...@intel.com on 2007/09/20 12:09:49 UTC, 0 replies.
- [build-test alert] FAILED Linux x86: tptp - posted by no...@intel.com on 2007/09/20 23:11:00 UTC, 0 replies.
- [build-test alert] PASSED Windows 2003 x86_64: hdk_by_hdk - posted by no...@intel.com on 2007/09/21 05:10:19 UTC, 0 replies.
- [build-test alert] PASSED Linux x86: ehwa - posted by no...@intel.com on 2007/09/23 18:26:49 UTC, 0 replies.
- [build-test alert] PASSED Linux x86: vtsvm - posted by no...@intel.com on 2007/09/24 00:56:59 UTC, 0 replies.
- [build-test alert] PASSED Windows 2003 x86_64: drlvm-test - posted by no...@intel.com on 2007/09/26 04:56:15 UTC, 0 replies.
- [build-test alert] FAILED Linux x86: vtsvm - posted by no...@intel.com on 2007/09/26 09:15:10 UTC, 0 replies.
- [build-test alert] PASSED Linux x86_64: dacapo - posted by no...@intel.com on 2007/09/26 12:35:17 UTC, 0 replies.
- [build-test alert] PASSED Linux x86_64: ehwa - posted by no...@intel.com on 2007/09/26 13:04:00 UTC, 0 replies.
- [build-test alert] PASSED Windows 2003 x86: drlvm-test - posted by no...@intel.com on 2007/09/26 16:42:02 UTC, 0 replies.
- [build-test alert] PASSED Linux x86: ega (Eclipse x 48h) - posted by no...@intel.com on 2007/09/28 00:03:06 UTC, 0 replies.
- [build-test alert] FAILED Windows 2003 x86: func - posted by no...@intel.com on 2007/09/28 15:51:50 UTC, 0 replies.