You are viewing a plain text version of this content. The canonical link for it is here.
- [build-test alert] BUILD FAILED Windows 2003 x86: stress - posted by no...@intel.com on 2007/08/01 01:00:32 UTC, 2 replies.
- [build-test alert] BUILD PASSED Windows 2003 x86: struts_test - posted by no...@intel.com on 2007/08/01 01:03:59 UTC, 2 replies.
- [build-test alert] BUILD PASSED Windows 2003 x86: tomcat-scenario - posted by no...@intel.com on 2007/08/01 01:04:15 UTC, 2 replies.
- [build-test alert] BUILD PASSED Windows 2003 x86: tptp - posted by no...@intel.com on 2007/08/01 01:27:08 UTC, 2 replies.
- [build-test alert] BUILD FAILED Windows 2003 x86: vtsvm - posted by no...@intel.com on 2007/08/01 01:51:24 UTC, 2 replies.
- [build-test alert] BUILD SUCCEEDED Linux SUSE 9 gcc debug: drlvm test - posted by no...@intel.com on 2007/08/01 03:46:17 UTC, 9 replies.
- [build-test alert] BUILD FAILED Linux x86: jedit_test - posted by no...@intel.com on 2007/08/01 06:20:12 UTC, 1 replies.
- [build-test alert] BUILD FAILED Linux x86: vtsvm - posted by no...@intel.com on 2007/08/01 07:16:35 UTC, 1 replies.
- [build-test alert] BUILD PASSED Linux x86: axis2_app - posted by no...@intel.com on 2007/08/01 07:21:12 UTC, 1 replies.
- [build-test alert] BUILD PASSED Linux x86_64: scimark - posted by no...@intel.com on 2007/08/01 10:33:25 UTC, 0 replies.
- [build-test alert] BUILD PASSED Windows 2003 x86_64: dacapo - posted by no...@intel.com on 2007/08/01 10:40:18 UTC, 0 replies.
- [build-test alert] BUILD PASSED Windows 2003 x86_64: scimark - posted by no...@intel.com on 2007/08/01 10:41:05 UTC, 0 replies.
- [build-test alert] BUILD PASSED Linux x86: snapshot - posted by no...@intel.com on 2007/08/01 10:45:31 UTC, 4 replies.
- [build-test alert] BUILD FAILED Linux x86: ega. (Eclipse x 48h) - posted by no...@intel.com on 2007/08/01 10:46:10 UTC, 5 replies.
- [build-test alert] BUILD FAILED Linux x86: reliability - posted by no...@intel.com on 2007/08/01 11:13:55 UTC, 4 replies.
- [build-test alert] BUILD FAILED Linux x86_64: ehwa-api - posted by no...@intel.com on 2007/08/01 11:40:53 UTC, 0 replies.
- [build-test alert] BUILD PASSED Windows 2003 x86: axis2_app - posted by no...@intel.com on 2007/08/01 11:53:01 UTC, 1 replies.
- [build-test alert] BUILD FAILED Linux x86: classlib-test - posted by no...@intel.com on 2007/08/01 12:13:28 UTC, 1 replies.
- [build-test alert] BUILD PASSED Linux x86_64: ehwa-api - posted by no...@intel.com on 2007/08/01 13:50:57 UTC, 0 replies.
- [build-test alert] BUILD FAILED Linux x86: eut - posted by no...@intel.com on 2007/08/01 14:58:10 UTC, 1 replies.
- [build-test alert] BUILD FAILED Linux SUSE 9 gcc debug: drlvm test - posted by no...@intel.com on 2007/08/01 16:00:30 UTC, 8 replies.
- [build-test alert] BUILD FAILED Linux x86_64: dacapo - posted by no...@intel.com on 2007/08/01 16:40:12 UTC, 0 replies.
- [build-test alert] BUILD PASSED Windows 2003 x86: JettyScenario - posted by no...@intel.com on 2007/08/01 16:45:41 UTC, 0 replies.
- [build-test alert] BUILD FAILED Linux x86: func - posted by no...@intel.com on 2007/08/01 18:24:30 UTC, 1 replies.
- [build-test alert] BUILD FAILED Linux x86: gut - posted by no...@intel.com on 2007/08/01 18:26:16 UTC, 1 replies.
- [build-test alert] BUILD FAILED Linux x86: classlib - posted by no...@intel.com on 2007/08/01 18:29:09 UTC, 1 replies.
- [build-test alert] BUILD FAILED Linux x86_64: classlib - posted by no...@intel.com on 2007/08/01 18:29:10 UTC, 1 replies.
- [build-test alert] BUILD FAILED Linux SUSE 9 64bit gcc debug: drlvm tests - posted by no...@intel.com on 2007/08/01 18:30:07 UTC, 1 replies.
- [build-test alert] BUILD FAILED Windows 2003 x86_64: classlib - posted by no...@intel.com on 2007/08/01 18:34:40 UTC, 0 replies.
- [build-test alert] BUILD PASSED Windows 2003 x86_64: classlib - posted by no...@intel.com on 2007/08/01 18:48:10 UTC, 0 replies.
- [build-test alert] BUILD PASSED Linux x86_64: classlib - posted by no...@intel.com on 2007/08/01 18:57:09 UTC, 1 replies.
- [build-test alert] BUILD PASSED Linux x86: classlib - posted by no...@intel.com on 2007/08/01 19:03:37 UTC, 1 replies.
- [build-test alert] BUILD FAILED Windows 2003 x86: eut - posted by no...@intel.com on 2007/08/01 20:04:54 UTC, 0 replies.
- [build-test alert] BUILD FAILED Linux x86: JettyScenario - posted by no...@intel.com on 2007/08/01 20:09:12 UTC, 1 replies.
- [build-test alert] BUILD FAILED Windows 2003 x86: func - posted by no...@intel.com on 2007/08/01 21:15:31 UTC, 0 replies.
- [build-test alert] BUILD FAILED Linux x86: drlvm-test - posted by no...@intel.com on 2007/08/01 21:21:49 UTC, 2 replies.
- [build-test alert] BUILD FAILED Windows 2003 x86: jedit_test - posted by no...@intel.com on 2007/08/01 21:23:43 UTC, 0 replies.
- [build-test alert] BUILD SUCCEEDED Linux SUSE 9 64bit gcc debug: drlvm tests - posted by no...@intel.com on 2007/08/01 21:29:18 UTC, 1 replies.
- [build-test alert] BUILD FAILED Linux x86: stress - posted by no...@intel.com on 2007/08/01 21:56:19 UTC, 1 replies.
- [build-test alert] BUILD PASSED Linux x86: struts_test - posted by no...@intel.com on 2007/08/01 22:02:05 UTC, 1 replies.
- [build-test alert] BUILD PASSED Linux x86: tomcat-scenario - posted by no...@intel.com on 2007/08/01 22:02:36 UTC, 1 replies.
- [build-test alert] BUILD FAILED Linux x86: tptp - posted by no...@intel.com on 2007/08/01 22:31:13 UTC, 1 replies.
- [build-test alert] BUILD PASSED Linux x86: drlvm-test - posted by no...@intel.com on 2007/08/02 03:02:17 UTC, 2 replies.
- [build-test alert] BUILD PASSED Windows 2003 x86: jdktools-testdebug - posted by no...@intel.com on 2007/08/02 03:20:52 UTC, 0 replies.
- [build-test alert] BUILD FAILED Linux x86: ehwa-api - posted by no...@intel.com on 2007/08/02 12:59:00 UTC, 1 replies.
- [build-test alert] BUILD PASSED Linux x86: ehwa-api - posted by no...@intel.com on 2007/08/02 13:38:08 UTC, 1 replies.
- [build-test alert] PASSED Linux x86_64: dacapo - posted by no...@intel.com on 2007/08/02 13:56:46 UTC, 0 replies.
- [build-test alert] PASSED Linux x86_64: scimark - posted by no...@intel.com on 2007/08/02 13:57:24 UTC, 2 replies.
- [build-test alert] BUILD PASSED Linux x86: classlib-test - posted by no...@intel.com on 2007/08/02 14:23:23 UTC, 0 replies.
- [build-test alert] FAILED Linux x86: gut - posted by no...@intel.com on 2007/08/03 11:27:00 UTC, 1 replies.
- [build-test alert] PASSED Windows 2003 x86: drlvm-test debug - posted by no...@intel.com on 2007/08/03 15:58:44 UTC, 10 replies.
- [build-test alert] BUILD PASSED Windows 2003 x86_64: drlvm-test - posted by no...@intel.com on 2007/08/04 01:11:53 UTC, 3 replies.
- [build-test alert] BUILD FAILED Windows 2000 x86: drlvm-test - posted by nb...@kc.rr.com on 2007/08/04 02:59:29 UTC, 0 replies.
- [build-test alert] FAILED Windows 2003 x86: drlvm-test debug - posted by no...@intel.com on 2007/08/06 09:16:03 UTC, 9 replies.
- [build-test alert] BUILD FAILED Linux x86: drlvm-reg-test - posted by no...@intel.com on 2007/08/06 09:35:52 UTC, 0 replies.
- [build-test alert] BUILD FAILED Windows 2003 x86_64: drlvm-reg-test - posted by no...@intel.com on 2007/08/06 10:15:09 UTC, 1 replies.
- [build-test alert] BUILD FAILED Linux SUSE 9 gcc debug: drlvm reg.test - posted by no...@intel.com on 2007/08/06 14:06:53 UTC, 2 replies.
- [build-test alert] PASSED Windows 2003 x86: struts_test - posted by no...@intel.com on 2007/08/06 14:26:56 UTC, 0 replies.
- [build-test alert] PASSED Windows 2003 x86: JettyScenario - posted by no...@intel.com on 2007/08/06 14:27:18 UTC, 0 replies.
- [build-test alert] PASSED Windows 2003 x86: tomcat-scenario - posted by no...@intel.com on 2007/08/06 14:27:28 UTC, 1 replies.
- [build-test alert] PASSED Windows 2003 x86: tptp - posted by no...@intel.com on 2007/08/06 14:41:49 UTC, 2 replies.
- [build-test alert] PASSED Windows 2003 x86: vtsvm - posted by no...@intel.com on 2007/08/06 14:59:23 UTC, 0 replies.
- [build-test alert] PASSED Linux x86: axis2_app - posted by no...@intel.com on 2007/08/06 15:25:22 UTC, 0 replies.
- [build-test alert] PASSED Windows 2003 x86: axis2_app - posted by no...@intel.com on 2007/08/06 15:53:20 UTC, 0 replies.
- [build-test alert] BUILD FAILED Linux x86_64: drlvm-reg-test - posted by no...@intel.com on 2007/08/06 17:07:18 UTC, 0 replies.
- [build-test alert] FAILED Linux x86: eut - posted by no...@intel.com on 2007/08/06 19:10:13 UTC, 1 replies.
- [build-test alert] FAILED Windows 2003 x86: func - posted by no...@intel.com on 2007/08/06 21:16:06 UTC, 1 replies.
- [build-test alert] FAILED Windows 2003 x86: gut - posted by no...@intel.com on 2007/08/06 21:21:00 UTC, 1 replies.
- [build-test alert] FAILED Windows 2003 x86: stress - posted by no...@intel.com on 2007/08/06 21:41:28 UTC, 1 replies.
- [build-test alert] FAILED Linux x86: func - posted by no...@intel.com on 2007/08/07 00:32:44 UTC, 1 replies.
- [build-test alert] FAILED Linux x86: jedit_test - posted by no...@intel.com on 2007/08/07 00:34:01 UTC, 0 replies.
- [build-test alert] FAILED Linux x86: stress - posted by no...@intel.com on 2007/08/07 03:29:38 UTC, 1 replies.
- [build-test alert] PASSED Linux x86: struts_test - posted by no...@intel.com on 2007/08/07 03:36:35 UTC, 1 replies.
- [build-test alert] PASSED Linux x86: tomcat-scenario - posted by no...@intel.com on 2007/08/07 04:16:56 UTC, 2 replies.
- [build-test alert] BUILD FAILED Linux x86_64: jdktools-test - posted by no...@intel.com on 2007/08/07 05:01:58 UTC, 0 replies.
- [build-test alert] FAILED Linux x86: vtsvm - posted by no...@intel.com on 2007/08/07 05:28:19 UTC, 1 replies.
- [build-test alert] FAILED Linux x86: JettyScenario - posted by no...@intel.com on 2007/08/07 05:32:04 UTC, 2 replies.
- [build-test alert] PASSED Windows 2003 x86: eut33 - posted by no...@intel.com on 2007/08/07 15:07:10 UTC, 0 replies.
- [build-test alert] FAILED Windows 2003 x86: eut - posted by no...@intel.com on 2007/08/07 19:24:22 UTC, 1 replies.
- [build-test alert] FAILED Windows 2003 x86: drlvm-reg-test debug - posted by no...@intel.com on 2007/08/08 04:12:02 UTC, 1 replies.
- [build-test alert] BUILD PASSED Linux x86: drlvm-reg-test - posted by no...@intel.com on 2007/08/08 10:10:33 UTC, 0 replies.
- [build-test alert] FAILED Windows 2003 x86: eut33 - posted by no...@intel.com on 2007/08/08 11:13:37 UTC, 1 replies.
- [build-test alert] BUILD PASSED Windows 2003 x86_64: drlvm-reg-test - posted by no...@intel.com on 2007/08/08 12:27:00 UTC, 2 replies.
- [build-test alert] PASSED Windows 2003 x86: drlvm-reg-test debug - posted by no...@intel.com on 2007/08/08 13:49:06 UTC, 1 replies.
- [build-test alert] BUILD SUCCEEDED Linux SUSE 9 gcc debug: drlvm reg.test - posted by no...@intel.com on 2007/08/08 18:30:51 UTC, 2 replies.
- [build-test alert] BUILD FAILED Linux x86: hdk - posted by no...@intel.com on 2007/08/08 21:29:57 UTC, 0 replies.
- [build-test alert] FAILED Windows 2003 x86: jdktools-test debug - posted by no...@intel.com on 2007/08/09 03:54:04 UTC, 3 replies.
- [build-test alert] PASSED Linux x86: hdk debug - posted by no...@intel.com on 2007/08/09 12:21:25 UTC, 3 replies.
- [build-test alert] PASSED Linux x86_64: drlvm-reg-test debug - posted by no...@intel.com on 2007/08/09 13:53:24 UTC, 3 replies.
- [build-test alert] PASSED Windows 2003 x86: jdktools-test debug - posted by no...@intel.com on 2007/08/09 18:03:56 UTC, 2 replies.
- [build-test alert] PASSED Windows 2003 x86: dacapo - posted by no...@intel.com on 2007/08/10 13:16:29 UTC, 0 replies.
- [build-test alert] FAILED Windows 2003 x86: scimark - posted by no...@intel.com on 2007/08/10 13:16:56 UTC, 3 replies.
- [build-test alert] PASSED Windows 2003 x86: scimark - posted by no...@intel.com on 2007/08/10 13:31:09 UTC, 0 replies.
- [build-test alert] FAILED Windows 2003 x86_64: dacapo - posted by no...@intel.com on 2007/08/10 16:25:26 UTC, 0 replies.
- [build-test alert] FAILED Linux x86: drlvm-test debug - posted by no...@intel.com on 2007/08/10 20:44:49 UTC, 2 replies.
- [build-test alert] FAILED Windows 2003 x86: classlib-gui-test debug - posted by no...@intel.com on 2007/08/11 01:20:08 UTC, 2 replies.
- [build-test alert] PASSED Linux x86: drlvm-test debug - posted by no...@intel.com on 2007/08/12 14:02:48 UTC, 2 replies.
- [build-test alert] PASSED Windows 2003 x86: classlib-gui-test debug - posted by no...@intel.com on 2007/08/12 19:00:09 UTC, 2 replies.
- [build-test alert] FAILED Windows 2003 x86: vtsvm - posted by no...@intel.com on 2007/08/13 07:47:45 UTC, 1 replies.
- [build-test alert] FAILED Linux x86: drlvm-reg-test debug - posted by no...@intel.com on 2007/08/13 09:33:21 UTC, 2 replies.
- [build-test alert] FAILED Linux x86_64: drlvm-reg-test debug - posted by no...@intel.com on 2007/08/13 10:12:50 UTC, 2 replies.
- [build-test alert] PASSED Linux x86: drlvm-reg-test debug - posted by no...@intel.com on 2007/08/13 18:01:58 UTC, 1 replies.
- [build-test alert] PASSED Linux x86_64: jdktools-test debug - posted by no...@intel.com on 2007/08/14 06:37:20 UTC, 1 replies.
- [build-test alert] PASSED Linux x86: JettyScenario - posted by no...@intel.com on 2007/08/14 06:59:58 UTC, 2 replies.
- [build-test alert] BUILD FAILED Windows 2003 x86_64: hdk - posted by no...@intel.com on 2007/08/14 12:01:55 UTC, 0 replies.
- [build-test alert] BUILD FAILED Windows 2003 x86_64 msvc debug: drlvm regression tests - posted by no...@intel.com on 2007/08/14 14:47:14 UTC, 0 replies.
- [build-test alert] BUILD FAILED Windows XP ia32 msvc debug: classlib - posted by no...@intel.com on 2007/08/14 14:56:41 UTC, 0 replies.
- [build-test alert] BUILD FAILED Windows XP ia32 msvc debug: drlvm - posted by no...@intel.com on 2007/08/14 15:05:26 UTC, 0 replies.
- [build-test alert] BUILD SUCCEEDED Windows 2003 x86_64 msvc debug: classlib - posted by no...@intel.com on 2007/08/14 15:09:21 UTC, 0 replies.
- [build-test alert] BUILD FAILED Windows 2003 x86_64 msvc debug: drlvm - posted by no...@intel.com on 2007/08/14 15:10:39 UTC, 0 replies.
- [build-test alert] BUILD SUCCEEDED Windows XP ia32 msvc debug: classlib - posted by no...@intel.com on 2007/08/14 15:22:29 UTC, 0 replies.
- [build-test alert] BUILD SUCCEEDED win msvc debug: classlib - posted by no...@intel.com on 2007/08/14 15:27:37 UTC, 1 replies.
- [build-test alert] BUILD SUCCEEDED Windows XP ia32 msvc debug: drlvm - posted by no...@intel.com on 2007/08/14 15:45:25 UTC, 0 replies.
- [build-test alert] BUILD SUCCEEDED Windows XP SP2 x86: harmony HDK - posted by no...@intel.com on 2007/08/14 15:50:51 UTC, 1 replies.
- [build-test alert] BUILD PASSED Windows 2003 x86_64: hdk - posted by no...@intel.com on 2007/08/15 05:51:51 UTC, 0 replies.
- [build-test alert] FAILED Linux x86: hdk debug - posted by no...@intel.com on 2007/08/15 06:22:32 UTC, 2 replies.
- [build-test alert] FAILED Windows 2003 x86: classlib-test debug - posted by no...@intel.com on 2007/08/15 06:48:43 UTC, 1 replies.
- [build-test alert] PASSED Linux x86_64: hdk debug - posted by no...@intel.com on 2007/08/15 08:47:04 UTC, 2 replies.
- [build-test alert] BUILD PASSED Windows 2003 x86_64: jdktools-test - posted by no...@intel.com on 2007/08/15 09:37:40 UTC, 0 replies.
- [build-test alert] BUILD FAILED Windows XP SP2 x86: harmony HDK - posted by no...@intel.com on 2007/08/15 23:16:56 UTC, 1 replies.
- [build-test alert] PASSED Windows 2003 x86_64: specjvm2007 - posted by no...@intel.com on 2007/08/16 16:33:28 UTC, 2 replies.
- [build-test alert] BUILD FAILED Windows 2003 x86_64: drlvm-test - posted by no...@intel.com on 2007/08/17 02:53:43 UTC, 1 replies.
- [build-test alert] FAILED Linux x86: dacapo - posted by no...@intel.com on 2007/08/17 04:44:43 UTC, 1 replies.
- [build-test alert] BUILD FAILED Windows 2003 x86: drlvm - posted by no...@intel.com on 2007/08/17 06:39:48 UTC, 2 replies.
- [build-test alert] BUILD FAILED Windows 2003 x86_64: drlvm - posted by no...@intel.com on 2007/08/17 06:42:33 UTC, 1 replies.
- [build-test alert] BUILD FAILED Linux x86: drlvm - posted by no...@intel.com on 2007/08/17 06:44:46 UTC, 1 replies.
- [build-test alert] BUILD FAILED Linux x86_64: drlvm - posted by no...@intel.com on 2007/08/17 06:45:41 UTC, 1 replies.
- [build-test alert] FAILED Windows 2003 x86: hdk debug - posted by no...@intel.com on 2007/08/17 06:56:48 UTC, 0 replies.
- [build-test alert] BUILD PASSED Linux x86_64: drlvm - posted by no...@intel.com on 2007/08/17 07:05:06 UTC, 1 replies.
- [build-test alert] BUILD PASSED Windows 2003 x86: drlvm - posted by no...@intel.com on 2007/08/17 07:07:27 UTC, 2 replies.
- [build-test alert] BUILD PASSED Linux x86: drlvm - posted by no...@intel.com on 2007/08/17 07:11:49 UTC, 1 replies.
- [build-test alert] BUILD PASSED Windows 2003 x86_64: drlvm - posted by no...@intel.com on 2007/08/17 07:20:24 UTC, 1 replies.
- [build-test alert] PASSED Windows 2003 x86: hdk debug - posted by no...@intel.com on 2007/08/17 07:26:54 UTC, 0 replies.
- [build-test alert] FAILED Linux x86: classlib-test - posted by no...@intel.com on 2007/08/17 07:48:19 UTC, 0 replies.
- [build-test alert] FAILED Linux x86: eut33 - posted by no...@intel.com on 2007/08/17 14:56:47 UTC, 0 replies.
- [build-test alert] FAILED Linux x86: hdk_by_hdk - posted by no...@intel.com on 2007/08/17 14:58:20 UTC, 1 replies.
- [build-test alert] FAILED Windows 2003 x86: tptp - posted by no...@intel.com on 2007/08/20 11:23:58 UTC, 3 replies.
- [build-test alert] BUILD FAILED Windows XP SP2 x86: jdktools_test - posted by no...@intel.com on 2007/08/20 13:31:56 UTC, 0 replies.
- [build-test alert] BUILD FAILED win msvc debug: classlib - posted by no...@intel.com on 2007/08/20 13:57:44 UTC, 0 replies.
- [build-test alert] BUILD SUCCEEDED Windows XP SP2 x86: jdktools_test - posted by no...@intel.com on 2007/08/20 15:05:06 UTC, 0 replies.
- [build-test alert] PASSED Windows 2003 x86: classlib-test debug - posted by no...@intel.com on 2007/08/21 01:05:15 UTC, 0 replies.
- [build-test alert] FAILED Linux x86: jdktools-test - posted by no...@intel.com on 2007/08/21 06:13:25 UTC, 1 replies.
- [build-test alert] PASSED Linux x86: dacapo - posted by no...@intel.com on 2007/08/21 06:26:22 UTC, 0 replies.
- [build-test alert] FAILED Windows 2003 x86: hdk_by_hdk - posted by no...@intel.com on 2007/08/21 08:25:37 UTC, 0 replies.
- [build-test alert] FAILED Windows 2003 x86: jdktools-test - posted by no...@intel.com on 2007/08/21 08:42:12 UTC, 2 replies.
- [build-test alert] PASSED Linux x86: hdk_by_hdk - posted by no...@intel.com on 2007/08/21 13:39:44 UTC, 1 replies.
- [build-test alert] PASSED Linux x86: jdktools-test - posted by no...@intel.com on 2007/08/21 14:15:24 UTC, 1 replies.
- [build-test alert] FAILED Windows 2003 x86_64: specjbb2005s - posted by no...@intel.com on 2007/08/21 15:42:07 UTC, 0 replies.
- [build-test alert] FAILED Windows 2003 x86_64: specjvm2007 - posted by no...@intel.com on 2007/08/21 17:03:29 UTC, 1 replies.
- [build-test alert] FAILED Windows 2003 x86_64: specjbb2005 - posted by no...@intel.com on 2007/08/21 19:00:32 UTC, 0 replies.
- [build-test alert] FAILED Linux x86: tomcat-scenario - posted by no...@intel.com on 2007/08/21 20:47:50 UTC, 1 replies.
- [build-test alert] PASSED Linux x86: vtsvm - posted by no...@intel.com on 2007/08/21 20:48:07 UTC, 0 replies.
- [build-test alert] PASSED Linux x86: stress - posted by no...@intel.com on 2007/08/21 20:48:19 UTC, 0 replies.
- [build-test alert] BUILD FAILED Windows 2003 x86: egax48 - posted by no...@intel.com on 2007/08/22 12:21:16 UTC, 0 replies.
- [build-test alert] FAILED Linux x86: jdktools-test debug - posted by no...@intel.com on 2007/08/23 00:32:07 UTC, 1 replies.
- [build-test alert] FAILED Windows 2003 x86: jedit_test - posted by no...@intel.com on 2007/08/23 07:58:25 UTC, 0 replies.
- [build-test alert] FAILED Windows 2003 x86: tomcat-scenario - posted by no...@intel.com on 2007/08/23 08:42:30 UTC, 0 replies.
- [build-test alert] FAILED Linux x86: classlib-test debug - posted by no...@intel.com on 2007/08/23 11:35:30 UTC, 0 replies.
- [build-test alert] FAILED Linux x86: axis2_app - posted by no...@intel.com on 2007/08/23 12:37:20 UTC, 0 replies.
- [build-test alert] PASSED Linux x86_64: drlvm-test debug - posted by no...@intel.com on 2007/08/23 18:56:17 UTC, 1 replies.
- [build-test alert] FAILED Linux x86_64: jdktools-test debug - posted by no...@intel.com on 2007/08/23 19:40:47 UTC, 1 replies.
- [build-test alert] BUILD FAILED Windows 2003 x86_64: classlib-test - posted by no...@intel.com on 2007/08/24 05:29:35 UTC, 0 replies.
- [build-test alert] FAILED Linux x86: ega . (Eclipse x 48h) - posted by no...@intel.com on 2007/08/24 05:43:27 UTC, 3 replies.
- [build-test alert] PASSED Linux x86: jdktools-test debug - posted by no...@intel.com on 2007/08/24 08:03:27 UTC, 0 replies.
- [build-test alert] FAILED Linux x86: classlib - posted by no...@intel.com on 2007/08/24 10:59:28 UTC, 0 replies.
- [build-test alert] FAILED Linux x86_64: classlib - posted by no...@intel.com on 2007/08/24 10:59:47 UTC, 0 replies.
- [build-test alert] FAILED Linux x86_64: hdk debug - posted by no...@intel.com on 2007/08/24 11:45:33 UTC, 0 replies.
- [build-test alert] PASSED Linux x86_64: classlib - posted by no...@intel.com on 2007/08/24 12:28:47 UTC, 0 replies.
- [build-test alert] PASSED Linux x86: classlib - posted by no...@intel.com on 2007/08/24 12:30:24 UTC, 0 replies.
- [build-test alert] PASSED Windows 2003 x86_64: tomcat-scenario - posted by no...@intel.com on 2007/08/24 13:53:05 UTC, 0 replies.
- [build-test alert] FAILED Linux x86_64: drlvm-test debug - posted by no...@intel.com on 2007/08/25 01:56:06 UTC, 1 replies.
- [build-test alert] FAILED Windows 2003 x86: classlib-test - posted by no...@intel.com on 2007/08/27 09:56:27 UTC, 0 replies.
- [build-test alert] PASSED Windows 2003 x86_64: dacapo - posted by no...@intel.com on 2007/08/27 14:08:34 UTC, 0 replies.
- [build-test alert] PASSED Windows 2003 x86: jdktools-test - posted by no...@intel.com on 2007/08/28 12:55:53 UTC, 0 replies.
- [build-test alert] FAILED Linux x86: scimark - posted by no...@intel.com on 2007/08/28 19:12:41 UTC, 0 replies.
- [build-test alert] FAILED Linux x86: ehwa - posted by no...@intel.com on 2007/08/29 08:59:35 UTC, 0 replies.
- [build-test alert] FAILED Linux x86: struts_test - posted by no...@intel.com on 2007/08/29 12:45:14 UTC, 0 replies.
- [build-test alert] FAILED Linux ia64: classlib - posted by no...@intel.com on 2007/08/30 08:36:36 UTC, 2 replies.
- [build-test alert] PASSED Linux ia64: classlib - posted by no...@intel.com on 2007/08/30 11:10:21 UTC, 2 replies.
- [build-test alert] FAILED Windows 2003 x86_64: jdktools-test debug - posted by no...@intel.com on 2007/08/31 00:04:22 UTC, 0 replies.
- [build-test alert] FAILED Windows 2003 x86_64: jdktools-test - posted by no...@intel.com on 2007/08/31 04:38:53 UTC, 3 replies.
- [build-test alert] FAILED Windows 2003 x86_64: struts_test - posted by no...@intel.com on 2007/08/31 09:41:19 UTC, 0 replies.